lucene-dev mailing list archives

Site index · List index
Message view « Date » · « Thread »
Top « Date » · « Thread »
From jenk...@sd-datasolutions.de
Subject Build failed in Jenkins: Lucene-Solr-trunk-Windows-Java7-64 #85
Date Tue, 22 May 2012 11:01:11 GMT
See <http://jenkins.sd-datasolutions.de/job/Lucene-Solr-trunk-Windows-Java7-64/85/>

------------------------------------------
[...truncated 10951 lines...]
   [junit4]   2> 179947 T3012 oas.SolrTestCaseJ4.endTrackingSearchers SEVERE ERROR: SolrIndexSearcher
opens=74 closes=73
   [junit4]   2> NOTE: test params are: codec=Lucene40, sim=RandomSimilarityProvider(queryNorm=false,coord=true):
{}, locale=el_GR, timezone=Asia/Krasnoyarsk
   [junit4]   2> NOTE: Windows 7 6.1 amd64/Oracle Corporation 1.7.0_04 (64-bit)/cpus=2,threads=1,free=83311680,total=287375360
   [junit4]   2> NOTE: All tests run in this JVM: [TestRemoteStreaming, TestDictionaryCompoundWordTokenFilterFactory,
CopyFieldTest, PingRequestHandlerTest, ShowFileRequestHandlerTest, TestJapanesePartOfSpeechStopFilterFactory,
SortByFunctionTest, TestSolrCoreProperties, SpellCheckCollatorTest, TestWikipediaTokenizerFactory,
DistanceFunctionTest, TestQuerySenderNoQuery, TestNorwegianMinimalStemFilterFactory, TestFrenchMinimalStemFilterFactory,
TestGermanMinimalStemFilterFactory, CloudStateUpdateTest, XmlUpdateRequestHandlerTest, StandardRequestHandlerTest,
TestDistributedSearch, TestChineseFilterFactory, SuggesterTSTTest, TestNumberUtils, TestSolrQueryParser,
TestJapaneseBaseFormFilterFactory, TestTurkishLowerCaseFilterFactory, TestOmitPositions, TestGermanStemFilterFactory,
DistributedTermsComponentTest, SpellingQueryConverterTest, SolrCmdDistributorTest, TestWriterPerf,
SolrPluginUtilsTest, TestDefaultSimilarityFactory, TestPortugueseLightStemFilterFactory, DocumentAnalysisRequestHandlerTest,
SimpleFacetsTest, BasicFunctionalityTest, SOLR749Test, TestMultiWordSynonyms, FieldMutatingUpdateProcessorTest,
TestCapitalizationFilterFactory, TestFrenchLightStemFilterFactory, TestNorwegianLightStemFilterFactory,
TestSuggestSpellingConverter, TestBulgarianStemFilterFactory, TestIndexingPerformance, HighlighterTest,
TestReversedWildcardFilterFactory, TestIBSimilarityFactory, OpenExchangeRatesOrgProviderTest,
CoreAdminHandlerTest, TestRussianLightStemFilterFactory, TestJmxIntegration, TestPropInjectDefaults,
PeerSyncTest, TestBinaryField, SuggesterTest, TestWordDelimiterFilterFactory, TestSort, TestTrimFilterFactory,
IndexSchemaRuntimeFieldTest, TestSolrDeletionPolicy1, SolrCoreCheckLockOnStartupTest, RequestHandlersTest,
DateMathParserTest, TestTypeTokenFilterFactory, TestLatvianStemFilterFactory, DirectUpdateHandlerTest,
UpdateParamsTest, LegacyHTMLStripCharFilterTest, TestUAX29URLEmailTokenizerFactory, TestMultiCoreConfBootstrap,
DistributedSpellCheckComponentTest, ConvertedLegacyTest, TestItalianLightStemFilterFactory,
TestGalicianMinimalStemFilterFactory, TestKeepFilterFactory, ZkControllerTest, CloudStateTest,
TestBrazilianStemFilterFactory, UpdateRequestProcessorFactoryTest, TestHTMLStripCharFilterFactory,
PluginInfoTest, TestPerFieldSimilarity, QueryElevationComponentTest, UUIDFieldTest, TestPluginEnable,
SignatureUpdateProcessorFactoryTest, TestCJKWidthFilterFactory, LengthFilterTest, DirectSolrSpellCheckerTest,
TestDFRSimilarityFactory, TestSearchPerf, BasicZkTest, TestHyphenationCompoundWordTokenFilterFactory,
CommonGramsQueryFilterFactoryTest, TestPHPSerializedResponseWriter, TestGalicianStemFilterFactory,
TestBinaryResponseWriter, TestShingleFilterFactory, NodeStateWatcherTest, NoCacheHeaderTest,
TestJapaneseTokenizerFactory, SpellPossibilityIteratorTest, XsltUpdateRequestHandlerTest,
TestCJKBigramFilterFactory, TestBM25SimilarityFactory, FullSolrCloudDistribCmdsTest, TermVectorComponentTest,
SampleTest, JsonLoaderTest, TestCSVResponseWriter, TestBeiderMorseFilterFactory, TestRealTimeGet,
TestThaiWordFilterFactory, ZkSolrClientTest, RecoveryZkTest, TestSolrXMLSerializer, TestNGramFilters,
TestPortugueseMinimalStemFilterFactory, TestBadConfig, TestConfig, TestPseudoReturnFields,
TestKeywordMarkerFilterFactory, FieldAnalysisRequestHandlerTest, TimeZoneUtilsTest, TestCollationKeyRangeQueries,
RAMDirectoryFactoryTest, TestQueryTypes, AutoCommitTest, MultiTermTest, TestGreekLowerCaseFilterFactory,
TestIndonesianStemFilterFactory, TestStopFilterFactory, TestGroupingSearch, OutputWriterTest,
SystemInfoHandlerTest, TestSlowSynonymFilter, DirectUpdateHandlerOptimizeTest, StatsComponentTest,
CurrencyFieldTest, DirectSolrConnectionTest, SolrIndexConfigTest, TestStemmerOverrideFilterFactory,
TestXIncludeConfig, TestFiltering, TestKStemFilterFactory, AlternateDirectoryTest, TestValueSourceCache,
TestPatternReplaceCharFilterFactory, SuggesterFSTTest, NotRequiredUniqueKeyTest, TestPersianNormalizationFilterFactory,
TestCJKTokenizerFactory, TestRandomFaceting, SpellCheckComponentTest, TestRemoveDuplicatesTokenFilterFactory,
PolyFieldTest, TestLRUCache, PrimitiveFieldTypeTest, EchoParamsTest, SuggesterWFSTTest, TestCzechStemFilterFactory,
TestHashPartitioner, TestArbitraryIndexDir, TestReverseStringFilterFactory, TestEnglishMinimalStemFilterFactory,
CSVRequestHandlerTest, TestDelimitedPayloadTokenFilterFactory, TestSolrDeletionPolicy2, SolrRequestParserTest,
TestGermanLightStemFilterFactory, SpatialFilterTest, IndexSchemaTest, SoftAutoCommitTest,
BadIndexSchemaTest, TestLMDirichletSimilarityFactory, TestFastLRUCache, URLClassifyProcessorTest,
FileUtilsTest, TestIndexSearcher, FastVectorHighlighterTest, JSONWriterTest, MoreLikeThisHandlerTest,
TestUpdate, TestHindiFilters, LukeRequestHandlerTest, SolrCoreTest, TestPhraseSuggestions,
MBeansHandlerTest, TestMappingCharFilterFactory, TestLFUCache, TestRangeQuery, TestJoin, TestHunspellStemFilterFactory,
TermsComponentTest, TestSynonymFilterFactory, TestArabicFilters, TestMergePolicyConfig, TestCoreContainer,
TestUtils, TestGreekStemFilterFactory, TestDocSet, TestSpanishLightStemFilterFactory, OverseerTest,
LeaderElectionTest, LeaderElectionIntegrationTest, BasicDistributedZkTest, TestReplicationHandler]
   [junit4]   2> NOTE: reproduce with: ant test -Dtestcase=TestReplicationHandler -Dtests.seed=844C708BB9570D50
-Dtests.locale=el_GR -Dtests.timezone=Asia/Krasnoyarsk -Dargs="-Dfile.encoding=Cp1252"
   [junit4]   2> 
   [junit4] ERROR   0.00s | TestReplicationHandler (suite)
   [junit4]    > Throwable #1: java.lang.AssertionError: ERROR: SolrIndexSearcher opens=74
closes=73
   [junit4]    > 	at __randomizedtesting.SeedInfo.seed([844C708BB9570D50]:0)
   [junit4]    > 	at org.junit.Assert.fail(Assert.java:93)
   [junit4]    > 	at org.apache.solr.SolrTestCaseJ4.endTrackingSearchers(SolrTestCaseJ4.java:185)
   [junit4]    > 	at org.apache.solr.SolrTestCaseJ4.afterClass(SolrTestCaseJ4.java:82)
   [junit4]    > 	at sun.reflect.GeneratedMethodAccessor15.invoke(Unknown Source)
   [junit4]    > 	at sun.reflect.DelegatingMethodAccessorImpl.invoke(DelegatingMethodAccessorImpl.java:43)
   [junit4]    > 	at java.lang.reflect.Method.invoke(Method.java:601)
   [junit4]    > 	at com.carrotsearch.randomizedtesting.RandomizedRunner.invoke(RandomizedRunner.java:1969)
   [junit4]    > 	at com.carrotsearch.randomizedtesting.RandomizedRunner.access$1100(RandomizedRunner.java:132)
   [junit4]    > 	at com.carrotsearch.randomizedtesting.RandomizedRunner$5.evaluate(RandomizedRunner.java:752)
   [junit4]    > 	at com.carrotsearch.randomizedtesting.rules.SystemPropertiesRestoreRule$1.evaluate(SystemPropertiesRestoreRule.java:53)
   [junit4]    > 	at org.apache.lucene.util.AbstractBeforeAfterRule$1.evaluate(AbstractBeforeAfterRule.java:45)
   [junit4]    > 	at org.apache.lucene.util.TestRuleReportUncaughtExceptions$1.evaluate(TestRuleReportUncaughtExceptions.java:68)
   [junit4]    > 	at org.apache.lucene.util.TestRuleStoreClassName$1.evaluate(TestRuleStoreClassName.java:38)
   [junit4]    > 	at org.apache.lucene.util.TestRuleIcuHack$1.evaluate(TestRuleIcuHack.java:51)
   [junit4]    > 	at com.carrotsearch.randomizedtesting.rules.SystemPropertiesInvariantRule$1.evaluate(SystemPropertiesInvariantRule.java:55)
   [junit4]    > 	at org.apache.lucene.util.TestRuleNoInstanceHooksOverrides$1.evaluate(TestRuleNoInstanceHooksOverrides.java:53)
   [junit4]    > 	at org.apache.lucene.util.TestRuleNoStaticHooksShadowing$1.evaluate(TestRuleNoStaticHooksShadowing.java:52)
   [junit4]    > 	at org.apache.lucene.util.TestRuleAssertionsRequired$1.evaluate(TestRuleAssertionsRequired.java:36)
   [junit4]    > 	at org.apache.lucene.util.TestRuleMarkFailure$1.evaluate(TestRuleMarkFailure.java:48)
   [junit4]    > 	at org.apache.lucene.util.TestRuleIgnoreTestSuites$1.evaluate(TestRuleIgnoreTestSuites.java:56)
   [junit4]    > 	at com.carrotsearch.randomizedtesting.RandomizedRunner.runSuite(RandomizedRunner.java:605)
   [junit4]    > 	at com.carrotsearch.randomizedtesting.RandomizedRunner.access$400(RandomizedRunner.java:132)
   [junit4]    > 	at com.carrotsearch.randomizedtesting.RandomizedRunner$2.run(RandomizedRunner.java:551)
   [junit4]    >
   [junit4] Completed in 179.97s, 1 test, 1 failure <<< FAILURES!
   [junit4]  
   [junit4] Suite: org.apache.solr.analysis.TestPhoneticFilterFactory
   [junit4] Completed in 9.51s, 5 tests
   [junit4]  
   [junit4] Suite: org.apache.solr.TestDistributedGrouping
   [junit4] Completed in 19.18s, 1 test
   [junit4]  
   [junit4] Suite: org.apache.solr.search.TestRecovery
   [junit4] Completed in 11.52s, 9 tests
   [junit4]  
   [junit4] Suite: org.apache.solr.request.TestFaceting
   [junit4] Completed in 14.69s, 3 tests
   [junit4]  
   [junit4] Suite: org.apache.solr.search.function.TestFunctionQuery
   [junit4] Completed in 3.45s, 14 tests
   [junit4]  
   [junit4] Suite: org.apache.solr.handler.component.DistributedQueryElevationComponentTest
   [junit4] Completed in 5.52s, 1 test
   [junit4]  
   [junit4] Suite: org.apache.solr.TestTrie
   [junit4] Completed in 2.35s, 8 tests
   [junit4]  
   [junit4] Suite: org.apache.solr.SolrInfoMBeanTest
   [junit4] Completed in 1.28s, 1 test
   [junit4]  
   [junit4] Suite: org.apache.solr.spelling.IndexBasedSpellCheckerTest
   [junit4] Completed in 2.40s, 5 tests
   [junit4]  
   [junit4] Suite: org.apache.solr.search.TestSurroundQueryParser
   [junit4] Completed in 1.70s, 1 test
   [junit4]  
   [junit4] Suite: org.apache.solr.update.processor.UniqFieldsUpdateProcessorFactoryTest
   [junit4] Completed in 1.69s, 1 test
   [junit4]  
   [junit4] Suite: org.apache.solr.update.DocumentBuilderTest
   [junit4] Completed in 1.65s, 11 tests
   [junit4]  
   [junit4] Suite: org.apache.solr.servlet.CacheHeaderTest
   [junit4] Completed in 1.79s, 5 tests
   [junit4]  
   [junit4] Suite: org.apache.solr.core.TestPropInject
   [junit4] Completed in 2.61s, 2 tests
   [junit4]  
   [junit4] Suite: org.apache.solr.search.TestFoldingMultitermQuery
   [junit4] Completed in 2.13s, 18 tests
   [junit4]  
   [junit4] Suite: org.apache.solr.handler.TestCSVLoader
   [junit4] Completed in 2.40s, 5 tests
   [junit4]  
   [junit4] Suite: org.apache.solr.handler.component.DebugComponentTest
   [junit4] Completed in 1.77s, 2 tests
   [junit4]  
   [junit4] Suite: org.apache.solr.spelling.FileBasedSpellCheckerTest
   [junit4] Completed in 2.27s, 3 tests
   [junit4]  
   [junit4] Suite: org.apache.solr.search.TestQueryUtils
   [junit4] Completed in 2.40s, 1 test
   [junit4]  
   [junit4] Suite: org.apache.solr.handler.component.BadComponentTest
   [junit4] Completed in 1.24s, 1 test
   [junit4]  
   [junit4] Suite: org.apache.solr.DisMaxRequestHandlerTest
   [junit4] Completed in 1.96s, 3 tests
   [junit4]  
   [junit4] Suite: org.apache.solr.schema.RequiredFieldsTest
   [junit4] Completed in 1.59s, 3 tests
   [junit4]  
   [junit4] Suite: org.apache.solr.core.IndexReaderFactoryTest
   [junit4] Completed in 1.46s, 1 test
   [junit4]  
   [junit4] Suite: org.apache.solr.highlight.HighlighterConfigTest
   [junit4] Completed in 1.75s, 1 test
   [junit4]  
   [junit4] Suite: org.apache.solr.search.TestExtendedDismaxParser
   [junit4] Completed in 13.55s, 8 tests
   [junit4]  
   [junit4] Suite: org.apache.solr.handler.BinaryUpdateRequestHandlerTest
   [junit4] Completed in 1.44s, 1 test
   [junit4]  
   [junit4] Suite: org.apache.solr.schema.TestCollationField
   [junit4] Completed in 0.86s, 8 tests
   [junit4]  
   [junit4] Suite: org.apache.solr.search.QueryParsingTest
   [junit4] Completed in 1.28s, 3 tests
   [junit4]  
   [junit4] Suite: org.apache.solr.handler.component.SearchHandlerTest
   [junit4] Completed in 1.45s, 1 test
   [junit4]  
   [junit4] Suite: org.apache.solr.search.ReturnFieldsTest
   [junit4] Completed in 1.52s, 10 tests
   [junit4]  
   [junit4] Suite: org.apache.solr.core.TestQuerySenderListener
   [junit4] Completed in 1.47s, 3 tests
   [junit4]  
   [junit4] Suite: org.apache.solr.schema.NumericFieldsTest
   [junit4] Completed in 1.10s, 1 test
   [junit4]  
   [junit4] Suite: org.apache.solr.core.TestJmxMonitoredMap
   [junit4] Completed in 0.33s, 2 tests
   [junit4]  
   [junit4] Suite: org.apache.solr.MinimalSchemaTest
   [junit4] Completed in 0.53s, 3 tests
   [junit4]  
   [junit4] Suite: org.apache.solr.analysis.TestLuceneMatchVersion
   [junit4] Completed in 0.47s, 1 test
   [junit4]  
   [junit4] Suite: org.apache.solr.analysis.TestCollationKeyFilterFactory
   [junit4] Completed in 0.04s, 5 tests
   [junit4]  
   [junit4] Suite: org.apache.solr.core.TestCodecSupport
   [junit4] Completed in 0.25s, 3 tests
   [junit4]  
   [junit4] Suite: org.apache.solr.search.similarities.TestLMJelinekMercerSimilarityFactory
   [junit4] Completed in 0.29s, 2 tests
   [junit4]  
   [junit4] Suite: org.apache.solr.util.PrimUtilsTest
   [junit4] Completed in 0.18s, 2 tests
   [junit4]  
   [junit4] Suite: org.apache.solr.core.ResourceLoaderTest
   [junit4] Completed in 0.04s, 4 tests
   [junit4]  
   [junit4] Suite: org.apache.solr.analysis.TestStandardFactories
   [junit4] Completed in 0.06s, 10 tests
   [junit4]  
   [junit4] Suite: org.apache.solr.schema.DateFieldTest
   [junit4] IGNORED 0.00s | DateFieldTest.testRoundTripNonPositiveYear
   [junit4]    > Cause: Annotated @Ignore(SOLR-2773: Non-Positive years don't work)
   [junit4] Completed in 0.03s, 8 tests, 1 skipped
   [junit4]  
   [junit4] Suite: org.apache.solr.analysis.TestPortugueseStemFilterFactory
   [junit4] Completed in 0.02s, 1 test
   [junit4]  
   [junit4] Suite: org.apache.solr.util.TestSystemIdResolver
   [junit4] Completed in 0.02s, 1 test
   [junit4]  
   [junit4] Suite: org.apache.solr.analysis.CommonGramsFilterFactoryTest
   [junit4] Completed in 0.02s, 2 tests
   [junit4]  
   [junit4] Suite: org.apache.solr.analysis.SnowballPorterFilterFactoryTest
   [junit4] Completed in 0.02s, 2 tests
   [junit4]  
   [junit4] Suite: org.apache.solr.cloud.ZkNodePropsTest
   [junit4] Completed in 0.01s, 1 test
   [junit4]  
   [junit4] Suite: org.apache.solr.analysis.DoubleMetaphoneFilterFactoryTest
   [junit4] Completed in 0.09s, 3 tests
   [junit4]  
   [junit4] Suite: org.apache.solr.util.DOMUtilTest
   [junit4] Completed in 0.04s, 1 test
   [junit4]  
   [junit4] Suite: org.apache.solr.analysis.TestElisionFilterFactory
   [junit4] Completed in 0.02s, 3 tests
   [junit4]  
   [junit4] Suite: org.apache.solr.analysis.TestSwedishLightStemFilterFactory
   [junit4] Completed in 0.01s, 1 test
   [junit4]  
   [junit4] Suite: org.apache.solr.analysis.TestSynonymMap
   [junit4] Completed in 0.04s, 6 tests
   [junit4]  
   [junit4] Suite: org.apache.solr.analysis.TestHungarianLightStemFilterFactory
   [junit4] Completed in 0.09s, 1 test
   [junit4]  
   [junit4] Suite: org.apache.solr.analysis.TestChineseTokenizerFactory
   [junit4] Completed in 0.02s, 1 test
   [junit4]  
   [junit4] Suite: org.apache.solr.analysis.TestFinnishLightStemFilterFactory
   [junit4] Completed in 0.02s, 1 test
   [junit4]  
   [junit4] Suite: org.apache.solr.analysis.TestPatternReplaceFilterFactory
   [junit4] Completed in 0.01s, 1 test
   [junit4]  
   [junit4] Suite: org.apache.solr.analysis.TestPorterStemFilterFactory
   [junit4] Completed in 0.01s, 1 test
   [junit4]  
   [junit4] Suite: org.apache.solr.analysis.TestIrishLowerCaseFilterFactory
   [junit4] Completed in 0.01s, 1 test
   [junit4]  
   [junit4] Suite: org.apache.solr.analysis.TestPatternTokenizerFactory
   [junit4] Completed in 0.02s, 1 test
   [junit4]  
   [junit4] Suite: org.apache.solr.internal.csv.writer.CSVConfigGuesserTest
   [junit4] Completed in 0.01s, 3 tests
   [junit4]  
   [junit4] Suite: org.apache.solr.internal.csv.writer.CSVConfigTest
   [junit4] Completed in 0.02s, 7 tests
   [junit4]  
   [junit4] Suite: org.apache.solr.analysis.TestRussianFilters
   [junit4] Completed in 0.02s, 1 test
   [junit4]  
   [junit4] Suite: org.apache.solr.analysis.TestGermanNormalizationFilterFactory
   [junit4] Completed in 0.01s, 1 test
   [junit4]  
   [junit4] Suite: org.apache.solr.internal.csv.writer.CSVFieldTest
   [junit4] Completed in 0.01s, 2 tests
   [junit4]  
   [junit4] Suite: org.apache.solr.cloud.FullSolrCloudTest
   [junit4] Completed in 0.00s, 0 tests
   [junit4]  
   [junit4] Suite: org.apache.solr.handler.admin.LoggingHandlerTest
   [junit4] Completed in 1.65s, 1 test
   [junit4]  
   [junit4] JVM J0:     1.44 ..  1078.02 =  1076.58s
   [junit4] Execution time total: 17 minutes 58 seconds
   [junit4] Tests summary: 286 suites, 969 tests, 1 suite-level error, 10 ignored (5 assumptions)

BUILD FAILED
<http://jenkins.sd-datasolutions.de/job/Lucene-Solr-trunk-Windows-Java7-64/ws/build.xml>:29:
The following error occurred while executing this line:
<http://jenkins.sd-datasolutions.de/job/Lucene-Solr-trunk-Windows-Java7-64/ws/solr\build.xml>:144:
The following error occurred while executing this line:
<http://jenkins.sd-datasolutions.de/job/Lucene-Solr-trunk-Windows-Java7-64/ws/lucene\module-build.xml>:62:
The following error occurred while executing this line:
<http://jenkins.sd-datasolutions.de/job/Lucene-Solr-trunk-Windows-Java7-64/ws/lucene\common-build.xml>:1019:
The following error occurred while executing this line:
<http://jenkins.sd-datasolutions.de/job/Lucene-Solr-trunk-Windows-Java7-64/ws/lucene\common-build.xml>:745:
There were test failures: 286 suites, 969 tests, 1 suite-level error, 10 ignored (5 assumptions)

Total time: 37 minutes 40 seconds
Build step 'Invoke Ant' marked build as failure
Recording test results

---------------------------------------------------------------------
To unsubscribe, e-mail: dev-unsubscribe@lucene.apache.org
For additional commands, e-mail: dev-help@lucene.apache.org


Mime
View raw message