lucene-dev mailing list archives

Site index · List index
Message view « Date » · « Thread »
Top « Date » · « Thread »
From jenk...@sd-datasolutions.de
Subject Build failed in Jenkins: Windows-Lucene-Solr-tests-only-trunk #40
Date Thu, 17 May 2012 17:53:09 GMT
See <http://jenkins.sd-datasolutions.de/job/Windows-Lucene-Solr-tests-only-trunk/40/changes>

Changes:

[markrmiller] SOLR-3460: Improve cmd line config bootstrap tool so that it now reads solr.xml
and uploads configs for each SolrCore found

[yonik] SOLR-2824: add fromSearcher open time to JoinQuery for caching

------------------------------------------
[...truncated 10052 lines...]
   [junit4] Completed in 7.34s, 2 tests
   [junit4]  
   [junit4] Suite: org.apache.solr.ConvertedLegacyTest
   [junit4] Completed in 4.94s, 1 test
   [junit4]  
   [junit4] Suite: org.apache.solr.core.SolrCoreTest
   [junit4] Completed in 6.52s, 5 tests
   [junit4]  
   [junit4] Suite: org.apache.solr.servlet.SolrRequestParserTest
   [junit4] Completed in 1.86s, 4 tests
   [junit4]  
   [junit4] Suite: org.apache.solr.handler.StandardRequestHandlerTest
   [junit4] Completed in 1.16s, 1 test
   [junit4]  
   [junit4] Suite: org.apache.solr.BasicFunctionalityTest
   [junit4] IGNORED 0.00s | BasicFunctionalityTest.testDeepPaging
   [junit4]    > Cause: Annotated @Ignore(See SOLR-1726)
   [junit4] Completed in 3.14s, 23 tests, 1 skipped
   [junit4]  
   [junit4] Suite: org.apache.solr.update.SolrCmdDistributorTest
   [junit4] Completed in 1.78s, 1 test
   [junit4]  
   [junit4] Suite: org.apache.solr.spelling.IndexBasedSpellCheckerTest
   [junit4] Completed in 1.03s, 5 tests
   [junit4]  
   [junit4] Suite: org.apache.solr.handler.admin.LukeRequestHandlerTest
   [junit4] Completed in 2.42s, 3 tests
   [junit4]  
   [junit4] Suite: org.apache.solr.update.processor.SignatureUpdateProcessorFactoryTest
   [junit4] Completed in 1.44s, 6 tests
   [junit4]  
   [junit4] Suite: org.apache.solr.search.similarities.TestLMDirichletSimilarityFactory
   [junit4] Completed in 0.15s, 2 tests
   [junit4]  
   [junit4] Suite: org.apache.solr.search.function.SortByFunctionTest
   [junit4] Completed in 1.58s, 2 tests
   [junit4]  
   [junit4] Suite: org.apache.solr.spelling.SpellCheckCollatorTest
   [junit4] Completed in 0.95s, 5 tests
   [junit4]  
   [junit4] Suite: org.apache.solr.search.SpatialFilterTest
   [junit4] Completed in 1.40s, 3 tests
   [junit4]  
   [junit4] Suite: org.apache.solr.spelling.suggest.SuggesterWFSTTest
   [junit4] Completed in 1.12s, 4 tests
   [junit4]  
   [junit4] Suite: org.apache.solr.schema.CopyFieldTest
   [junit4] Completed in 0.58s, 6 tests
   [junit4]  
   [junit4] Suite: org.apache.solr.core.TestSolrDeletionPolicy1
   [junit4]    > (@BeforeClass output)
   [junit4]   2> Creating dataDir: <http://jenkins.sd-datasolutions.de/job/Windows-Lucene-Solr-tests-only-trunk/ws/solr\build\solr-core\test\J0\.\solrtest-TestSolrDeletionPolicy1-1337277137986>
   [junit4]   2> 
   [junit4] FAILURE 0.20s | TestSolrDeletionPolicy1.testCommitAge
   [junit4]    > Throwable #1: java.lang.AssertionError
   [junit4]    > 	at __randomizedtesting.SeedInfo.seed([4CA1AD1815CEB653:F91F33845497E353]:0)
   [junit4]    > 	at org.junit.Assert.fail(Assert.java:92)
   [junit4]    > 	at org.junit.Assert.assertTrue(Assert.java:43)
   [junit4]    > 	at org.junit.Assert.assertTrue(Assert.java:54)
   [junit4]    > 	at org.apache.solr.core.TestSolrDeletionPolicy1.testCommitAge(TestSolrDeletionPolicy1.java:129)
   [junit4]    > 	at sun.reflect.NativeMethodAccessorImpl.invoke0(Native Method)
   [junit4]    > 	at sun.reflect.NativeMethodAccessorImpl.invoke(NativeMethodAccessorImpl.java:39)
   [junit4]    > 	at sun.reflect.DelegatingMethodAccessorImpl.invoke(DelegatingMethodAccessorImpl.java:25)
   [junit4]    > 	at java.lang.reflect.Method.invoke(Method.java:597)
   [junit4]    > 	at com.carrotsearch.randomizedtesting.RandomizedRunner.invoke(RandomizedRunner.java:1969)
   [junit4]    > 	at com.carrotsearch.randomizedtesting.RandomizedRunner.access$1100(RandomizedRunner.java:132)
   [junit4]    > 	at com.carrotsearch.randomizedtesting.RandomizedRunner$6.evaluate(RandomizedRunner.java:814)
   [junit4]    > 	at com.carrotsearch.randomizedtesting.RandomizedRunner$7.evaluate(RandomizedRunner.java:875)
   [junit4]    > 	at com.carrotsearch.randomizedtesting.RandomizedRunner$8.evaluate(RandomizedRunner.java:889)
   [junit4]    > 	at com.carrotsearch.randomizedtesting.rules.SystemPropertiesRestoreRule$1.evaluate(SystemPropertiesRestoreRule.java:53)
   [junit4]    > 	at org.apache.lucene.util.TestRuleSetupTeardownChained$1.evaluate(TestRuleSetupTeardownChained.java:50)
   [junit4]    > 	at org.apache.lucene.util.TestRuleFieldCacheSanity$1.evaluate(TestRuleFieldCacheSanity.java:32)
   [junit4]    > 	at org.apache.lucene.util.AbstractBeforeAfterRule$1.evaluate(AbstractBeforeAfterRule.java:45)
   [junit4]    > 	at com.carrotsearch.randomizedtesting.rules.SystemPropertiesInvariantRule$1.evaluate(SystemPropertiesInvariantRule.java:55)
   [junit4]    > 	at org.apache.lucene.util.TestRuleReportUncaughtExceptions$1.evaluate(TestRuleReportUncaughtExceptions.java:68)
   [junit4]    > 	at org.apache.lucene.util.TestRuleThreadAndTestName$1.evaluate(TestRuleThreadAndTestName.java:48)
   [junit4]    > 	at org.apache.lucene.util.TestRuleMarkFailure$1.evaluate(TestRuleMarkFailure.java:48)
   [junit4]    > 	at com.carrotsearch.randomizedtesting.RandomizedRunner.runSingleTest(RandomizedRunner.java:821)
   [junit4]    > 	at com.carrotsearch.randomizedtesting.RandomizedRunner.access$700(RandomizedRunner.java:132)
   [junit4]    > 	at com.carrotsearch.randomizedtesting.RandomizedRunner$3$1.run(RandomizedRunner.java:669)
   [junit4]    > 	at com.carrotsearch.randomizedtesting.RandomizedRunner$3.evaluate(RandomizedRunner.java:695)
   [junit4]    > 	at com.carrotsearch.randomizedtesting.RandomizedRunner$4.evaluate(RandomizedRunner.java:734)
   [junit4]    > 	at com.carrotsearch.randomizedtesting.RandomizedRunner$5.evaluate(RandomizedRunner.java:745)
   [junit4]    > 	at com.carrotsearch.randomizedtesting.rules.SystemPropertiesRestoreRule$1.evaluate(SystemPropertiesRestoreRule.java:53)
   [junit4]    > 	at org.apache.lucene.util.AbstractBeforeAfterRule$1.evaluate(AbstractBeforeAfterRule.java:45)
   [junit4]    > 	at org.apache.lucene.util.TestRuleReportUncaughtExceptions$1.evaluate(TestRuleReportUncaughtExceptions.java:68)
   [junit4]    > 	at org.apache.lucene.util.TestRuleStoreClassName$1.evaluate(TestRuleStoreClassName.java:38)
   [junit4]    > 	at org.apache.lucene.util.TestRuleIcuHack$1.evaluate(TestRuleIcuHack.java:51)
   [junit4]    > 	at com.carrotsearch.randomizedtesting.rules.SystemPropertiesInvariantRule$1.evaluate(SystemPropertiesInvariantRule.java:55)
   [junit4]    > 	at org.apache.lucene.util.TestRuleNoInstanceHooksOverrides$1.evaluate(TestRuleNoInstanceHooksOverrides.java:53)
   [junit4]    > 	at org.apache.lucene.util.TestRuleNoStaticHooksShadowing$1.evaluate(TestRuleNoStaticHooksShadowing.java:52)
   [junit4]    > 	at org.apache.lucene.util.TestRuleAssertionsRequired$1.evaluate(TestRuleAssertionsRequired.java:36)
   [junit4]    > 	at org.apache.lucene.util.TestRuleMarkFailure$1.evaluate(TestRuleMarkFailure.java:48)
   [junit4]    > 	at com.carrotsearch.randomizedtesting.RandomizedRunner.runSuite(RandomizedRunner.java:605)
   [junit4]    > 	at com.carrotsearch.randomizedtesting.RandomizedRunner.access$400(RandomizedRunner.java:132)
   [junit4]    > 	at com.carrotsearch.randomizedtesting.RandomizedRunner$2.run(RandomizedRunner.java:551)
   [junit4]    > 
   [junit4]   2> NOTE: reproduce with: ant test -Dtestcase=TestSolrDeletionPolicy1 -Dtests.method=testCommitAge
-Dtests.seed=4CA1AD1815CEB653 -Dtests.locale=ko -Dtests.timezone=America/Nipigon -Dargs="-Dfile.encoding=Cp1252"
   [junit4]   2>
   [junit4]    > (@AfterClass output)
   [junit4]   2> NOTE: test params are: codec=Lucene40, sim=DefaultSimilarity, locale=ko,
timezone=America/Nipigon
   [junit4]   2> NOTE: Windows 7 6.1 amd64/Sun Microsystems Inc. 1.6.0_32 (64-bit)/cpus=2,threads=1,free=159912872,total=251920384
   [junit4]   2> NOTE: All tests run in this JVM: [CloudStateTest, TestPersianNormalizationFilterFactory,
CloudStateUpdateTest, LeaderElectionIntegrationTest, TestKStemFilterFactory, TestRussianLightStemFilterFactory,
FastVectorHighlighterTest, XsltUpdateRequestHandlerTest, TestIndexingPerformance, CoreAdminHandlerTest,
AutoCommitTest, TestPhraseSuggestions, DistributedTermsComponentTest, SpellingQueryConverterTest,
SpellPossibilityIteratorTest, TestStemmerOverrideFilterFactory, SuggesterTSTTest, TestQueryTypes,
SOLR749Test, MoreLikeThisHandlerTest, TestPorterStemFilterFactory, DocumentAnalysisRequestHandlerTest,
TestJmxIntegration, TestRandomFaceting, TestWriterPerf, TestLatvianStemFilterFactory, PeerSyncTest,
TestItalianLightStemFilterFactory, TestPatternReplaceCharFilterFactory, XmlUpdateRequestHandlerTest,
OutputWriterTest, TestGalicianMinimalStemFilterFactory, TimeZoneUtilsTest, TestFoldingMultitermQuery,
TestConfig, TestFiltering, TestChineseTokenizerFactory, TestBinaryField, DistributedQueryElevationComponentTest,
TestGroupingSearch, TestLuceneMatchVersion, TestRecovery, TestFrenchLightStemFilterFactory,
TestSolrDeletionPolicy2, TestIBSimilarityFactory, TestHyphenationCompoundWordTokenFilterFactory,
LegacyHTMLStripCharFilterTest, PingRequestHandlerTest, MinimalSchemaTest, TestPropInject,
TestRussianFilters, SystemInfoHandlerTest, StatsComponentTest, TestBadConfig, TestDocSet,
TestPluginEnable, TestBinaryResponseWriter, TestPHPSerializedResponseWriter, TestPseudoReturnFields,
TestJapaneseTokenizerFactory, TestSynonymFilterFactory, TestUAX29URLEmailTokenizerFactory,
TestRemoteStreaming, NotRequiredUniqueKeyTest, TestGermanMinimalStemFilterFactory, TestFunctionQuery,
TestChineseFilterFactory, TestGermanLightStemFilterFactory, CurrencyFieldTest, TestMergePolicyConfig,
SolrIndexConfigTest, ZkControllerTest, TestHunspellStemFilterFactory, TestTrie, RequiredFieldsTest,
DirectUpdateHandlerOptimizeTest, RequestHandlersTest, TestRemoveDuplicatesTokenFilterFactory,
CSVRequestHandlerTest, TestElisionFilterFactory, TestIndexSearcher, TestArabicFilters, TestArbitraryIndexDir,
TermVectorComponentTest, TestDefaultSimilarityFactory, DateFieldTest, DirectSolrSpellCheckerTest,
TestNGramFilters, TestMappingCharFilterFactory, TestRealTimeGet, TestHindiFilters, TestReverseStringFilterFactory,
LengthFilterTest, RAMDirectoryFactoryTest, TestShingleFilterFactory, TestStandardFactories,
TestDFRSimilarityFactory, PrimitiveFieldTypeTest, BadComponentTest, HighlighterTest, SuggesterTest,
SampleTest, TestKeywordMarkerFilterFactory, DOMUtilTest, TestGreekLowerCaseFilterFactory,
SuggesterFSTTest, TestReversedWildcardFilterFactory, TestJmxMonitoredMap, TestNumberUtils,
TestSolrXMLSerializer, TestFrenchMinimalStemFilterFactory, TestOmitPositions, TestJoin, PrimUtilsTest,
NoCacheHeaderTest, TestHashPartitioner, TestStopFilterFactory, TestCJKWidthFilterFactory,
TestNorwegianMinimalStemFilterFactory, TestPatternReplaceFilterFactory, TestJapaneseBaseFormFilterFactory,
TestTypeTokenFilterFactory, TestMultiWordSynonyms, TestBeiderMorseFilterFactory, LeaderElectionTest,
PolyFieldTest, BasicDistributedZkTest, TestSynonymMap, DirectSolrConnectionTest, HighlighterConfigTest,
TestXIncludeConfig, TestCoreContainer, TestBM25SimilarityFactory, TestCSVLoader, SolrCoreCheckLockOnStartupTest,
ZkSolrClientTest, TestCapitalizationFilterFactory, DocumentBuilderTest, DoubleMetaphoneFilterFactoryTest,
QueryElevationComponentTest, TestIndonesianStemFilterFactory, TestGreekStemFilterFactory,
BasicZkTest, TestKeepFilterFactory, SolrInfoMBeanTest, BadIndexSchemaTest, TestPortugueseMinimalStemFilterFactory,
TestHTMLStripCharFilterFactory, TestQuerySenderNoQuery, IndexSchemaTest, TestMultiCoreConfBootstrap,
TestSearchPerf, TestPatternTokenizerFactory, LoggingHandlerTest, TestExtendedDismaxParser,
TestCollationKeyRangeQueries, DistanceFunctionTest, TestNorwegianLightStemFilterFactory, TestUpdate,
TestBrazilianStemFilterFactory, BinaryUpdateRequestHandlerTest, ShowFileRequestHandlerTest,
JSONWriterTest, TestThaiWordFilterFactory, CacheHeaderTest, TestDelimitedPayloadTokenFilterFactory,
UniqFieldsUpdateProcessorFactoryTest, TestJapanesePartOfSpeechStopFilterFactory, TestSlowSynonymFilter,
TermsComponentTest, TestEnglishMinimalStemFilterFactory, CommonGramsQueryFilterFactoryTest,
TestWordDelimiterFilterFactory, IndexReaderFactoryTest, QueryParsingTest, ZkNodePropsTest,
TestFastLRUCache, TestBulgarianStemFilterFactory, DateMathParserTest, TestCSVResponseWriter,
TestPortugueseStemFilterFactory, SoftAutoCommitTest, TestCJKTokenizerFactory, TestSuggestSpellingConverter,
UUIDFieldTest, TestCodecSupport, FieldMutatingUpdateProcessorTest, FieldAnalysisRequestHandlerTest,
TestLRUCache, TestUtils, TestPerFieldSimilarity, UpdateRequestProcessorFactoryTest, TestGermanNormalizationFilterFactory,
DistributedSpellCheckComponentTest, TestSolrQueryParser, SolrPluginUtilsTest, SnowballPorterFilterFactoryTest,
TestSurroundQueryParser, TestPhoneticFilterFactory, TestSolrCoreProperties, CommonGramsFilterFactoryTest,
SpellCheckComponentTest, FullSolrCloudDistribCmdsTest, OverseerTest, RecoveryZkTest, NodeStateWatcherTest,
TestReplicationHandler, TestDistributedSearch, TestDistributedGrouping, TestFaceting, SimpleFacetsTest,
DirectUpdateHandlerTest, TestRangeQuery, TestSort, ConvertedLegacyTest, SolrCoreTest, SolrRequestParserTest,
StandardRequestHandlerTest, BasicFunctionalityTest, SolrCmdDistributorTest, IndexBasedSpellCheckerTest,
LukeRequestHandlerTest, SignatureUpdateProcessorFactoryTest, TestLMDirichletSimilarityFactory,
SortByFunctionTest, SpellCheckCollatorTest, SpatialFilterTest, SuggesterWFSTTest, CopyFieldTest,
TestSolrDeletionPolicy1]
   [junit4]   2> 
   [junit4] Completed in 1.12s, 3 tests, 1 failure <<< FAILURES!
   [junit4]  
   [junit4] Suite: org.apache.solr.handler.component.DebugComponentTest
   [junit4] Completed in 0.93s, 2 tests
   [junit4]  
   [junit4] Suite: org.apache.solr.spelling.FileBasedSpellCheckerTest
   [junit4] Completed in 0.99s, 3 tests
   [junit4]  
   [junit4] Suite: org.apache.solr.search.TestQueryUtils
   [junit4] Completed in 1.25s, 1 test
   [junit4]  
   [junit4] Suite: org.apache.solr.search.TestValueSourceCache
   [junit4] Completed in 0.97s, 2 tests
   [junit4]  
   [junit4] Suite: org.apache.solr.DisMaxRequestHandlerTest
   [junit4] Completed in 1.60s, 3 tests
   [junit4]  
   [junit4] Suite: org.apache.solr.handler.JsonLoaderTest
   [junit4] Completed in 1.04s, 5 tests
   [junit4]  
   [junit4] Suite: org.apache.solr.schema.TestCollationField
   [junit4] Completed in 0.48s, 8 tests
   [junit4]  
   [junit4] Suite: org.apache.solr.core.TestPropInjectDefaults
   [junit4] Completed in 0.87s, 2 tests
   [junit4]  
   [junit4] Suite: org.apache.solr.schema.IndexSchemaRuntimeFieldTest
   [junit4] Completed in 1.14s, 1 test
   [junit4]  
   [junit4] Suite: org.apache.solr.handler.component.SearchHandlerTest
   [junit4] Completed in 1.63s, 1 test
   [junit4]  
   [junit4] Suite: org.apache.solr.core.AlternateDirectoryTest
   [junit4] Completed in 1.95s, 1 test
   [junit4]  
   [junit4] Suite: org.apache.solr.handler.admin.MBeansHandlerTest
   [junit4] Completed in 2.40s, 1 test
   [junit4]  
   [junit4] Suite: org.apache.solr.update.UpdateParamsTest
   [junit4] Completed in 2.58s, 1 test
   [junit4]  
   [junit4] Suite: org.apache.solr.schema.MultiTermTest
   [junit4] Completed in 1.24s, 3 tests
   [junit4]  
   [junit4] Suite: org.apache.solr.search.ReturnFieldsTest
   [junit4] Completed in 3.11s, 10 tests
   [junit4]  
   [junit4] Suite: org.apache.solr.search.TestLFUCache
   [junit4] Completed in 1.16s, 5 tests
   [junit4]  
   [junit4] Suite: org.apache.solr.core.TestQuerySenderListener
   [junit4] Completed in 1.22s, 3 tests
   [junit4]  
   [junit4] Suite: org.apache.solr.schema.NumericFieldsTest
   [junit4] Completed in 0.75s, 1 test
   [junit4]  
   [junit4] Suite: org.apache.solr.analysis.TestCollationKeyFilterFactory
   [junit4] Completed in 0.05s, 5 tests
   [junit4]  
   [junit4] Suite: org.apache.solr.EchoParamsTest
   [junit4] Completed in 0.22s, 1 test
   [junit4]  
   [junit4] Suite: org.apache.solr.search.similarities.TestLMJelinekMercerSimilarityFactory
   [junit4] Completed in 0.20s, 2 tests
   [junit4]  
   [junit4] Suite: org.apache.solr.update.processor.URLClassifyProcessorTest
   [junit4] Completed in 0.08s, 7 tests
   [junit4]  
   [junit4] Suite: org.apache.solr.core.PluginInfoTest
   [junit4] Completed in 0.10s, 9 tests
   [junit4]  
   [junit4] Suite: org.apache.solr.core.ResourceLoaderTest
   [junit4] Completed in 0.02s, 4 tests
   [junit4]  
   [junit4] Suite: org.apache.solr.analysis.TestGalicianStemFilterFactory
   [junit4] Completed in 0.02s, 1 test
   [junit4]  
   [junit4] Suite: org.apache.solr.schema.OpenExchangeRatesOrgProviderTest
   [junit4] Completed in 0.04s, 5 tests
   [junit4]  
   [junit4] Suite: org.apache.solr.util.TestSystemIdResolver
   [junit4] Completed in 0.01s, 1 test
   [junit4]  
   [junit4] Suite: org.apache.solr.analysis.TestPortugueseLightStemFilterFactory
   [junit4] Completed in 0.01s, 1 test
   [junit4]  
   [junit4] Suite: org.apache.solr.analysis.TestSwedishLightStemFilterFactory
   [junit4] Completed in 0.02s, 1 test
   [junit4]  
   [junit4] Suite: org.apache.solr.analysis.TestDictionaryCompoundWordTokenFilterFactory
   [junit4] Completed in 0.02s, 1 test
   [junit4]  
   [junit4] Suite: org.apache.solr.analysis.TestHungarianLightStemFilterFactory
   [junit4] Completed in 0.02s, 1 test
   [junit4]  
   [junit4] Suite: org.apache.solr.analysis.TestWikipediaTokenizerFactory
   [junit4] Completed in 0.02s, 1 test
   [junit4]  
   [junit4] Suite: org.apache.solr.analysis.TestFinnishLightStemFilterFactory
   [junit4] Completed in 0.02s, 1 test
   [junit4]  
   [junit4] Suite: org.apache.solr.analysis.TestIrishLowerCaseFilterFactory
   [junit4] Completed in 0.01s, 1 test
   [junit4]  
   [junit4] Suite: org.apache.solr.analysis.TestSpanishLightStemFilterFactory
   [junit4] Completed in 0.01s, 1 test
   [junit4]  
   [junit4] Suite: org.apache.solr.analysis.TestTrimFilterFactory
   [junit4] Completed in 0.00s, 1 test
   [junit4]  
   [junit4] Suite: org.apache.solr.analysis.TestTurkishLowerCaseFilterFactory
   [junit4] Completed in 0.01s, 1 test
   [junit4]  
   [junit4] Suite: org.apache.solr.analysis.TestCJKBigramFilterFactory
   [junit4] Completed in 0.01s, 2 tests
   [junit4]  
   [junit4] Suite: org.apache.solr.analysis.TestCzechStemFilterFactory
   [junit4] Completed in 0.01s, 1 test
   [junit4]  
   [junit4] Suite: org.apache.solr.analysis.TestGermanStemFilterFactory
   [junit4] Completed in 0.01s, 1 test
   [junit4]  
   [junit4] Suite: org.apache.solr.util.FileUtilsTest
   [junit4] Completed in 0.01s, 1 test
   [junit4]  
   [junit4] Suite: org.apache.solr.cloud.ChaosMonkeyNothingIsSafeTest
   [junit4] Completed in 0.01s, 0 tests
   [junit4]  
   [junit4] Suite: org.apache.solr.cloud.ChaosMonkeySafeLeaderTest
   [junit4] Completed in 0.00s, 0 tests
   [junit4]  
   [junit4] JVM J0:     1.24 ..   952.19 =   950.95s
   [junit4] Execution time total: 15 minutes 52 seconds
   [junit4] Tests summary: 286 suites, 967 tests, 1 failure, 6 ignored (1 assumption)

BUILD FAILED
<http://jenkins.sd-datasolutions.de/job/Windows-Lucene-Solr-tests-only-trunk/ws/build.xml>:29:
The following error occurred while executing this line:
<http://jenkins.sd-datasolutions.de/job/Windows-Lucene-Solr-tests-only-trunk/ws/solr\build.xml>:144:
The following error occurred while executing this line:
<http://jenkins.sd-datasolutions.de/job/Windows-Lucene-Solr-tests-only-trunk/ws/lucene\module-build.xml>:62:
The following error occurred while executing this line:
<http://jenkins.sd-datasolutions.de/job/Windows-Lucene-Solr-tests-only-trunk/ws/lucene\common-build.xml>:1019:
The following error occurred while executing this line:
<http://jenkins.sd-datasolutions.de/job/Windows-Lucene-Solr-tests-only-trunk/ws/lucene\common-build.xml>:745:
There were test failures: 286 suites, 967 tests, 1 failure, 6 ignored (1 assumption)

Total time: 39 minutes 4 seconds
Build step 'Invoke Ant' marked build as failure
Recording test results

---------------------------------------------------------------------
To unsubscribe, e-mail: dev-unsubscribe@lucene.apache.org
For additional commands, e-mail: dev-help@lucene.apache.org


Mime
View raw message