lucene-dev mailing list archives

Site index · List index
Message view « Date » · « Thread »
Top « Date » · « Thread »
From jenk...@sd-datasolutions.de
Subject Build failed in Jenkins: Lucene-Solr-trunk-Windows-Java6-64 #310
Date Wed, 30 May 2012 03:48:51 GMT
See <http://jenkins.sd-datasolutions.de/job/Lucene-Solr-trunk-Windows-Java6-64/310/changes>

Changes:

[rmuir] LUCENE-4086: remove 3.x index support from trunk

------------------------------------------
[...truncated 13735 lines...]
   [junit4]   2> 
   [junit4] ERROR   0.00s | TestDistributedGrouping (suite)
   [junit4]    > Throwable #1: java.lang.AssertionError: ERROR: SolrIndexSearcher opens=27
closes=28
   [junit4]    > 	at __randomizedtesting.SeedInfo.seed([8F9A927BF3F41ECA]:0)
   [junit4]    > 	at org.junit.Assert.fail(Assert.java:93)
   [junit4]    > 	at org.apache.solr.SolrTestCaseJ4.endTrackingSearchers(SolrTestCaseJ4.java:190)
   [junit4]    > 	at org.apache.solr.SolrTestCaseJ4.afterClass(SolrTestCaseJ4.java:82)
   [junit4]    > 	at sun.reflect.GeneratedMethodAccessor15.invoke(Unknown Source)
   [junit4]    > 	at sun.reflect.DelegatingMethodAccessorImpl.invoke(DelegatingMethodAccessorImpl.java:25)
   [junit4]    > 	at java.lang.reflect.Method.invoke(Method.java:597)
   [junit4]    > 	at com.carrotsearch.randomizedtesting.RandomizedRunner.invoke(RandomizedRunner.java:1969)
   [junit4]    > 	at com.carrotsearch.randomizedtesting.RandomizedRunner.access$1100(RandomizedRunner.java:132)
   [junit4]    > 	at com.carrotsearch.randomizedtesting.RandomizedRunner$5.evaluate(RandomizedRunner.java:752)
   [junit4]    > 	at com.carrotsearch.randomizedtesting.rules.SystemPropertiesRestoreRule$1.evaluate(SystemPropertiesRestoreRule.java:53)
   [junit4]    > 	at org.apache.lucene.util.AbstractBeforeAfterRule$1.evaluate(AbstractBeforeAfterRule.java:45)
   [junit4]    > 	at org.apache.lucene.util.TestRuleReportUncaughtExceptions$1.evaluate(TestRuleReportUncaughtExceptions.java:68)
   [junit4]    > 	at org.apache.lucene.util.TestRuleStoreClassName$1.evaluate(TestRuleStoreClassName.java:38)
   [junit4]    > 	at org.apache.lucene.util.TestRuleIcuHack$1.evaluate(TestRuleIcuHack.java:51)
   [junit4]    > 	at com.carrotsearch.randomizedtesting.rules.SystemPropertiesInvariantRule$1.evaluate(SystemPropertiesInvariantRule.java:55)
   [junit4]    > 	at org.apache.lucene.util.TestRuleNoInstanceHooksOverrides$1.evaluate(TestRuleNoInstanceHooksOverrides.java:53)
   [junit4]    > 	at org.apache.lucene.util.TestRuleNoStaticHooksShadowing$1.evaluate(TestRuleNoStaticHooksShadowing.java:52)
   [junit4]    > 	at org.apache.lucene.util.TestRuleAssertionsRequired$1.evaluate(TestRuleAssertionsRequired.java:36)
   [junit4]    > 	at org.apache.lucene.util.TestRuleMarkFailure$1.evaluate(TestRuleMarkFailure.java:48)
   [junit4]    > 	at org.apache.lucene.util.TestRuleIgnoreTestSuites$1.evaluate(TestRuleIgnoreTestSuites.java:56)
   [junit4]    > 	at com.carrotsearch.randomizedtesting.RandomizedRunner.runSuite(RandomizedRunner.java:605)
   [junit4]    > 	at com.carrotsearch.randomizedtesting.RandomizedRunner.access$400(RandomizedRunner.java:132)
   [junit4]    > 	at com.carrotsearch.randomizedtesting.RandomizedRunner$2.run(RandomizedRunner.java:551)
   [junit4]    >
   [junit4] Completed in 950.60s, 1 test, 1 failure <<< FAILURES!
   [junit4]  
   [junit4] Suite: org.apache.solr.cloud.CloudStateUpdateTest
   [junit4] Completed in 11.07s, 1 test
   [junit4]  
   [junit4] Suite: org.apache.solr.handler.component.DistributedSpellCheckComponentTest
   [junit4] Completed in 12.79s, 1 test
   [junit4]  
   [junit4] Suite: org.apache.solr.search.TestRecovery
   [junit4] Completed in 10.25s, 9 tests
   [junit4]  
   [junit4] Suite: org.apache.solr.cloud.TestHashPartitioner
   [junit4] Completed in 4.73s, 1 test
   [junit4]  
   [junit4] Suite: org.apache.solr.update.DirectUpdateHandlerTest
   [junit4] Completed in 2.87s, 6 tests
   [junit4]  
   [junit4] Suite: org.apache.solr.search.TestRangeQuery
   [junit4] Completed in 7.61s, 2 tests
   [junit4]  
   [junit4] Suite: org.apache.solr.update.PeerSyncTest
   [junit4] Completed in 4.76s, 1 test
   [junit4]  
   [junit4] Suite: org.apache.solr.search.function.TestFunctionQuery
   [junit4] Completed in 2.94s, 14 tests
   [junit4]  
   [junit4] Suite: org.apache.solr.core.SolrCoreTest
   [junit4] Completed in 6.37s, 5 tests
   [junit4]  
   [junit4] Suite: org.apache.solr.schema.BadIndexSchemaTest
   [junit4] Completed in 1.41s, 6 tests
   [junit4]  
   [junit4] Suite: org.apache.solr.update.SolrCmdDistributorTest
   [junit4] Completed in 2.25s, 1 test
   [junit4]  
   [junit4] Suite: org.apache.solr.handler.admin.LukeRequestHandlerTest
   [junit4] Completed in 3.10s, 3 tests
   [junit4]  
   [junit4] Suite: org.apache.solr.core.TestCoreContainer
   [junit4] Completed in 2.73s, 1 test
   [junit4]  
   [junit4] Suite: org.apache.solr.core.TestSolrDeletionPolicy2
   [junit4] Completed in 0.84s, 1 test
   [junit4]  
   [junit4] Suite: org.apache.solr.search.function.distance.DistanceFunctionTest
   [junit4] Completed in 1.03s, 3 tests
   [junit4]  
   [junit4] Suite: org.apache.solr.search.SpatialFilterTest
   [junit4] Completed in 1.76s, 3 tests
   [junit4]  
   [junit4] Suite: org.apache.solr.core.SolrCoreCheckLockOnStartupTest
   [junit4] Completed in 1.63s, 2 tests
   [junit4]  
   [junit4] Suite: org.apache.solr.spelling.suggest.SuggesterWFSTTest
   [junit4] Completed in 1.33s, 4 tests
   [junit4]  
   [junit4] Suite: org.apache.solr.servlet.CacheHeaderTest
   [junit4] Completed in 1.06s, 5 tests
   [junit4]  
   [junit4] Suite: org.apache.solr.core.TestSolrDeletionPolicy1
   [junit4] IGNOR/A 0.01s | TestSolrDeletionPolicy1.testCommitAge
   [junit4]    > Assumption #1: This test is not working on Windows (or maybe machines
with only 2 CPUs)
   [junit4]   2> 1041 T3468 oas.SolrTestCaseJ4.setUp ###Starting testCommitAge
   [junit4]   2> 1044 T3468 C215 oasu.DirectUpdateHandler2.deleteAll [collection1] REMOVING
ALL DOCUMENTS FROM INDEX
   [junit4]   2> 1045 T3468 C215 UPDATE [collection1] webapp=null path=null params={} {deleteByQuery=*:*}
0 1
   [junit4]   2> 1047 T3468 oas.SolrTestCaseJ4.tearDown ###Ending testCommitAge
   [junit4]   2>
   [junit4] Completed in 1.06s, 3 tests, 1 skipped
   [junit4]  
   [junit4] Suite: org.apache.solr.core.RequestHandlersTest
   [junit4] Completed in 0.97s, 3 tests
   [junit4]  
   [junit4] Suite: org.apache.solr.update.SolrIndexConfigTest
   [junit4] Completed in 1.60s, 2 tests
   [junit4]  
   [junit4] Suite: org.apache.solr.handler.XmlUpdateRequestHandlerTest
   [junit4] Completed in 0.88s, 3 tests
   [junit4]  
   [junit4] Suite: org.apache.solr.schema.PrimitiveFieldTypeTest
   [junit4] Completed in 1.31s, 1 test
   [junit4]  
   [junit4] Suite: org.apache.solr.search.TestValueSourceCache
   [junit4] Completed in 0.93s, 2 tests
   [junit4]  
   [junit4] Suite: org.apache.solr.handler.component.BadComponentTest
   [junit4] Completed in 0.71s, 1 test
   [junit4]  
   [junit4] Suite: org.apache.solr.schema.RequiredFieldsTest
   [junit4] Completed in 0.77s, 3 tests
   [junit4]  
   [junit4] Suite: org.apache.solr.response.TestCSVResponseWriter
   [junit4] Completed in 0.85s, 1 test
   [junit4]  
   [junit4] Suite: org.apache.solr.update.DirectUpdateHandlerOptimizeTest
   [junit4] Completed in 0.83s, 1 test
   [junit4]  
   [junit4] Suite: org.apache.solr.highlight.HighlighterConfigTest
   [junit4] Completed in 0.88s, 1 test
   [junit4]  
   [junit4] Suite: org.apache.solr.handler.FieldAnalysisRequestHandlerTest
   [junit4] Completed in 1.21s, 4 tests
   [junit4]  
   [junit4] Suite: org.apache.solr.core.TestPropInjectDefaults
   [junit4] Completed in 0.86s, 2 tests
   [junit4]  
   [junit4] Suite: org.apache.solr.handler.component.SearchHandlerTest
   [junit4] Completed in 0.90s, 1 test
   [junit4]  
   [junit4] Suite: org.apache.solr.core.AlternateDirectoryTest
   [junit4] Completed in 0.85s, 1 test
   [junit4]  
   [junit4] Suite: org.apache.solr.analysis.TestJapanesePartOfSpeechStopFilterFactory
   [junit4] Completed in 0.01s, 1 test
   [junit4]  
   [junit4] Suite: org.apache.solr.analysis.TestJapaneseTokenizerFactory
   [junit4] Completed in 0.02s, 4 tests
   [junit4]  
   [junit4] Suite: org.apache.solr.MinimalSchemaTest
   [junit4] Completed in 0.37s, 3 tests
   [junit4]  
   [junit4] Suite: org.apache.solr.analysis.TestLuceneMatchVersion
   [junit4] Completed in 0.25s, 1 test
   [junit4]  
   [junit4] Suite: org.apache.solr.analysis.TestCollationKeyRangeQueries
   [junit4] Completed in 0.29s, 3 tests
   [junit4]  
   [junit4] Suite: org.apache.solr.schema.NotRequiredUniqueKeyTest
   [junit4] Completed in 0.26s, 1 test
   [junit4]  
   [junit4] Suite: org.apache.solr.analysis.TestCollationKeyFilterFactory
   [junit4] Completed in 0.02s, 5 tests
   [junit4]  
   [junit4] Suite: org.apache.solr.analysis.TestKStemFilterFactory
   [junit4] Completed in 0.16s, 1 test
   [junit4]  
   [junit4] Suite: org.apache.solr.core.TestConfig
   [junit4] Completed in 0.46s, 8 tests
   [junit4]  
   [junit4] Suite: org.apache.solr.analysis.TestHyphenationCompoundWordTokenFilterFactory
   [junit4] Completed in 0.19s, 2 tests
   [junit4]  
   [junit4] Suite: org.apache.solr.core.TestCodecSupport
   [junit4] Completed in 0.19s, 3 tests
   [junit4]  
   [junit4] Suite: org.apache.solr.search.TestFastLRUCache
   [junit4] Completed in 0.08s, 7 tests
   [junit4]  
   [junit4] Suite: org.apache.solr.util.DateMathParserTest
   [junit4] Completed in 0.05s, 8 tests
   [junit4]  
   [junit4] Suite: org.apache.solr.analysis.TestGalicianStemFilterFactory
   [junit4] Completed in 0.01s, 1 test
   [junit4]  
   [junit4] Suite: org.apache.solr.analysis.TestPortugueseMinimalStemFilterFactory
   [junit4] Completed in 0.01s, 1 test
   [junit4]  
   [junit4] Suite: org.apache.solr.analysis.TestSynonymFilterFactory
   [junit4] Completed in 0.02s, 4 tests
   [junit4]  
   [junit4] Suite: org.apache.solr.util.TestSystemIdResolver
   [junit4] Completed in 0.01s, 1 test
   [junit4]  
   [junit4] Suite: org.apache.solr.analysis.TestHindiFilters
   [junit4] Completed in 0.01s, 3 tests
   [junit4]  
   [junit4] Suite: org.apache.solr.analysis.TestElisionFilterFactory
   [junit4] Completed in 0.01s, 3 tests
   [junit4]  
   [junit4] Suite: org.apache.solr.analysis.TestHunspellStemFilterFactory
   [junit4] Completed in 0.02s, 1 test
   [junit4]  
   [junit4] Suite: org.apache.solr.util.TestUtils
   [junit4] Completed in 0.01s, 3 tests
   [junit4]  
   [junit4] Suite: org.apache.solr.spelling.TestSuggestSpellingConverter
   [junit4] Completed in 0.01s, 2 tests
   [junit4]  
   [junit4] Suite: org.apache.solr.analysis.TestChineseTokenizerFactory
   [junit4] Completed in 0.01s, 1 test
   [junit4]  
   [junit4] Suite: org.apache.solr.search.TestLRUCache
   [junit4] Completed in 0.01s, 3 tests
   [junit4]  
   [junit4] Suite: org.apache.solr.analysis.TestPatternTokenizerFactory
   [junit4] Completed in 0.01s, 1 test
   [junit4]  
   [junit4] Suite: org.apache.solr.analysis.TestPersianNormalizationFilterFactory
   [junit4] Completed in 0.01s, 1 test
   [junit4]  
   [junit4] Suite: org.apache.solr.analysis.TestTurkishLowerCaseFilterFactory
   [junit4] Completed in 0.01s, 1 test
   [junit4]  
   [junit4] Suite: org.apache.solr.internal.csv.writer.CSVConfigGuesserTest
   [junit4] Completed in 0.01s, 3 tests
   [junit4]  
   [junit4] Suite: org.apache.solr.analysis.TestBulgarianStemFilterFactory
   [junit4] Completed in 0.01s, 1 test
   [junit4]  
   [junit4] Suite: org.apache.solr.analysis.TestMappingCharFilterFactory
   [junit4] Completed in 0.01s, 1 test
   [junit4]  
   [junit4] Suite: org.apache.solr.handler.admin.SystemInfoHandlerTest
   [junit4] Completed in 0.01s, 1 test
   [junit4]  
   [junit4] Suite: org.apache.solr.util.CircularListTest
   [junit4] Completed in 0.00s, 1 test
   [junit4]  
   [junit4] JVM J0:     1.02 ..  2024.46 =  2023.44s
   [junit4] Execution time total: 33 minutes 44 seconds
   [junit4] Tests summary: 286 suites, 972 tests, 2 suite-level errors, 1 failure, 10 ignored
(5 assumptions)

BUILD FAILED
<http://jenkins.sd-datasolutions.de/job/Lucene-Solr-trunk-Windows-Java6-64/ws/build.xml>:29:
The following error occurred while executing this line:
<http://jenkins.sd-datasolutions.de/job/Lucene-Solr-trunk-Windows-Java6-64/ws/solr\build.xml>:144:
The following error occurred while executing this line:
<http://jenkins.sd-datasolutions.de/job/Lucene-Solr-trunk-Windows-Java6-64/ws/lucene\module-build.xml>:62:
The following error occurred while executing this line:
<http://jenkins.sd-datasolutions.de/job/Lucene-Solr-trunk-Windows-Java6-64/ws/lucene\common-build.xml>:1019:
The following error occurred while executing this line:
<http://jenkins.sd-datasolutions.de/job/Lucene-Solr-trunk-Windows-Java6-64/ws/lucene\common-build.xml>:745:
There were test failures: 286 suites, 972 tests, 2 suite-level errors, 1 failure, 10 ignored
(5 assumptions)

Total time: 54 minutes 26 seconds
Build step 'Invoke Ant' marked build as failure
Recording test results

---------------------------------------------------------------------
To unsubscribe, e-mail: dev-unsubscribe@lucene.apache.org
For additional commands, e-mail: dev-help@lucene.apache.org


Mime
View raw message