lucene-dev mailing list archives

Site index · List index
Message view « Date » · « Thread »
Top « Date » · « Thread »
From jenk...@sd-datasolutions.de
Subject Build failed in Jenkins: Lucene-Solr-trunk-Windows-Java7-64 #57
Date Sun, 20 May 2012 03:30:19 GMT
See <http://jenkins.sd-datasolutions.de/job/Lucene-Solr-trunk-Windows-Java7-64/57/>

------------------------------------------
[...truncated 11024 lines...]
   [junit4]    > 	at com.carrotsearch.randomizedtesting.RandomizedRunner$3$1.run(RandomizedRunner.java:669)
   [junit4]    > 	at com.carrotsearch.randomizedtesting.RandomizedRunner$3.evaluate(RandomizedRunner.java:695)
   [junit4]    > 	at com.carrotsearch.randomizedtesting.RandomizedRunner$4.evaluate(RandomizedRunner.java:734)
   [junit4]    > 	at com.carrotsearch.randomizedtesting.RandomizedRunner$5.evaluate(RandomizedRunner.java:745)
   [junit4]    > 	at com.carrotsearch.randomizedtesting.rules.SystemPropertiesRestoreRule$1.evaluate(SystemPropertiesRestoreRule.java:53)
   [junit4]    > 	at org.apache.lucene.util.AbstractBeforeAfterRule$1.evaluate(AbstractBeforeAfterRule.java:45)
   [junit4]    > 	at org.apache.lucene.util.TestRuleReportUncaughtExceptions$1.evaluate(TestRuleReportUncaughtExceptions.java:68)
   [junit4]    > 	at org.apache.lucene.util.TestRuleStoreClassName$1.evaluate(TestRuleStoreClassName.java:38)
   [junit4]    > 	at org.apache.lucene.util.TestRuleIcuHack$1.evaluate(TestRuleIcuHack.java:51)
   [junit4]    > 	at com.carrotsearch.randomizedtesting.rules.SystemPropertiesInvariantRule$1.evaluate(SystemPropertiesInvariantRule.java:55)
   [junit4]    > 	at org.apache.lucene.util.TestRuleNoInstanceHooksOverrides$1.evaluate(TestRuleNoInstanceHooksOverrides.java:53)
   [junit4]    > 	at org.apache.lucene.util.TestRuleNoStaticHooksShadowing$1.evaluate(TestRuleNoStaticHooksShadowing.java:52)
   [junit4]    > 	at org.apache.lucene.util.TestRuleAssertionsRequired$1.evaluate(TestRuleAssertionsRequired.java:36)
   [junit4]    > 	at org.apache.lucene.util.TestRuleMarkFailure$1.evaluate(TestRuleMarkFailure.java:48)
   [junit4]    > 	at org.apache.lucene.util.TestRuleIgnoreTestSuites$1.evaluate(TestRuleIgnoreTestSuites.java:56)
   [junit4]    > 	at com.carrotsearch.randomizedtesting.RandomizedRunner.runSuite(RandomizedRunner.java:605)
   [junit4]    > 	at com.carrotsearch.randomizedtesting.RandomizedRunner.access$400(RandomizedRunner.java:132)
   [junit4]    > 	at com.carrotsearch.randomizedtesting.RandomizedRunner$2.run(RandomizedRunner.java:551)
   [junit4]    > 
   [junit4]   2> 1115 T3246 oas.SolrTestCaseJ4.assertJQ SEVERE query failed JSON validation.
error=Path not found: /spellcheck/suggestions/[1]/suggestion
   [junit4]   2> 	 expected =/spellcheck/suggestions/[1]/suggestion==[{"word":"document","freq":2}]
   [junit4]   2> 	 response = {
   [junit4]   2> 	  "responseHeader":{
   [junit4]   2> 	    "status":0,
   [junit4]   2> 	    "QTime":0},
   [junit4]   2> 	  "response":{"numFound":0,"start":0,"docs":[]
   [junit4]   2> 	  },
   [junit4]   2> 	  "spellcheck":{
   [junit4]   2> 	    "suggestions":[
   [junit4]   2> 	      "correctlySpelled",false]}}
   [junit4]   2> 	
   [junit4]   2> 	 request = spellcheck=true&spellcheck.extendedResults=true&q=documenq&spellcheck.dictionary=threshold&spellcheck.count=5&qt=spellCheckCompRH
   [junit4]   2> NOTE: reproduce with: ant test -Dtestcase=SpellCheckComponentTest -Dtests.method=testThresholdTokenFrequency
-Dtests.seed=76BBD120FA3E92FA -Dtests.locale=sq -Dtests.timezone=America/Belem -Dargs="-Dfile.encoding=Cp1252"
   [junit4]   2>
   [junit4]    > (@AfterClass output)
   [junit4]   2> !!!! WARNING: best effort to remove <http://jenkins.sd-datasolutions.de/job/Lucene-Solr-trunk-Windows-Java7-64/ws/solr\build\solr-core\test\J0\.\solrtest-SpellCheckComponentTest-1337484534008\spellchecker1\_b.fdt>
FAILED !!!!!
   [junit4]   2> !!!! WARNING: best effort to remove <http://jenkins.sd-datasolutions.de/job/Lucene-Solr-trunk-Windows-Java7-64/ws/solr\build\solr-core\test\J0\.\solrtest-SpellCheckComponentTest-1337484534008\spellchecker1>
FAILED !!!!!
   [junit4]   2> !!!! WARNING: best effort to remove <http://jenkins.sd-datasolutions.de/job/Lucene-Solr-trunk-Windows-Java7-64/ws/solr\build\solr-core\test\J0\.\solrtest-SpellCheckComponentTest-1337484534008>
FAILED !!!!!
   [junit4]   2> NOTE: test params are: codec=Lucene40, sim=RandomSimilarityProvider(queryNorm=false,coord=true):
{}, locale=sq, timezone=America/Belem
   [junit4]   2> NOTE: Windows 7 6.1 amd64/Oracle Corporation 1.7.0_04 (64-bit)/cpus=2,threads=1,free=74438472,total=307560448
   [junit4]   2> NOTE: All tests run in this JVM: [TestJapanesePartOfSpeechStopFilterFactory,
CopyFieldTest, RequiredFieldsTest, OverseerTest, SuggesterTest, TestDFRSimilarityFactory,
TestLuceneMatchVersion, TestLMJelinekMercerSimilarityFactory, TestHungarianLightStemFilterFactory,
CoreAdminHandlerTest, BasicDistributedZkTest, TestRangeQuery, DisMaxRequestHandlerTest, SystemInfoHandlerTest,
SpellingQueryConverterTest, RequestHandlersTest, ReturnFieldsTest, TestIndonesianStemFilterFactory,
MoreLikeThisHandlerTest, TestItalianLightStemFilterFactory, TestPortugueseMinimalStemFilterFactory,
TestMergePolicyConfig, TestPropInject, TestReverseStringFilterFactory, URLClassifyProcessorTest,
TestPhoneticFilterFactory, TestSystemIdResolver, TestUAX29URLEmailTokenizerFactory, IndexReaderFactoryTest,
UUIDFieldTest, TestHunspellStemFilterFactory, DirectUpdateHandlerOptimizeTest, BadIndexSchemaTest,
TestBeiderMorseFilterFactory, BinaryUpdateRequestHandlerTest, TestPerFieldSimilarity, TestPatternReplaceFilterFactory,
TestJmxIntegration, TestCSVLoader, DirectSolrSpellCheckerTest, BasicZkTest, HighlighterConfigTest,
SignatureUpdateProcessorFactoryTest, TestValueSourceCache, TestSolrXMLSerializer, TestJapaneseBaseFormFilterFactory,
TestGroupingSearch, RecoveryZkTest, IndexBasedSpellCheckerTest, TestArabicFilters, TestKeywordMarkerFilterFactory,
SoftAutoCommitTest, TestFunctionQuery, RAMDirectoryFactoryTest, DateMathParserTest, FastVectorHighlighterTest,
TestTypeTokenFilterFactory, TestBadConfig, TestShingleFilterFactory, TestBinaryResponseWriter,
MinimalSchemaTest, ShowFileRequestHandlerTest, LegacyHTMLStripCharFilterTest, TestCodecSupport,
DateFieldTest, SpellPossibilityIteratorTest, TestPropInjectDefaults, TestKStemFilterFactory,
TestDelimitedPayloadTokenFilterFactory, TestIndexSearcher, TestFrenchMinimalStemFilterFactory,
TestQueryUtils, FileBasedSpellCheckerTest, TestSuggestSpellingConverter, TestChineseTokenizerFactory,
SimpleFacetsTest, TestMultiWordSynonyms, TestDistributedGrouping, NodeStateWatcherTest, ZkNodePropsTest,
TestCzechStemFilterFactory, XmlUpdateRequestHandlerTest, IndexSchemaTest, SuggesterTSTTest,
PrimUtilsTest, TestNumberUtils, SpellCheckCollatorTest, ConvertedLegacyTest, StatsComponentTest,
TestOmitPositions, TestUpdate, TestCJKTokenizerFactory, SortByFunctionTest, TestCSVResponseWriter,
TestSpanishLightStemFilterFactory, SearchHandlerTest, TermVectorComponentTest, TestPluginEnable,
TestLRUCache, JSONWriterTest, UniqFieldsUpdateProcessorFactoryTest, OpenExchangeRatesOrgProviderTest,
SuggesterFSTTest, BasicFunctionalityTest, TestBulgarianStemFilterFactory, TestIrishLowerCaseFilterFactory,
TestNGramFilters, CloudStateTest, TestPortugueseStemFilterFactory, TermsComponentTest, ZkControllerTest,
SolrPluginUtilsTest, TestGermanLightStemFilterFactory, CSVRequestHandlerTest, TestFaceting,
DirectUpdateHandlerTest, FileUtilsTest, UpdateRequestProcessorFactoryTest, TestWordDelimiterFilterFactory,
TestPHPSerializedResponseWriter, OutputWriterTest, TestReplicationHandler, LeaderElectionIntegrationTest,
TestEnglishMinimalStemFilterFactory, TestMultiCoreConfBootstrap, ZkSolrClientTest, PingRequestHandlerTest,
DirectSolrConnectionTest, NoCacheHeaderTest, TestGalicianStemFilterFactory, CloudStateUpdateTest,
TestMappingCharFilterFactory, TestConfig, FullSolrCloudDistribCmdsTest, TestArbitraryIndexDir,
TestBinaryField, TestSort, DebugComponentTest, TestCollationKeyFilterFactory, PeerSyncTest,
UpdateParamsTest, TestFinnishLightStemFilterFactory, SampleTest, TestSolrCoreProperties, TestPseudoReturnFields,
TimeZoneUtilsTest, CacheHeaderTest, EchoParamsTest, QueryParsingTest, TestGermanMinimalStemFilterFactory,
SolrIndexConfigTest, AutoCommitTest, TestSlowSynonymFilter, TestIndexingPerformance, BadComponentTest,
TestStandardFactories, TestGreekStemFilterFactory, StandardRequestHandlerTest, LukeRequestHandlerTest,
TestHindiFilters, TestSynonymMap, NotRequiredUniqueKeyTest, TestBrazilianStemFilterFactory,
DocumentBuilderTest, CommonGramsFilterFactoryTest, IndexSchemaRuntimeFieldTest, TestIBSimilarityFactory,
TestGermanStemFilterFactory, TestHyphenationCompoundWordTokenFilterFactory, SolrRequestParserTest,
TestStemmerOverrideFilterFactory, TestCapitalizationFilterFactory, TestUtils, TestTrimFilterFactory,
SolrCmdDistributorTest, DocumentAnalysisRequestHandlerTest, TestCollationField, TestGermanNormalizationFilterFactory,
XsltUpdateRequestHandlerTest, PrimitiveFieldTypeTest, TestDefaultSimilarityFactory, TestExtendedDismaxParser,
DOMUtilTest, TestPatternReplaceCharFilterFactory, TestCollationKeyRangeQueries, TestCJKWidthFilterFactory,
SOLR749Test, TestGalicianMinimalStemFilterFactory, SuggesterWFSTTest, LengthFilterTest, MBeansHandlerTest,
TestReversedWildcardFilterFactory, TestKeepFilterFactory, TestNorwegianMinimalStemFilterFactory,
SnowballPorterFilterFactoryTest, TestQueryTypes, MultiTermTest, TestHashPartitioner, DistanceFunctionTest,
NumericFieldsTest, FieldMutatingUpdateProcessorTest, TestRandomFaceting, TestDocSet, DoubleMetaphoneFilterFactoryTest,
TestThaiWordFilterFactory, SolrCoreCheckLockOnStartupTest, TestRealTimeGet, LeaderElectionTest,
TestDistributedSearch, DistributedSpellCheckComponentTest, TestRecovery, DistributedTermsComponentTest,
TestJoin, SpellCheckComponentTest]
   [junit4]   2> 
   [junit4] Completed in 10.72s, 9 tests, 1 error <<< FAILURES!
   [junit4]  
   [junit4] Suite: org.apache.solr.handler.component.QueryElevationComponentTest
   [junit4] Completed in 6.21s, 7 tests
   [junit4]  
   [junit4] Suite: org.apache.solr.handler.component.DistributedQueryElevationComponentTest
   [junit4] Completed in 3.35s, 1 test
   [junit4]  
   [junit4] Suite: org.apache.solr.search.TestFiltering
   [junit4] Completed in 2.57s, 2 tests
   [junit4]  
   [junit4] Suite: org.apache.solr.TestTrie
   [junit4] Completed in 1.55s, 8 tests
   [junit4]  
   [junit4] Suite: org.apache.solr.core.SolrCoreTest
   [junit4] Completed in 5.52s, 5 tests
   [junit4]  
   [junit4] Suite: org.apache.solr.SolrInfoMBeanTest
   [junit4] Completed in 0.83s, 1 test
   [junit4]  
   [junit4] Suite: org.apache.solr.core.TestCoreContainer
   [junit4] Completed in 2.53s, 1 test
   [junit4]  
   [junit4] Suite: org.apache.solr.core.TestSolrDeletionPolicy2
   [junit4] Completed in 0.74s, 1 test
   [junit4]  
   [junit4] Suite: org.apache.solr.request.TestWriterPerf
   [junit4] Completed in 1.54s, 1 test
   [junit4]  
   [junit4] Suite: org.apache.solr.search.similarities.TestLMDirichletSimilarityFactory
   [junit4] Completed in 0.20s, 2 tests
   [junit4]  
   [junit4] Suite: org.apache.solr.search.TestSurroundQueryParser
   [junit4] Completed in 1.09s, 1 test
   [junit4]  
   [junit4] Suite: org.apache.solr.highlight.HighlighterTest
   [junit4] Completed in 2.28s, 27 tests
   [junit4]  
   [junit4] Suite: org.apache.solr.request.TestRemoteStreaming
   [junit4] Completed in 1.09s, 4 tests
   [junit4]  
   [junit4] Suite: org.apache.solr.search.SpatialFilterTest
   [junit4] Completed in 1.76s, 3 tests
   [junit4]  
   [junit4] Suite: org.apache.solr.schema.PolyFieldTest
   [junit4] Completed in 1.28s, 4 tests
   [junit4]  
   [junit4] Suite: org.apache.solr.search.TestFoldingMultitermQuery
   [junit4] Completed in 1.13s, 18 tests
   [junit4]  
   [junit4] Suite: org.apache.solr.schema.CurrencyFieldTest
   [junit4] IGNORED 0.00s | CurrencyFieldTest.testPerformance
   [junit4]    > Cause: Annotated @Ignore()
   [junit4] Completed in 1.07s, 8 tests, 1 skipped
   [junit4]  
   [junit4] Suite: org.apache.solr.core.TestSolrDeletionPolicy1
   [junit4] Completed in 1.38s, 3 tests
   [junit4]  
   [junit4] Suite: org.apache.solr.handler.JsonLoaderTest
   [junit4] Completed in 1.09s, 5 tests
   [junit4]  
   [junit4] Suite: org.apache.solr.handler.FieldAnalysisRequestHandlerTest
   [junit4] Completed in 1.40s, 4 tests
   [junit4]  
   [junit4] Suite: org.apache.solr.search.TestSolrQueryParser
   [junit4] Completed in 1.09s, 1 test
   [junit4]  
   [junit4] Suite: org.apache.solr.core.AlternateDirectoryTest
   [junit4] Completed in 0.89s, 1 test
   [junit4]  
   [junit4] Suite: org.apache.solr.search.TestLFUCache
   [junit4] Completed in 0.94s, 5 tests
   [junit4]  
   [junit4] Suite: org.apache.solr.core.TestQuerySenderListener
   [junit4] Completed in 0.99s, 3 tests
   [junit4]  
   [junit4] Suite: org.apache.solr.core.TestQuerySenderNoQuery
   [junit4] Completed in 0.86s, 3 tests
   [junit4]  
   [junit4] Suite: org.apache.solr.core.TestXIncludeConfig
   [junit4] Completed in 0.96s, 1 test
   [junit4]  
   [junit4] Suite: org.apache.solr.search.TestSearchPerf
   [junit4] Completed in 0.55s, 1 test
   [junit4]  
   [junit4] Suite: org.apache.solr.analysis.TestJapaneseTokenizerFactory
   [junit4] Completed in 0.02s, 4 tests
   [junit4]  
   [junit4] Suite: org.apache.solr.core.TestJmxMonitoredMap
   [junit4] Completed in 0.28s, 2 tests
   [junit4]  
   [junit4] Suite: org.apache.solr.search.similarities.TestBM25SimilarityFactory
   [junit4] Completed in 0.21s, 2 tests
   [junit4]  
   [junit4] Suite: org.apache.solr.spelling.suggest.TestPhraseSuggestions
   [junit4] Completed in 0.20s, 1 test
   [junit4]  
   [junit4] Suite: org.apache.solr.search.TestFastLRUCache
   [junit4] Completed in 0.04s, 7 tests
   [junit4]  
   [junit4] Suite: org.apache.solr.analysis.TestHTMLStripCharFilterFactory
   [junit4] Completed in 0.04s, 6 tests
   [junit4]  
   [junit4] Suite: org.apache.solr.core.PluginInfoTest
   [junit4] Completed in 0.10s, 9 tests
   [junit4]  
   [junit4] Suite: org.apache.solr.core.ResourceLoaderTest
   [junit4] Completed in 0.03s, 4 tests
   [junit4]  
   [junit4] Suite: org.apache.solr.internal.csv.CSVStrategyTest
   [junit4] Completed in 0.01s, 5 tests
   [junit4]  
   [junit4] Suite: org.apache.solr.internal.csv.CharBufferTest
   [junit4] Completed in 0.04s, 13 tests
   [junit4]  
   [junit4] Suite: org.apache.solr.analysis.TestSynonymFilterFactory
   [junit4] Completed in 0.03s, 4 tests
   [junit4]  
   [junit4] Suite: org.apache.solr.internal.csv.CSVUtilsTest
   [junit4] Completed in 0.11s, 14 tests
   [junit4]  
   [junit4] Suite: org.apache.solr.analysis.TestLatvianStemFilterFactory
   [junit4] Completed in 0.05s, 1 test
   [junit4]  
   [junit4] Suite: org.apache.solr.analysis.TestRussianLightStemFilterFactory
   [junit4] Completed in 0.05s, 1 test
   [junit4]  
   [junit4] Suite: org.apache.solr.analysis.TestNorwegianLightStemFilterFactory
   [junit4] Completed in 0.24s, 1 test
   [junit4]  
   [junit4] Suite: org.apache.solr.analysis.TestElisionFilterFactory
   [junit4] Completed in 0.04s, 3 tests
   [junit4]  
   [junit4] Suite: org.apache.solr.analysis.TestFrenchLightStemFilterFactory
   [junit4] Completed in 0.01s, 1 test
   [junit4]  
   [junit4] Suite: org.apache.solr.analysis.TestPortugueseLightStemFilterFactory
   [junit4] Completed in 0.01s, 1 test
   [junit4]  
   [junit4] Suite: org.apache.solr.analysis.TestSwedishLightStemFilterFactory
   [junit4] Completed in 0.02s, 1 test
   [junit4]  
   [junit4] Suite: org.apache.solr.analysis.CommonGramsQueryFilterFactoryTest
   [junit4] Completed in 0.02s, 2 tests
   [junit4]  
   [junit4] Suite: org.apache.solr.analysis.TestDictionaryCompoundWordTokenFilterFactory
   [junit4] Completed in 0.02s, 1 test
   [junit4]  
   [junit4] Suite: org.apache.solr.analysis.TestStopFilterFactory
   [junit4] Completed in 0.01s, 1 test
   [junit4]  
   [junit4] Suite: org.apache.solr.analysis.TestWikipediaTokenizerFactory
   [junit4] Completed in 0.02s, 1 test
   [junit4]  
   [junit4] Suite: org.apache.solr.analysis.TestPorterStemFilterFactory
   [junit4] Completed in 0.01s, 1 test
   [junit4]  
   [junit4] Suite: org.apache.solr.analysis.TestPatternTokenizerFactory
   [junit4] Completed in 0.01s, 1 test
   [junit4]  
   [junit4] Suite: org.apache.solr.analysis.TestPersianNormalizationFilterFactory
   [junit4] Completed in 0.01s, 1 test
   [junit4]  
   [junit4] Suite: org.apache.solr.analysis.TestTurkishLowerCaseFilterFactory
   [junit4] Completed in 0.02s, 1 test
   [junit4]  
   [junit4] Suite: org.apache.solr.internal.csv.writer.CSVConfigTest
   [junit4] Completed in 0.03s, 7 tests
   [junit4]  
   [junit4] Suite: org.apache.solr.analysis.TestCJKBigramFilterFactory
   [junit4] Completed in 0.03s, 2 tests
   [junit4]  
   [junit4] Suite: org.apache.solr.analysis.TestRussianFilters
   [junit4] Completed in 0.02s, 1 test
   [junit4]  
   [junit4] Suite: org.apache.solr.analysis.TestChineseFilterFactory
   [junit4] Completed in 0.01s, 1 test
   [junit4]  
   [junit4] Suite: org.apache.solr.analysis.TestGreekLowerCaseFilterFactory
   [junit4] Completed in 0.01s, 1 test
   [junit4]  
   [junit4] Suite: org.apache.solr.internal.csv.writer.CSVFieldTest
   [junit4] Completed in 0.01s, 2 tests
   [junit4]  
   [junit4] Suite: org.apache.solr.analysis.TestRemoveDuplicatesTokenFilterFactory
   [junit4] Completed in 0.01s, 1 test
   [junit4]  
   [junit4] Suite: org.apache.solr.cloud.ChaosMonkeySafeLeaderTest
   [junit4] Completed in 0.01s, 0 tests
   [junit4]  
   [junit4] Suite: org.apache.solr.handler.admin.LoggingHandlerTest
   [junit4] Completed in 1.51s, 1 test
   [junit4]  
   [junit4] JVM J0:     1.13 ..   939.81 =   938.69s
   [junit4] Execution time total: 15 minutes 40 seconds
   [junit4] Tests summary: 286 suites, 968 tests, 1 error, 1 failure, 6 ignored (1 assumption)

BUILD FAILED
<http://jenkins.sd-datasolutions.de/job/Lucene-Solr-trunk-Windows-Java7-64/ws/build.xml>:29:
The following error occurred while executing this line:
<http://jenkins.sd-datasolutions.de/job/Lucene-Solr-trunk-Windows-Java7-64/ws/solr\build.xml>:144:
The following error occurred while executing this line:
<http://jenkins.sd-datasolutions.de/job/Lucene-Solr-trunk-Windows-Java7-64/ws/lucene\module-build.xml>:62:
The following error occurred while executing this line:
<http://jenkins.sd-datasolutions.de/job/Lucene-Solr-trunk-Windows-Java7-64/ws/lucene\common-build.xml>:1019:
The following error occurred while executing this line:
<http://jenkins.sd-datasolutions.de/job/Lucene-Solr-trunk-Windows-Java7-64/ws/lucene\common-build.xml>:745:
There were test failures: 286 suites, 968 tests, 1 error, 1 failure, 6 ignored (1 assumption)

Total time: 36 minutes 27 seconds
Build step 'Invoke Ant' marked build as failure
Recording test results

---------------------------------------------------------------------
To unsubscribe, e-mail: dev-unsubscribe@lucene.apache.org
For additional commands, e-mail: dev-help@lucene.apache.org


Mime
View raw message