lucene-dev mailing list archives

Site index · List index
Message view « Date » · « Thread »
Top « Date » · « Thread »
From Dawid Weiss <dawid.we...@cs.put.poznan.pl>
Subject Re: [JENKINS-MAVEN] Lucene-Solr-Maven-trunk #460: POMs out of sync
Date Thu, 19 Apr 2012 17:25:54 GMT
Yeah, I can't believe this either. It'd have to be really, really
loaded with threads (but then -- maybe it is, we don't know what's
happening in other jails).

Dawid

On Thu, Apr 19, 2012 at 6:44 PM, Mark Miller <markrmiller@gmail.com> wrote:
> It's still hard for me to believe the slowness of this machine in some cases with the timeouts it manages to break...
>
> On Apr 19, 2012, at 12:41 PM, Steven A Rowe wrote:
>
>>> Build: https://builds.apache.org/job/Lucene-Solr-Maven-trunk/460/
>>> 26 tests failed.
>>> Error Message: Could not get the port for ZooKeeper server
>>
>> This looks like a timeout issue? - ZkTestServer.run() starts a ZK server in a thread, then polls every 100 ms for availability, waiting maximally 50 seconds, and then fails if it can't connect by then:
>>
>> ------ ZkTestServer.run() ------
>>    int cnt = 0;
>>    int port = -1;
>>    try {
>>       port = getPort();
>>    } catch(IllegalStateException e) {
>>
>>    }
>>    while (port < 1) {
>>      Thread.sleep(100);
>>      try {
>>        port = getPort();
>>      } catch(IllegalStateException e) {
>>
>>      }
>>      if (cnt == 500) {
>>        throw new RuntimeException("Could not get the port for ZooKeeper server");
>>      }
>>      cnt++;
>>    }
>> -------------------------------
>>
>> -----Original Message-----
>> From: Apache Jenkins Server [mailto:jenkins@builds.apache.org]
>> Sent: Thursday, April 19, 2012 11:25 AM
>> To: dev@lucene.apache.org
>> Subject: [JENKINS-MAVEN] Lucene-Solr-Maven-trunk #460: POMs out of sync
>>
>> Build: https://builds.apache.org/job/Lucene-Solr-Maven-trunk/460/
>>
>> 26 tests failed.
>> FAILED:  org.apache.solr.cloud.BasicZkTest.org.apache.solr.cloud.BasicZkTest
>>
>> Error Message:
>> Could not get the port for ZooKeeper server
>>
>> Stack Trace:
>> java.lang.RuntimeException: Could not get the port for ZooKeeper server
>>       at __randomizedtesting.SeedInfo.seed([F53F94A3400BF015]:0)
>>       at __randomizedtesting.SeedInfo.seed([F53F94A3400BF015]:0)
>>       at org.apache.solr.cloud.ZkTestServer.run(ZkTestServer.java:239)
>>       at org.apache.solr.cloud.AbstractZkTestCase.azt_beforeClass(AbstractZkTestCase.java:58)
>>       at sun.reflect.NativeMethodAccessorImpl.invoke0(Native Method)
>>       at sun.reflect.NativeMethodAccessorImpl.invoke(NativeMethodAccessorImpl.java:57)
>>       at sun.reflect.DelegatingMethodAccessorImpl.invoke(DelegatingMethodAccessorImpl.java:43)
>>       at java.lang.reflect.Method.invoke(Method.java:616)
>>       at com.carrotsearch.randomizedtesting.RandomizedRunner.invoke(RandomizedRunner.java:1913)
>>       at com.carrotsearch.randomizedtesting.RandomizedRunner.access$1100(RandomizedRunner.java:131)
>>       at com.carrotsearch.randomizedtesting.RandomizedRunner$4.evaluate(RandomizedRunner.java:718)
>>       at com.carrotsearch.randomizedtesting.RandomizedRunner$5.evaluate(RandomizedRunner.java:734)
>>       at org.apache.lucene.util.SystemPropertiesRestoreRule$1.evaluate(SystemPropertiesRestoreRule.java:63)
>>       at org.apache.lucene.util.UncaughtExceptionsRule$1.evaluate(UncaughtExceptionsRule.java:75)
>>       at org.apache.lucene.util.StoreClassNameRule$1.evaluate(StoreClassNameRule.java:38)
>>       at org.apache.lucene.util.SystemPropertiesInvariantRule$1.evaluate(SystemPropertiesInvariantRule.java:69)
>>       at com.carrotsearch.randomizedtesting.RandomizedRunner.runSuite(RandomizedRunner.java:604)
>>       at com.carrotsearch.randomizedtesting.RandomizedRunner.access$400(RandomizedRunner.java:131)
>>       at com.carrotsearch.randomizedtesting.RandomizedRunner$2.run(RandomizedRunner.java:550)
>>
>>
>> REGRESSION:  org.apache.solr.cloud.CloudStateUpdateTest.testCoreRegistration
>>
>> Error Message:
>> Could not get the port for ZooKeeper server
>>
>> Stack Trace:
>> java.lang.RuntimeException: Could not get the port for ZooKeeper server
>>       at org.apache.solr.cloud.ZkTestServer.run(ZkTestServer.java:239)
>>       at org.apache.solr.cloud.CloudStateUpdateTest.setUp(CloudStateUpdateTest.java:89)
>>       at sun.reflect.GeneratedMethodAccessor2.invoke(Unknown Source)
>>       at sun.reflect.DelegatingMethodAccessorImpl.invoke(DelegatingMethodAccessorImpl.java:43)
>>       at java.lang.reflect.Method.invoke(Method.java:616)
>>       at com.carrotsearch.randomizedtesting.RandomizedRunner.invoke(RandomizedRunner.java:1913)
>>       at com.carrotsearch.randomizedtesting.RandomizedRunner.access$1100(RandomizedRunner.java:131)
>>       at com.carrotsearch.randomizedtesting.RandomizedRunner$7.evaluate(RandomizedRunner.java:864)
>>       at com.carrotsearch.randomizedtesting.RandomizedRunner$8.evaluate(RandomizedRunner.java:880)
>>       at org.apache.lucene.util.SystemPropertiesRestoreRule$1.evaluate(SystemPropertiesRestoreRule.java:63)
>>       at org.apache.lucene.util.LuceneTestCase$SubclassSetupTeardownRule$1.evaluate(LuceneTestCase.java:760)
>>       at org.apache.lucene.util.LuceneTestCase$InternalSetupTeardownRule$1.evaluate(LuceneTestCase.java:682)
>>       at org.apache.lucene.util.SystemPropertiesInvariantRule$1.evaluate(SystemPropertiesInvariantRule.java:69)
>>       at org.apache.lucene.util.LuceneTestCase$TestResultInterceptorRule$1.evaluate(LuceneTestCase.java:615)
>>       at org.apache.lucene.util.UncaughtExceptionsRule$1.evaluate(UncaughtExceptionsRule.java:75)
>>       at org.apache.lucene.util.LuceneTestCase$SaveThreadAndTestNameRule$1.evaluate(LuceneTestCase.java:654)
>>       at com.carrotsearch.randomizedtesting.RandomizedRunner.runSingleTest(RandomizedRunner.java:812)
>>       at com.carrotsearch.randomizedtesting.RandomizedRunner.access$700(RandomizedRunner.java:131)
>>       at com.carrotsearch.randomizedtesting.RandomizedRunner$3$1.run(RandomizedRunner.java:668)
>>       at com.carrotsearch.randomizedtesting.RandomizedRunner$3.evaluate(RandomizedRunner.java:687)
>>       at com.carrotsearch.randomizedtesting.RandomizedRunner$4.evaluate(RandomizedRunner.java:723)
>>       at com.carrotsearch.randomizedtesting.RandomizedRunner$5.evaluate(RandomizedRunner.java:734)
>>       at org.apache.lucene.util.SystemPropertiesRestoreRule$1.evaluate(SystemPropertiesRestoreRule.java:63)
>>       at org.apache.lucene.util.UncaughtExceptionsRule$1.evaluate(UncaughtExceptionsRule.java:75)
>>       at org.apache.lucene.util.StoreClassNameRule$1.evaluate(StoreClassNameRule.java:38)
>>       at org.apache.lucene.util.SystemPropertiesInvariantRule$1.evaluate(SystemPropertiesInvariantRule.java:69)
>>       at com.carrotsearch.randomizedtesting.RandomizedRunner.runSuite(RandomizedRunner.java:604)
>>       at com.carrotsearch.randomizedtesting.RandomizedRunner.access$400(RandomizedRunner.java:131)
>>       at com.carrotsearch.randomizedtesting.RandomizedRunner$2.run(RandomizedRunner.java:550)
>>
>>
>> REGRESSION:  org.apache.solr.cloud.FullSolrCloudDistribCmdsTest.testDistribSearch
>>
>> Error Message:
>> Could not get the port for ZooKeeper server
>>
>> Stack Trace:
>> java.lang.RuntimeException: Could not get the port for ZooKeeper server
>>       at org.apache.solr.cloud.ZkTestServer.run(ZkTestServer.java:239)
>>       at org.apache.solr.cloud.AbstractDistributedZkTestCase.setUp(AbstractDistributedZkTestCase.java:51)
>>       at org.apache.solr.cloud.FullSolrCloudTest.setUp(FullSolrCloudTest.java:146)
>>       at sun.reflect.NativeMethodAccessorImpl.invoke0(Native Method)
>>       at sun.reflect.NativeMethodAccessorImpl.invoke(NativeMethodAccessorImpl.java:57)
>>       at sun.reflect.DelegatingMethodAccessorImpl.invoke(DelegatingMethodAccessorImpl.java:43)
>>       at java.lang.reflect.Method.invoke(Method.java:616)
>>       at com.carrotsearch.randomizedtesting.RandomizedRunner.invoke(RandomizedRunner.java:1913)
>>       at com.carrotsearch.randomizedtesting.RandomizedRunner.access$1100(RandomizedRunner.java:131)
>>       at com.carrotsearch.randomizedtesting.RandomizedRunner$7.evaluate(RandomizedRunner.java:864)
>>       at com.carrotsearch.randomizedtesting.RandomizedRunner$8.evaluate(RandomizedRunner.java:880)
>>       at org.apache.lucene.util.SystemPropertiesRestoreRule$1.evaluate(SystemPropertiesRestoreRule.java:63)
>>       at org.apache.lucene.util.LuceneTestCase$SubclassSetupTeardownRule$1.evaluate(LuceneTestCase.java:760)
>>       at org.apache.lucene.util.LuceneTestCase$InternalSetupTeardownRule$1.evaluate(LuceneTestCase.java:682)
>>       at org.apache.lucene.util.SystemPropertiesInvariantRule$1.evaluate(SystemPropertiesInvariantRule.java:69)
>>       at org.apache.lucene.util.LuceneTestCase$TestResultInterceptorRule$1.evaluate(LuceneTestCase.java:615)
>>       at org.apache.lucene.util.UncaughtExceptionsRule$1.evaluate(UncaughtExceptionsRule.java:75)
>>       at org.apache.lucene.util.LuceneTestCase$SaveThreadAndTestNameRule$1.evaluate(LuceneTestCase.java:654)
>>       at com.carrotsearch.randomizedtesting.RandomizedRunner.runSingleTest(RandomizedRunner.java:812)
>>       at com.carrotsearch.randomizedtesting.RandomizedRunner.access$700(RandomizedRunner.java:131)
>>       at com.carrotsearch.randomizedtesting.RandomizedRunner$3$1.run(RandomizedRunner.java:668)
>>       at com.carrotsearch.randomizedtesting.RandomizedRunner$3.evaluate(RandomizedRunner.java:687)
>>       at com.carrotsearch.randomizedtesting.RandomizedRunner$4.evaluate(RandomizedRunner.java:723)
>>       at com.carrotsearch.randomizedtesting.RandomizedRunner$5.evaluate(RandomizedRunner.java:734)
>>       at org.apache.lucene.util.SystemPropertiesRestoreRule$1.evaluate(SystemPropertiesRestoreRule.java:63)
>>       at org.apache.lucene.util.UncaughtExceptionsRule$1.evaluate(UncaughtExceptionsRule.java:75)
>>       at org.apache.lucene.util.StoreClassNameRule$1.evaluate(StoreClassNameRule.java:38)
>>       at org.apache.lucene.util.SystemPropertiesInvariantRule$1.evaluate(SystemPropertiesInvariantRule.java:69)
>>       at com.carrotsearch.randomizedtesting.RandomizedRunner.runSuite(RandomizedRunner.java:604)
>>       at com.carrotsearch.randomizedtesting.RandomizedRunner.access$400(RandomizedRunner.java:131)
>>       at com.carrotsearch.randomizedtesting.RandomizedRunner$2.run(RandomizedRunner.java:550)
>>
>>
>> REGRESSION:  org.apache.solr.cloud.LeaderElectionIntegrationTest.testLeaderElectionAfterClientTimeout
>>
>> Error Message:
>> Could not get the port for ZooKeeper server
>>
>> Stack Trace:
>> java.lang.RuntimeException: Could not get the port for ZooKeeper server
>>       at org.apache.solr.cloud.ZkTestServer.run(ZkTestServer.java:239)
>>       at org.apache.solr.cloud.LeaderElectionIntegrationTest.setUp(LeaderElectionIntegrationTest.java:85)
>>       at sun.reflect.GeneratedMethodAccessor2.invoke(Unknown Source)
>>       at sun.reflect.DelegatingMethodAccessorImpl.invoke(DelegatingMethodAccessorImpl.java:43)
>>       at java.lang.reflect.Method.invoke(Method.java:616)
>>       at com.carrotsearch.randomizedtesting.RandomizedRunner.invoke(RandomizedRunner.java:1913)
>>       at com.carrotsearch.randomizedtesting.RandomizedRunner.access$1100(RandomizedRunner.java:131)
>>       at com.carrotsearch.randomizedtesting.RandomizedRunner$7.evaluate(RandomizedRunner.java:864)
>>       at com.carrotsearch.randomizedtesting.RandomizedRunner$8.evaluate(RandomizedRunner.java:880)
>>       at org.apache.lucene.util.SystemPropertiesRestoreRule$1.evaluate(SystemPropertiesRestoreRule.java:63)
>>       at org.apache.lucene.util.LuceneTestCase$SubclassSetupTeardownRule$1.evaluate(LuceneTestCase.java:760)
>>       at org.apache.lucene.util.LuceneTestCase$InternalSetupTeardownRule$1.evaluate(LuceneTestCase.java:682)
>>       at org.apache.lucene.util.SystemPropertiesInvariantRule$1.evaluate(SystemPropertiesInvariantRule.java:69)
>>       at org.apache.lucene.util.LuceneTestCase$TestResultInterceptorRule$1.evaluate(LuceneTestCase.java:615)
>>       at org.apache.lucene.util.UncaughtExceptionsRule$1.evaluate(UncaughtExceptionsRule.java:75)
>>       at org.apache.lucene.util.LuceneTestCase$SaveThreadAndTestNameRule$1.evaluate(LuceneTestCase.java:654)
>>       at com.carrotsearch.randomizedtesting.RandomizedRunner.runSingleTest(RandomizedRunner.java:812)
>>       at com.carrotsearch.randomizedtesting.RandomizedRunner.access$700(RandomizedRunner.java:131)
>>       at com.carrotsearch.randomizedtesting.RandomizedRunner$3$1.run(RandomizedRunner.java:668)
>>       at com.carrotsearch.randomizedtesting.RandomizedRunner$3.evaluate(RandomizedRunner.java:687)
>>       at com.carrotsearch.randomizedtesting.RandomizedRunner$4.evaluate(RandomizedRunner.java:723)
>>       at com.carrotsearch.randomizedtesting.RandomizedRunner$5.evaluate(RandomizedRunner.java:734)
>>       at org.apache.lucene.util.SystemPropertiesRestoreRule$1.evaluate(SystemPropertiesRestoreRule.java:63)
>>       at org.apache.lucene.util.UncaughtExceptionsRule$1.evaluate(UncaughtExceptionsRule.java:75)
>>       at org.apache.lucene.util.StoreClassNameRule$1.evaluate(StoreClassNameRule.java:38)
>>       at org.apache.lucene.util.SystemPropertiesInvariantRule$1.evaluate(SystemPropertiesInvariantRule.java:69)
>>       at com.carrotsearch.randomizedtesting.RandomizedRunner.runSuite(RandomizedRunner.java:604)
>>       at com.carrotsearch.randomizedtesting.RandomizedRunner.access$400(RandomizedRunner.java:131)
>>       at com.carrotsearch.randomizedtesting.RandomizedRunner$2.run(RandomizedRunner.java:550)
>>
>>
>> REGRESSION:  org.apache.solr.cloud.LeaderElectionIntegrationTest.testSimpleSliceLeaderElection
>>
>> Error Message:
>> Could not get the port for ZooKeeper server
>>
>> Stack Trace:
>> java.lang.RuntimeException: Could not get the port for ZooKeeper server
>>       at org.apache.solr.cloud.ZkTestServer.run(ZkTestServer.java:239)
>>       at org.apache.solr.cloud.LeaderElectionIntegrationTest.setUp(LeaderElectionIntegrationTest.java:85)
>>       at sun.reflect.GeneratedMethodAccessor2.invoke(Unknown Source)
>>       at sun.reflect.DelegatingMethodAccessorImpl.invoke(DelegatingMethodAccessorImpl.java:43)
>>       at java.lang.reflect.Method.invoke(Method.java:616)
>>       at com.carrotsearch.randomizedtesting.RandomizedRunner.invoke(RandomizedRunner.java:1913)
>>       at com.carrotsearch.randomizedtesting.RandomizedRunner.access$1100(RandomizedRunner.java:131)
>>       at com.carrotsearch.randomizedtesting.RandomizedRunner$7.evaluate(RandomizedRunner.java:864)
>>       at com.carrotsearch.randomizedtesting.RandomizedRunner$8.evaluate(RandomizedRunner.java:880)
>>       at org.apache.lucene.util.SystemPropertiesRestoreRule$1.evaluate(SystemPropertiesRestoreRule.java:63)
>>       at org.apache.lucene.util.LuceneTestCase$SubclassSetupTeardownRule$1.evaluate(LuceneTestCase.java:760)
>>       at org.apache.lucene.util.LuceneTestCase$InternalSetupTeardownRule$1.evaluate(LuceneTestCase.java:682)
>>       at org.apache.lucene.util.SystemPropertiesInvariantRule$1.evaluate(SystemPropertiesInvariantRule.java:69)
>>       at org.apache.lucene.util.LuceneTestCase$TestResultInterceptorRule$1.evaluate(LuceneTestCase.java:615)
>>       at org.apache.lucene.util.UncaughtExceptionsRule$1.evaluate(UncaughtExceptionsRule.java:75)
>>       at org.apache.lucene.util.LuceneTestCase$SaveThreadAndTestNameRule$1.evaluate(LuceneTestCase.java:654)
>>       at com.carrotsearch.randomizedtesting.RandomizedRunner.runSingleTest(RandomizedRunner.java:812)
>>       at com.carrotsearch.randomizedtesting.RandomizedRunner.access$700(RandomizedRunner.java:131)
>>       at com.carrotsearch.randomizedtesting.RandomizedRunner$3$1.run(RandomizedRunner.java:668)
>>       at com.carrotsearch.randomizedtesting.RandomizedRunner$3.evaluate(RandomizedRunner.java:687)
>>       at com.carrotsearch.randomizedtesting.RandomizedRunner$4.evaluate(RandomizedRunner.java:723)
>>       at com.carrotsearch.randomizedtesting.RandomizedRunner$5.evaluate(RandomizedRunner.java:734)
>>       at org.apache.lucene.util.SystemPropertiesRestoreRule$1.evaluate(SystemPropertiesRestoreRule.java:63)
>>       at org.apache.lucene.util.UncaughtExceptionsRule$1.evaluate(UncaughtExceptionsRule.java:75)
>>       at org.apache.lucene.util.StoreClassNameRule$1.evaluate(StoreClassNameRule.java:38)
>>       at org.apache.lucene.util.SystemPropertiesInvariantRule$1.evaluate(SystemPropertiesInvariantRule.java:69)
>>       at com.carrotsearch.randomizedtesting.RandomizedRunner.runSuite(RandomizedRunner.java:604)
>>       at com.carrotsearch.randomizedtesting.RandomizedRunner.access$400(RandomizedRunner.java:131)
>>       at com.carrotsearch.randomizedtesting.RandomizedRunner$2.run(RandomizedRunner.java:550)
>>
>>
>> REGRESSION:  org.apache.solr.cloud.LeaderElectionTest.testElection
>>
>> Error Message:
>> Could not get the port for ZooKeeper server
>>
>> Stack Trace:
>> java.lang.RuntimeException: Could not get the port for ZooKeeper server
>>       at org.apache.solr.cloud.ZkTestServer.run(ZkTestServer.java:239)
>>       at org.apache.solr.cloud.LeaderElectionTest.setUp(LeaderElectionTest.java:69)
>>       at sun.reflect.GeneratedMethodAccessor2.invoke(Unknown Source)
>>       at sun.reflect.DelegatingMethodAccessorImpl.invoke(DelegatingMethodAccessorImpl.java:43)
>>       at java.lang.reflect.Method.invoke(Method.java:616)
>>       at com.carrotsearch.randomizedtesting.RandomizedRunner.invoke(RandomizedRunner.java:1913)
>>       at com.carrotsearch.randomizedtesting.RandomizedRunner.access$1100(RandomizedRunner.java:131)
>>       at com.carrotsearch.randomizedtesting.RandomizedRunner$7.evaluate(RandomizedRunner.java:864)
>>       at com.carrotsearch.randomizedtesting.RandomizedRunner$8.evaluate(RandomizedRunner.java:880)
>>       at org.apache.lucene.util.SystemPropertiesRestoreRule$1.evaluate(SystemPropertiesRestoreRule.java:63)
>>       at org.apache.lucene.util.LuceneTestCase$SubclassSetupTeardownRule$1.evaluate(LuceneTestCase.java:760)
>>       at org.apache.lucene.util.LuceneTestCase$InternalSetupTeardownRule$1.evaluate(LuceneTestCase.java:682)
>>       at org.apache.lucene.util.SystemPropertiesInvariantRule$1.evaluate(SystemPropertiesInvariantRule.java:69)
>>       at org.apache.lucene.util.LuceneTestCase$TestResultInterceptorRule$1.evaluate(LuceneTestCase.java:615)
>>       at org.apache.lucene.util.UncaughtExceptionsRule$1.evaluate(UncaughtExceptionsRule.java:75)
>>       at org.apache.lucene.util.LuceneTestCase$SaveThreadAndTestNameRule$1.evaluate(LuceneTestCase.java:654)
>>       at com.carrotsearch.randomizedtesting.RandomizedRunner.runSingleTest(RandomizedRunner.java:812)
>>       at com.carrotsearch.randomizedtesting.RandomizedRunner.access$700(RandomizedRunner.java:131)
>>       at com.carrotsearch.randomizedtesting.RandomizedRunner$3$1.run(RandomizedRunner.java:668)
>>       at com.carrotsearch.randomizedtesting.RandomizedRunner$3.evaluate(RandomizedRunner.java:687)
>>       at com.carrotsearch.randomizedtesting.RandomizedRunner$4.evaluate(RandomizedRunner.java:723)
>>       at com.carrotsearch.randomizedtesting.RandomizedRunner$5.evaluate(RandomizedRunner.java:734)
>>       at org.apache.lucene.util.SystemPropertiesRestoreRule$1.evaluate(SystemPropertiesRestoreRule.java:63)
>>       at org.apache.lucene.util.UncaughtExceptionsRule$1.evaluate(UncaughtExceptionsRule.java:75)
>>       at org.apache.lucene.util.StoreClassNameRule$1.evaluate(StoreClassNameRule.java:38)
>>       at org.apache.lucene.util.SystemPropertiesInvariantRule$1.evaluate(SystemPropertiesInvariantRule.java:69)
>>       at com.carrotsearch.randomizedtesting.RandomizedRunner.runSuite(RandomizedRunner.java:604)
>>       at com.carrotsearch.randomizedtesting.RandomizedRunner.access$400(RandomizedRunner.java:131)
>>       at com.carrotsearch.randomizedtesting.RandomizedRunner$2.run(RandomizedRunner.java:550)
>>
>>
>> REGRESSION:  org.apache.solr.cloud.LeaderElectionTest.testCancelElection
>>
>> Error Message:
>> Could not get the port for ZooKeeper server
>>
>> Stack Trace:
>> java.lang.RuntimeException: Could not get the port for ZooKeeper server
>>       at org.apache.solr.cloud.ZkTestServer.run(ZkTestServer.java:239)
>>       at org.apache.solr.cloud.LeaderElectionTest.setUp(LeaderElectionTest.java:69)
>>       at sun.reflect.GeneratedMethodAccessor2.invoke(Unknown Source)
>>       at sun.reflect.DelegatingMethodAccessorImpl.invoke(DelegatingMethodAccessorImpl.java:43)
>>       at java.lang.reflect.Method.invoke(Method.java:616)
>>       at com.carrotsearch.randomizedtesting.RandomizedRunner.invoke(RandomizedRunner.java:1913)
>>       at com.carrotsearch.randomizedtesting.RandomizedRunner.access$1100(RandomizedRunner.java:131)
>>       at com.carrotsearch.randomizedtesting.RandomizedRunner$7.evaluate(RandomizedRunner.java:864)
>>       at com.carrotsearch.randomizedtesting.RandomizedRunner$8.evaluate(RandomizedRunner.java:880)
>>       at org.apache.lucene.util.SystemPropertiesRestoreRule$1.evaluate(SystemPropertiesRestoreRule.java:63)
>>       at org.apache.lucene.util.LuceneTestCase$SubclassSetupTeardownRule$1.evaluate(LuceneTestCase.java:760)
>>       at org.apache.lucene.util.LuceneTestCase$InternalSetupTeardownRule$1.evaluate(LuceneTestCase.java:682)
>>       at org.apache.lucene.util.SystemPropertiesInvariantRule$1.evaluate(SystemPropertiesInvariantRule.java:69)
>>       at org.apache.lucene.util.LuceneTestCase$TestResultInterceptorRule$1.evaluate(LuceneTestCase.java:615)
>>       at org.apache.lucene.util.UncaughtExceptionsRule$1.evaluate(UncaughtExceptionsRule.java:75)
>>       at org.apache.lucene.util.LuceneTestCase$SaveThreadAndTestNameRule$1.evaluate(LuceneTestCase.java:654)
>>       at com.carrotsearch.randomizedtesting.RandomizedRunner.runSingleTest(RandomizedRunner.java:812)
>>       at com.carrotsearch.randomizedtesting.RandomizedRunner.access$700(RandomizedRunner.java:131)
>>       at com.carrotsearch.randomizedtesting.RandomizedRunner$3$1.run(RandomizedRunner.java:668)
>>       at com.carrotsearch.randomizedtesting.RandomizedRunner$3.evaluate(RandomizedRunner.java:687)
>>       at com.carrotsearch.randomizedtesting.RandomizedRunner$4.evaluate(RandomizedRunner.java:723)
>>       at com.carrotsearch.randomizedtesting.RandomizedRunner$5.evaluate(RandomizedRunner.java:734)
>>       at org.apache.lucene.util.SystemPropertiesRestoreRule$1.evaluate(SystemPropertiesRestoreRule.java:63)
>>       at org.apache.lucene.util.UncaughtExceptionsRule$1.evaluate(UncaughtExceptionsRule.java:75)
>>       at org.apache.lucene.util.StoreClassNameRule$1.evaluate(StoreClassNameRule.java:38)
>>       at org.apache.lucene.util.SystemPropertiesInvariantRule$1.evaluate(SystemPropertiesInvariantRule.java:69)
>>       at com.carrotsearch.randomizedtesting.RandomizedRunner.runSuite(RandomizedRunner.java:604)
>>       at com.carrotsearch.randomizedtesting.RandomizedRunner.access$400(RandomizedRunner.java:131)
>>       at com.carrotsearch.randomizedtesting.RandomizedRunner$2.run(RandomizedRunner.java:550)
>>
>>
>> REGRESSION:  org.apache.solr.cloud.LeaderElectionTest.testBasic
>>
>> Error Message:
>> Could not get the port for ZooKeeper server
>>
>> Stack Trace:
>> java.lang.RuntimeException: Could not get the port for ZooKeeper server
>>       at org.apache.solr.cloud.ZkTestServer.run(ZkTestServer.java:239)
>>       at org.apache.solr.cloud.LeaderElectionTest.setUp(LeaderElectionTest.java:69)
>>       at sun.reflect.GeneratedMethodAccessor2.invoke(Unknown Source)
>>       at sun.reflect.DelegatingMethodAccessorImpl.invoke(DelegatingMethodAccessorImpl.java:43)
>>       at java.lang.reflect.Method.invoke(Method.java:616)
>>       at com.carrotsearch.randomizedtesting.RandomizedRunner.invoke(RandomizedRunner.java:1913)
>>       at com.carrotsearch.randomizedtesting.RandomizedRunner.access$1100(RandomizedRunner.java:131)
>>       at com.carrotsearch.randomizedtesting.RandomizedRunner$7.evaluate(RandomizedRunner.java:864)
>>       at com.carrotsearch.randomizedtesting.RandomizedRunner$8.evaluate(RandomizedRunner.java:880)
>>       at org.apache.lucene.util.SystemPropertiesRestoreRule$1.evaluate(SystemPropertiesRestoreRule.java:63)
>>       at org.apache.lucene.util.LuceneTestCase$SubclassSetupTeardownRule$1.evaluate(LuceneTestCase.java:760)
>>       at org.apache.lucene.util.LuceneTestCase$InternalSetupTeardownRule$1.evaluate(LuceneTestCase.java:682)
>>       at org.apache.lucene.util.SystemPropertiesInvariantRule$1.evaluate(SystemPropertiesInvariantRule.java:69)
>>       at org.apache.lucene.util.LuceneTestCase$TestResultInterceptorRule$1.evaluate(LuceneTestCase.java:615)
>>       at org.apache.lucene.util.UncaughtExceptionsRule$1.evaluate(UncaughtExceptionsRule.java:75)
>>       at org.apache.lucene.util.LuceneTestCase$SaveThreadAndTestNameRule$1.evaluate(LuceneTestCase.java:654)
>>       at com.carrotsearch.randomizedtesting.RandomizedRunner.runSingleTest(RandomizedRunner.java:812)
>>       at com.carrotsearch.randomizedtesting.RandomizedRunner.access$700(RandomizedRunner.java:131)
>>       at com.carrotsearch.randomizedtesting.RandomizedRunner$3$1.run(RandomizedRunner.java:668)
>>       at com.carrotsearch.randomizedtesting.RandomizedRunner$3.evaluate(RandomizedRunner.java:687)
>>       at com.carrotsearch.randomizedtesting.RandomizedRunner$4.evaluate(RandomizedRunner.java:723)
>>       at com.carrotsearch.randomizedtesting.RandomizedRunner$5.evaluate(RandomizedRunner.java:734)
>>       at org.apache.lucene.util.SystemPropertiesRestoreRule$1.evaluate(SystemPropertiesRestoreRule.java:63)
>>       at org.apache.lucene.util.UncaughtExceptionsRule$1.evaluate(UncaughtExceptionsRule.java:75)
>>       at org.apache.lucene.util.StoreClassNameRule$1.evaluate(StoreClassNameRule.java:38)
>>       at org.apache.lucene.util.SystemPropertiesInvariantRule$1.evaluate(SystemPropertiesInvariantRule.java:69)
>>       at com.carrotsearch.randomizedtesting.RandomizedRunner.runSuite(RandomizedRunner.java:604)
>>       at com.carrotsearch.randomizedtesting.RandomizedRunner.access$400(RandomizedRunner.java:131)
>>       at com.carrotsearch.randomizedtesting.RandomizedRunner$2.run(RandomizedRunner.java:550)
>>
>>
>> REGRESSION:  org.apache.solr.cloud.LeaderElectionTest.testStressElection
>>
>> Error Message:
>> Could not get the port for ZooKeeper server
>>
>> Stack Trace:
>> java.lang.RuntimeException: Could not get the port for ZooKeeper server
>>       at org.apache.solr.cloud.ZkTestServer.run(ZkTestServer.java:239)
>>       at org.apache.solr.cloud.LeaderElectionTest.setUp(LeaderElectionTest.java:69)
>>       at sun.reflect.GeneratedMethodAccessor2.invoke(Unknown Source)
>>       at sun.reflect.DelegatingMethodAccessorImpl.invoke(DelegatingMethodAccessorImpl.java:43)
>>       at java.lang.reflect.Method.invoke(Method.java:616)
>>       at com.carrotsearch.randomizedtesting.RandomizedRunner.invoke(RandomizedRunner.java:1913)
>>       at com.carrotsearch.randomizedtesting.RandomizedRunner.access$1100(RandomizedRunner.java:131)
>>       at com.carrotsearch.randomizedtesting.RandomizedRunner$7.evaluate(RandomizedRunner.java:864)
>>       at com.carrotsearch.randomizedtesting.RandomizedRunner$8.evaluate(RandomizedRunner.java:880)
>>       at org.apache.lucene.util.SystemPropertiesRestoreRule$1.evaluate(SystemPropertiesRestoreRule.java:63)
>>       at org.apache.lucene.util.LuceneTestCase$SubclassSetupTeardownRule$1.evaluate(LuceneTestCase.java:760)
>>       at org.apache.lucene.util.LuceneTestCase$InternalSetupTeardownRule$1.evaluate(LuceneTestCase.java:682)
>>       at org.apache.lucene.util.SystemPropertiesInvariantRule$1.evaluate(SystemPropertiesInvariantRule.java:69)
>>       at org.apache.lucene.util.LuceneTestCase$TestResultInterceptorRule$1.evaluate(LuceneTestCase.java:615)
>>       at org.apache.lucene.util.UncaughtExceptionsRule$1.evaluate(UncaughtExceptionsRule.java:75)
>>       at org.apache.lucene.util.LuceneTestCase$SaveThreadAndTestNameRule$1.evaluate(LuceneTestCase.java:654)
>>       at com.carrotsearch.randomizedtesting.RandomizedRunner.runSingleTest(RandomizedRunner.java:812)
>>       at com.carrotsearch.randomizedtesting.RandomizedRunner.access$700(RandomizedRunner.java:131)
>>       at com.carrotsearch.randomizedtesting.RandomizedRunner$3$1.run(RandomizedRunner.java:668)
>>       at com.carrotsearch.randomizedtesting.RandomizedRunner$3.evaluate(RandomizedRunner.java:687)
>>       at com.carrotsearch.randomizedtesting.RandomizedRunner$4.evaluate(RandomizedRunner.java:723)
>>       at com.carrotsearch.randomizedtesting.RandomizedRunner$5.evaluate(RandomizedRunner.java:734)
>>       at org.apache.lucene.util.SystemPropertiesRestoreRule$1.evaluate(SystemPropertiesRestoreRule.java:63)
>>       at org.apache.lucene.util.UncaughtExceptionsRule$1.evaluate(UncaughtExceptionsRule.java:75)
>>       at org.apache.lucene.util.StoreClassNameRule$1.evaluate(StoreClassNameRule.java:38)
>>       at org.apache.lucene.util.SystemPropertiesInvariantRule$1.evaluate(SystemPropertiesInvariantRule.java:69)
>>       at com.carrotsearch.randomizedtesting.RandomizedRunner.runSuite(RandomizedRunner.java:604)
>>       at com.carrotsearch.randomizedtesting.RandomizedRunner.access$400(RandomizedRunner.java:131)
>>       at com.carrotsearch.randomizedtesting.RandomizedRunner$2.run(RandomizedRunner.java:550)
>>
>>
>> REGRESSION:  org.apache.solr.cloud.NodeStateWatcherTest.testCoreAddDelete
>>
>> Error Message:
>> Could not get the port for ZooKeeper server
>>
>> Stack Trace:
>> java.lang.RuntimeException: Could not get the port for ZooKeeper server
>>       at __randomizedtesting.SeedInfo.seed([930B0939EDDD799F:4F02361DA0A1CCBB]:0)
>>       at org.apache.solr.cloud.ZkTestServer.run(ZkTestServer.java:239)
>>       at org.apache.solr.cloud.NodeStateWatcherTest.testCoreAddDelete(NodeStateWatcherTest.java:56)
>>       at sun.reflect.NativeMethodAccessorImpl.invoke0(Native Method)
>>       at sun.reflect.NativeMethodAccessorImpl.invoke(NativeMethodAccessorImpl.java:57)
>>       at sun.reflect.DelegatingMethodAccessorImpl.invoke(DelegatingMethodAccessorImpl.java:43)
>>       at java.lang.reflect.Method.invoke(Method.java:616)
>>       at com.carrotsearch.randomizedtesting.RandomizedRunner.invoke(RandomizedRunner.java:1913)
>>       at com.carrotsearch.randomizedtesting.RandomizedRunner.access$1100(RandomizedRunner.java:131)
>>       at com.carrotsearch.randomizedtesting.RandomizedRunner$6.evaluate(RandomizedRunner.java:805)
>>       at com.carrotsearch.randomizedtesting.RandomizedRunner$7.evaluate(RandomizedRunner.java:866)
>>       at com.carrotsearch.randomizedtesting.RandomizedRunner$8.evaluate(RandomizedRunner.java:880)
>>       at org.apache.lucene.util.SystemPropertiesRestoreRule$1.evaluate(SystemPropertiesRestoreRule.java:63)
>>       at org.apache.lucene.util.LuceneTestCase$SubclassSetupTeardownRule$1.evaluate(LuceneTestCase.java:760)
>>       at org.apache.lucene.util.LuceneTestCase$InternalSetupTeardownRule$1.evaluate(LuceneTestCase.java:682)
>>       at org.apache.lucene.util.SystemPropertiesInvariantRule$1.evaluate(SystemPropertiesInvariantRule.java:69)
>>       at org.apache.lucene.util.LuceneTestCase$TestResultInterceptorRule$1.evaluate(LuceneTestCase.java:615)
>>       at org.apache.lucene.util.UncaughtExceptionsRule$1.evaluate(UncaughtExceptionsRule.java:75)
>>       at org.apache.lucene.util.LuceneTestCase$SaveThreadAndTestNameRule$1.evaluate(LuceneTestCase.java:654)
>>       at com.carrotsearch.randomizedtesting.RandomizedRunner.runSingleTest(RandomizedRunner.java:812)
>>       at com.carrotsearch.randomizedtesting.RandomizedRunner.access$700(RandomizedRunner.java:131)
>>       at com.carrotsearch.randomizedtesting.RandomizedRunner$3$1.run(RandomizedRunner.java:668)
>>       at com.carrotsearch.randomizedtesting.RandomizedRunner$3.evaluate(RandomizedRunner.java:687)
>>       at com.carrotsearch.randomizedtesting.RandomizedRunner$4.evaluate(RandomizedRunner.java:723)
>>       at com.carrotsearch.randomizedtesting.RandomizedRunner$5.evaluate(RandomizedRunner.java:734)
>>       at org.apache.lucene.util.SystemPropertiesRestoreRule$1.evaluate(SystemPropertiesRestoreRule.java:63)
>>       at org.apache.lucene.util.UncaughtExceptionsRule$1.evaluate(UncaughtExceptionsRule.java:75)
>>       at org.apache.lucene.util.StoreClassNameRule$1.evaluate(StoreClassNameRule.java:38)
>>       at org.apache.lucene.util.SystemPropertiesInvariantRule$1.evaluate(SystemPropertiesInvariantRule.java:69)
>>       at com.carrotsearch.randomizedtesting.RandomizedRunner.runSuite(RandomizedRunner.java:604)
>>       at com.carrotsearch.randomizedtesting.RandomizedRunner.access$400(RandomizedRunner.java:131)
>>       at com.carrotsearch.randomizedtesting.RandomizedRunner$2.run(RandomizedRunner.java:550)
>>
>>
>> REGRESSION:  org.apache.solr.cloud.OverseerTest.testDoubleAssignment
>>
>> Error Message:
>> null
>>
>> Stack Trace:
>> java.lang.NullPointerException
>>       at __randomizedtesting.SeedInfo.seed([B62596AF0EC664E1:F660C544459B71B7]:0)
>>       at org.apache.solr.cloud.ZkTestServer$ZKServerMain.shutdown(ZkTestServer.java:116)
>>       at org.apache.solr.cloud.ZkTestServer.shutdown(ZkTestServer.java:248)
>>       at org.apache.solr.cloud.OverseerTest.testDoubleAssignment(OverseerTest.java:807)
>>       at sun.reflect.NativeMethodAccessorImpl.invoke0(Native Method)
>>       at sun.reflect.NativeMethodAccessorImpl.invoke(NativeMethodAccessorImpl.java:57)
>>       at sun.reflect.DelegatingMethodAccessorImpl.invoke(DelegatingMethodAccessorImpl.java:43)
>>       at java.lang.reflect.Method.invoke(Method.java:616)
>>       at com.carrotsearch.randomizedtesting.RandomizedRunner.invoke(RandomizedRunner.java:1913)
>>       at com.carrotsearch.randomizedtesting.RandomizedRunner.access$1100(RandomizedRunner.java:131)
>>       at com.carrotsearch.randomizedtesting.RandomizedRunner$6.evaluate(RandomizedRunner.java:805)
>>       at com.carrotsearch.randomizedtesting.RandomizedRunner$7.evaluate(RandomizedRunner.java:866)
>>       at com.carrotsearch.randomizedtesting.RandomizedRunner$8.evaluate(RandomizedRunner.java:880)
>>       at org.apache.lucene.util.SystemPropertiesRestoreRule$1.evaluate(SystemPropertiesRestoreRule.java:63)
>>       at org.apache.lucene.util.LuceneTestCase$SubclassSetupTeardownRule$1.evaluate(LuceneTestCase.java:760)
>>       at org.apache.lucene.util.LuceneTestCase$InternalSetupTeardownRule$1.evaluate(LuceneTestCase.java:682)
>>       at org.apache.lucene.util.SystemPropertiesInvariantRule$1.evaluate(SystemPropertiesInvariantRule.java:69)
>>       at org.apache.lucene.util.LuceneTestCase$TestResultInterceptorRule$1.evaluate(LuceneTestCase.java:615)
>>       at org.apache.lucene.util.UncaughtExceptionsRule$1.evaluate(UncaughtExceptionsRule.java:75)
>>       at org.apache.lucene.util.LuceneTestCase$SaveThreadAndTestNameRule$1.evaluate(LuceneTestCase.java:654)
>>       at com.carrotsearch.randomizedtesting.RandomizedRunner.runSingleTest(RandomizedRunner.java:812)
>>       at com.carrotsearch.randomizedtesting.RandomizedRunner.access$700(RandomizedRunner.java:131)
>>       at com.carrotsearch.randomizedtesting.RandomizedRunner$3$1.run(RandomizedRunner.java:668)
>>       at com.carrotsearch.randomizedtesting.RandomizedRunner$3.evaluate(RandomizedRunner.java:687)
>>       at com.carrotsearch.randomizedtesting.RandomizedRunner$4.evaluate(RandomizedRunner.java:723)
>>       at com.carrotsearch.randomizedtesting.RandomizedRunner$5.evaluate(RandomizedRunner.java:734)
>>       at org.apache.lucene.util.SystemPropertiesRestoreRule$1.evaluate(SystemPropertiesRestoreRule.java:63)
>>       at org.apache.lucene.util.UncaughtExceptionsRule$1.evaluate(UncaughtExceptionsRule.java:75)
>>       at org.apache.lucene.util.StoreClassNameRule$1.evaluate(StoreClassNameRule.java:38)
>>       at org.apache.lucene.util.SystemPropertiesInvariantRule$1.evaluate(SystemPropertiesInvariantRule.java:69)
>>       at com.carrotsearch.randomizedtesting.RandomizedRunner.runSuite(RandomizedRunner.java:604)
>>       at com.carrotsearch.randomizedtesting.RandomizedRunner.access$400(RandomizedRunner.java:131)
>>       at com.carrotsearch.randomizedtesting.RandomizedRunner$2.run(RandomizedRunner.java:550)
>>
>>
>> REGRESSION:  org.apache.solr.cloud.OverseerTest.testShardAssignmentBigger
>>
>> Error Message:
>> null
>>
>> Stack Trace:
>> java.lang.NullPointerException
>>       at __randomizedtesting.SeedInfo.seed([B62596AF0EC664E1:25CB68D4E4AF9B82]:0)
>>       at org.apache.solr.cloud.ZkTestServer$ZKServerMain.shutdown(ZkTestServer.java:116)
>>       at org.apache.solr.cloud.ZkTestServer.shutdown(ZkTestServer.java:248)
>>       at org.apache.solr.cloud.OverseerTest.testShardAssignmentBigger(OverseerTest.java:415)
>>       at sun.reflect.NativeMethodAccessorImpl.invoke0(Native Method)
>>       at sun.reflect.NativeMethodAccessorImpl.invoke(NativeMethodAccessorImpl.java:57)
>>       at sun.reflect.DelegatingMethodAccessorImpl.invoke(DelegatingMethodAccessorImpl.java:43)
>>       at java.lang.reflect.Method.invoke(Method.java:616)
>>       at com.carrotsearch.randomizedtesting.RandomizedRunner.invoke(RandomizedRunner.java:1913)
>>       at com.carrotsearch.randomizedtesting.RandomizedRunner.access$1100(RandomizedRunner.java:131)
>>       at com.carrotsearch.randomizedtesting.RandomizedRunner$6.evaluate(RandomizedRunner.java:805)
>>       at com.carrotsearch.randomizedtesting.RandomizedRunner$7.evaluate(RandomizedRunner.java:866)
>>       at com.carrotsearch.randomizedtesting.RandomizedRunner$8.evaluate(RandomizedRunner.java:880)
>>       at org.apache.lucene.util.SystemPropertiesRestoreRule$1.evaluate(SystemPropertiesRestoreRule.java:63)
>>       at org.apache.lucene.util.LuceneTestCase$SubclassSetupTeardownRule$1.evaluate(LuceneTestCase.java:760)
>>       at org.apache.lucene.util.LuceneTestCase$InternalSetupTeardownRule$1.evaluate(LuceneTestCase.java:682)
>>       at org.apache.lucene.util.SystemPropertiesInvariantRule$1.evaluate(SystemPropertiesInvariantRule.java:69)
>>       at org.apache.lucene.util.LuceneTestCase$TestResultInterceptorRule$1.evaluate(LuceneTestCase.java:615)
>>       at org.apache.lucene.util.UncaughtExceptionsRule$1.evaluate(UncaughtExceptionsRule.java:75)
>>       at org.apache.lucene.util.LuceneTestCase$SaveThreadAndTestNameRule$1.evaluate(LuceneTestCase.java:654)
>>       at com.carrotsearch.randomizedtesting.RandomizedRunner.runSingleTest(RandomizedRunner.java:812)
>>       at com.carrotsearch.randomizedtesting.RandomizedRunner.access$700(RandomizedRunner.java:131)
>>       at com.carrotsearch.randomizedtesting.RandomizedRunner$3$1.run(RandomizedRunner.java:668)
>>       at com.carrotsearch.randomizedtesting.RandomizedRunner$3.evaluate(RandomizedRunner.java:687)
>>       at com.carrotsearch.randomizedtesting.RandomizedRunner$4.evaluate(RandomizedRunner.java:723)
>>       at com.carrotsearch.randomizedtesting.RandomizedRunner$5.evaluate(RandomizedRunner.java:734)
>>       at org.apache.lucene.util.SystemPropertiesRestoreRule$1.evaluate(SystemPropertiesRestoreRule.java:63)
>>       at org.apache.lucene.util.UncaughtExceptionsRule$1.evaluate(UncaughtExceptionsRule.java:75)
>>       at org.apache.lucene.util.StoreClassNameRule$1.evaluate(StoreClassNameRule.java:38)
>>       at org.apache.lucene.util.SystemPropertiesInvariantRule$1.evaluate(SystemPropertiesInvariantRule.java:69)
>>       at com.carrotsearch.randomizedtesting.RandomizedRunner.runSuite(RandomizedRunner.java:604)
>>       at com.carrotsearch.randomizedtesting.RandomizedRunner.access$400(RandomizedRunner.java:131)
>>       at com.carrotsearch.randomizedtesting.RandomizedRunner$2.run(RandomizedRunner.java:550)
>>
>>
>> REGRESSION:  org.apache.solr.cloud.OverseerTest.testPlaceholders
>>
>> Error Message:
>> null
>>
>> Stack Trace:
>> java.lang.NullPointerException
>>       at __randomizedtesting.SeedInfo.seed([B62596AF0EC664E1:FC842F2436D5CA7B]:0)
>>       at org.apache.solr.cloud.ZkTestServer$ZKServerMain.shutdown(ZkTestServer.java:116)
>>       at org.apache.solr.cloud.ZkTestServer.shutdown(ZkTestServer.java:248)
>>       at org.apache.solr.cloud.OverseerTest.testPlaceholders(OverseerTest.java:858)
>>       at sun.reflect.NativeMethodAccessorImpl.invoke0(Native Method)
>>       at sun.reflect.NativeMethodAccessorImpl.invoke(NativeMethodAccessorImpl.java:57)
>>       at sun.reflect.DelegatingMethodAccessorImpl.invoke(DelegatingMethodAccessorImpl.java:43)
>>       at java.lang.reflect.Method.invoke(Method.java:616)
>>       at com.carrotsearch.randomizedtesting.RandomizedRunner.invoke(RandomizedRunner.java:1913)
>>       at com.carrotsearch.randomizedtesting.RandomizedRunner.access$1100(RandomizedRunner.java:131)
>>       at com.carrotsearch.randomizedtesting.RandomizedRunner$6.evaluate(RandomizedRunner.java:805)
>>       at com.carrotsearch.randomizedtesting.RandomizedRunner$7.evaluate(RandomizedRunner.java:866)
>>       at com.carrotsearch.randomizedtesting.RandomizedRunner$8.evaluate(RandomizedRunner.java:880)
>>       at org.apache.lucene.util.SystemPropertiesRestoreRule$1.evaluate(SystemPropertiesRestoreRule.java:63)
>>       at org.apache.lucene.util.LuceneTestCase$SubclassSetupTeardownRule$1.evaluate(LuceneTestCase.java:760)
>>       at org.apache.lucene.util.LuceneTestCase$InternalSetupTeardownRule$1.evaluate(LuceneTestCase.java:682)
>>       at org.apache.lucene.util.SystemPropertiesInvariantRule$1.evaluate(SystemPropertiesInvariantRule.java:69)
>>       at org.apache.lucene.util.LuceneTestCase$TestResultInterceptorRule$1.evaluate(LuceneTestCase.java:615)
>>       at org.apache.lucene.util.UncaughtExceptionsRule$1.evaluate(UncaughtExceptionsRule.java:75)
>>       at org.apache.lucene.util.LuceneTestCase$SaveThreadAndTestNameRule$1.evaluate(LuceneTestCase.java:654)
>>       at com.carrotsearch.randomizedtesting.RandomizedRunner.runSingleTest(RandomizedRunner.java:812)
>>       at com.carrotsearch.randomizedtesting.RandomizedRunner.access$700(RandomizedRunner.java:131)
>>       at com.carrotsearch.randomizedtesting.RandomizedRunner$3$1.run(RandomizedRunner.java:668)
>>       at com.carrotsearch.randomizedtesting.RandomizedRunner$3.evaluate(RandomizedRunner.java:687)
>>       at com.carrotsearch.randomizedtesting.RandomizedRunner$4.evaluate(RandomizedRunner.java:723)
>>       at com.carrotsearch.randomizedtesting.RandomizedRunner$5.evaluate(RandomizedRunner.java:734)
>>       at org.apache.lucene.util.SystemPropertiesRestoreRule$1.evaluate(SystemPropertiesRestoreRule.java:63)
>>       at org.apache.lucene.util.UncaughtExceptionsRule$1.evaluate(UncaughtExceptionsRule.java:75)
>>       at org.apache.lucene.util.StoreClassNameRule$1.evaluate(StoreClassNameRule.java:38)
>>       at org.apache.lucene.util.SystemPropertiesInvariantRule$1.evaluate(SystemPropertiesInvariantRule.java:69)
>>       at com.carrotsearch.randomizedtesting.RandomizedRunner.runSuite(RandomizedRunner.java:604)
>>       at com.carrotsearch.randomizedtesting.RandomizedRunner.access$400(RandomizedRunner.java:131)
>>       at com.carrotsearch.randomizedtesting.RandomizedRunner$2.run(RandomizedRunner.java:550)
>>
>>
>> REGRESSION:  org.apache.solr.cloud.OverseerTest.testOverseerFailure
>>
>> Error Message:
>> null
>>
>> Stack Trace:
>> java.lang.NullPointerException
>>       at __randomizedtesting.SeedInfo.seed([B62596AF0EC664E1:B22D195C1C638BC0]:0)
>>       at org.apache.solr.cloud.ZkTestServer$ZKServerMain.shutdown(ZkTestServer.java:116)
>>       at org.apache.solr.cloud.ZkTestServer.shutdown(ZkTestServer.java:248)
>>       at org.apache.solr.cloud.OverseerTest.testOverseerFailure(OverseerTest.java:629)
>>       at sun.reflect.NativeMethodAccessorImpl.invoke0(Native Method)
>>       at sun.reflect.NativeMethodAccessorImpl.invoke(NativeMethodAccessorImpl.java:57)
>>       at sun.reflect.DelegatingMethodAccessorImpl.invoke(DelegatingMethodAccessorImpl.java:43)
>>       at java.lang.reflect.Method.invoke(Method.java:616)
>>       at com.carrotsearch.randomizedtesting.RandomizedRunner.invoke(RandomizedRunner.java:1913)
>>       at com.carrotsearch.randomizedtesting.RandomizedRunner.access$1100(RandomizedRunner.java:131)
>>       at com.carrotsearch.randomizedtesting.RandomizedRunner$6.evaluate(RandomizedRunner.java:805)
>>       at com.carrotsearch.randomizedtesting.RandomizedRunner$7.evaluate(RandomizedRunner.java:866)
>>       at com.carrotsearch.randomizedtesting.RandomizedRunner$8.evaluate(RandomizedRunner.java:880)
>>       at org.apache.lucene.util.SystemPropertiesRestoreRule$1.evaluate(SystemPropertiesRestoreRule.java:63)
>>       at org.apache.lucene.util.LuceneTestCase$SubclassSetupTeardownRule$1.evaluate(LuceneTestCase.java:760)
>>       at org.apache.lucene.util.LuceneTestCase$InternalSetupTeardownRule$1.evaluate(LuceneTestCase.java:682)
>>       at org.apache.lucene.util.SystemPropertiesInvariantRule$1.evaluate(SystemPropertiesInvariantRule.java:69)
>>       at org.apache.lucene.util.LuceneTestCase$TestResultInterceptorRule$1.evaluate(LuceneTestCase.java:615)
>>       at org.apache.lucene.util.UncaughtExceptionsRule$1.evaluate(UncaughtExceptionsRule.java:75)
>>       at org.apache.lucene.util.LuceneTestCase$SaveThreadAndTestNameRule$1.evaluate(LuceneTestCase.java:654)
>>       at com.carrotsearch.randomizedtesting.RandomizedRunner.runSingleTest(RandomizedRunner.java:812)
>>       at com.carrotsearch.randomizedtesting.RandomizedRunner.access$700(RandomizedRunner.java:131)
>>       at com.carrotsearch.randomizedtesting.RandomizedRunner$3$1.run(RandomizedRunner.java:668)
>>       at com.carrotsearch.randomizedtesting.RandomizedRunner$3.evaluate(RandomizedRunner.java:687)
>>       at com.carrotsearch.randomizedtesting.RandomizedRunner$4.evaluate(RandomizedRunner.java:723)
>>       at com.carrotsearch.randomizedtesting.RandomizedRunner$5.evaluate(RandomizedRunner.java:734)
>>       at org.apache.lucene.util.SystemPropertiesRestoreRule$1.evaluate(SystemPropertiesRestoreRule.java:63)
>>       at org.apache.lucene.util.UncaughtExceptionsRule$1.evaluate(UncaughtExceptionsRule.java:75)
>>       at org.apache.lucene.util.StoreClassNameRule$1.evaluate(StoreClassNameRule.java:38)
>>       at org.apache.lucene.util.SystemPropertiesInvariantRule$1.evaluate(SystemPropertiesInvariantRule.java:69)
>>       at com.carrotsearch.randomizedtesting.RandomizedRunner.runSuite(RandomizedRunner.java:604)
>>       at com.carrotsearch.randomizedtesting.RandomizedRunner.access$400(RandomizedRunner.java:131)
>>       at com.carrotsearch.randomizedtesting.RandomizedRunner$2.run(RandomizedRunner.java:550)
>>
>>
>> REGRESSION:  org.apache.solr.cloud.OverseerTest.testStateChange
>>
>> Error Message:
>> null
>>
>> Stack Trace:
>> java.lang.NullPointerException
>>       at __randomizedtesting.SeedInfo.seed([B62596AF0EC664E1:95A1828ED2E58536]:0)
>>       at org.apache.solr.cloud.ZkTestServer$ZKServerMain.shutdown(ZkTestServer.java:116)
>>       at org.apache.solr.cloud.ZkTestServer.shutdown(ZkTestServer.java:248)
>>       at org.apache.solr.cloud.OverseerTest.testStateChange(OverseerTest.java:518)
>>       at sun.reflect.NativeMethodAccessorImpl.invoke0(Native Method)
>>       at sun.reflect.NativeMethodAccessorImpl.invoke(NativeMethodAccessorImpl.java:57)
>>       at sun.reflect.DelegatingMethodAccessorImpl.invoke(DelegatingMethodAccessorImpl.java:43)
>>       at java.lang.reflect.Method.invoke(Method.java:616)
>>       at com.carrotsearch.randomizedtesting.RandomizedRunner.invoke(RandomizedRunner.java:1913)
>>       at com.carrotsearch.randomizedtesting.RandomizedRunner.access$1100(RandomizedRunner.java:131)
>>       at com.carrotsearch.randomizedtesting.RandomizedRunner$6.evaluate(RandomizedRunner.java:805)
>>       at com.carrotsearch.randomizedtesting.RandomizedRunner$7.evaluate(RandomizedRunner.java:866)
>>       at com.carrotsearch.randomizedtesting.RandomizedRunner$8.evaluate(RandomizedRunner.java:880)
>>       at org.apache.lucene.util.SystemPropertiesRestoreRule$1.evaluate(SystemPropertiesRestoreRule.java:63)
>>       at org.apache.lucene.util.LuceneTestCase$SubclassSetupTeardownRule$1.evaluate(LuceneTestCase.java:760)
>>       at org.apache.lucene.util.LuceneTestCase$InternalSetupTeardownRule$1.evaluate(LuceneTestCase.java:682)
>>       at org.apache.lucene.util.SystemPropertiesInvariantRule$1.evaluate(SystemPropertiesInvariantRule.java:69)
>>       at org.apache.lucene.util.LuceneTestCase$TestResultInterceptorRule$1.evaluate(LuceneTestCase.java:615)
>>       at org.apache.lucene.util.UncaughtExceptionsRule$1.evaluate(UncaughtExceptionsRule.java:75)
>>       at org.apache.lucene.util.LuceneTestCase$SaveThreadAndTestNameRule$1.evaluate(LuceneTestCase.java:654)
>>       at com.carrotsearch.randomizedtesting.RandomizedRunner.runSingleTest(RandomizedRunner.java:812)
>>       at com.carrotsearch.randomizedtesting.RandomizedRunner.access$700(RandomizedRunner.java:131)
>>       at com.carrotsearch.randomizedtesting.RandomizedRunner$3$1.run(RandomizedRunner.java:668)
>>       at com.carrotsearch.randomizedtesting.RandomizedRunner$3.evaluate(RandomizedRunner.java:687)
>>       at com.carrotsearch.randomizedtesting.RandomizedRunner$4.evaluate(RandomizedRunner.java:723)
>>       at com.carrotsearch.randomizedtesting.RandomizedRunner$5.evaluate(RandomizedRunner.java:734)
>>       at org.apache.lucene.util.SystemPropertiesRestoreRule$1.evaluate(SystemPropertiesRestoreRule.java:63)
>>       at org.apache.lucene.util.UncaughtExceptionsRule$1.evaluate(UncaughtExceptionsRule.java:75)
>>       at org.apache.lucene.util.StoreClassNameRule$1.evaluate(StoreClassNameRule.java:38)
>>       at org.apache.lucene.util.SystemPropertiesInvariantRule$1.evaluate(SystemPropertiesInvariantRule.java:69)
>>       at com.carrotsearch.randomizedtesting.RandomizedRunner.runSuite(RandomizedRunner.java:604)
>>       at com.carrotsearch.randomizedtesting.RandomizedRunner.access$400(RandomizedRunner.java:131)
>>       at com.carrotsearch.randomizedtesting.RandomizedRunner$2.run(RandomizedRunner.java:550)
>>
>>
>> REGRESSION:  org.apache.solr.cloud.OverseerTest.testShardAssignment
>>
>> Error Message:
>> null
>>
>> Stack Trace:
>> java.lang.NullPointerException
>>       at __randomizedtesting.SeedInfo.seed([B62596AF0EC664E1:CF3D99FF719DE0BD]:0)
>>       at org.apache.solr.cloud.ZkTestServer$ZKServerMain.shutdown(ZkTestServer.java:116)
>>       at org.apache.solr.cloud.ZkTestServer.shutdown(ZkTestServer.java:248)
>>       at org.apache.solr.cloud.OverseerTest.testShardAssignment(OverseerTest.java:254)
>>       at sun.reflect.NativeMethodAccessorImpl.invoke0(Native Method)
>>       at sun.reflect.NativeMethodAccessorImpl.invoke(NativeMethodAccessorImpl.java:57)
>>       at sun.reflect.DelegatingMethodAccessorImpl.invoke(DelegatingMethodAccessorImpl.java:43)
>>       at java.lang.reflect.Method.invoke(Method.java:616)
>>       at com.carrotsearch.randomizedtesting.RandomizedRunner.invoke(RandomizedRunner.java:1913)
>>       at com.carrotsearch.randomizedtesting.RandomizedRunner.access$1100(RandomizedRunner.java:131)
>>       at com.carrotsearch.randomizedtesting.RandomizedRunner$6.evaluate(RandomizedRunner.java:805)
>>       at com.carrotsearch.randomizedtesting.RandomizedRunner$7.evaluate(RandomizedRunner.java:866)
>>       at com.carrotsearch.randomizedtesting.RandomizedRunner$8.evaluate(RandomizedRunner.java:880)
>>       at org.apache.lucene.util.SystemPropertiesRestoreRule$1.evaluate(SystemPropertiesRestoreRule.java:63)
>>       at org.apache.lucene.util.LuceneTestCase$SubclassSetupTeardownRule$1.evaluate(LuceneTestCase.java:760)
>>       at org.apache.lucene.util.LuceneTestCase$InternalSetupTeardownRule$1.evaluate(LuceneTestCase.java:682)
>>       at org.apache.lucene.util.SystemPropertiesInvariantRule$1.evaluate(SystemPropertiesInvariantRule.java:69)
>>       at org.apache.lucene.util.LuceneTestCase$TestResultInterceptorRule$1.evaluate(LuceneTestCase.java:615)
>>       at org.apache.lucene.util.UncaughtExceptionsRule$1.evaluate(UncaughtExceptionsRule.java:75)
>>       at org.apache.lucene.util.LuceneTestCase$SaveThreadAndTestNameRule$1.evaluate(LuceneTestCase.java:654)
>>       at com.carrotsearch.randomizedtesting.RandomizedRunner.runSingleTest(RandomizedRunner.java:812)
>>       at com.carrotsearch.randomizedtesting.RandomizedRunner.access$700(RandomizedRunner.java:131)
>>       at com.carrotsearch.randomizedtesting.RandomizedRunner$3$1.run(RandomizedRunner.java:668)
>>       at com.carrotsearch.randomizedtesting.RandomizedRunner$3.evaluate(RandomizedRunner.java:687)
>>       at com.carrotsearch.randomizedtesting.RandomizedRunner$4.evaluate(RandomizedRunner.java:723)
>>       at com.carrotsearch.randomizedtesting.RandomizedRunner$5.evaluate(RandomizedRunner.java:734)
>>       at org.apache.lucene.util.SystemPropertiesRestoreRule$1.evaluate(SystemPropertiesRestoreRule.java:63)
>>       at org.apache.lucene.util.UncaughtExceptionsRule$1.evaluate(UncaughtExceptionsRule.java:75)
>>       at org.apache.lucene.util.StoreClassNameRule$1.evaluate(StoreClassNameRule.java:38)
>>       at org.apache.lucene.util.SystemPropertiesInvariantRule$1.evaluate(SystemPropertiesInvariantRule.java:69)
>>       at com.carrotsearch.randomizedtesting.RandomizedRunner.runSuite(RandomizedRunner.java:604)
>>       at com.carrotsearch.randomizedtesting.RandomizedRunner.access$400(RandomizedRunner.java:131)
>>       at com.carrotsearch.randomizedtesting.RandomizedRunner$2.run(RandomizedRunner.java:550)
>>
>>
>> REGRESSION:  org.apache.solr.cloud.OverseerTest.testShardLeaderChange
>>
>> Error Message:
>> null
>>
>> Stack Trace:
>> java.lang.NullPointerException
>>       at __randomizedtesting.SeedInfo.seed([B62596AF0EC664E1:68761158145E9110]:0)
>>       at org.apache.solr.cloud.ZkTestServer$ZKServerMain.shutdown(ZkTestServer.java:116)
>>       at org.apache.solr.cloud.ZkTestServer.shutdown(ZkTestServer.java:248)
>>       at org.apache.solr.cloud.OverseerTest.testShardLeaderChange(OverseerTest.java:734)
>>       at sun.reflect.NativeMethodAccessorImpl.invoke0(Native Method)
>>       at sun.reflect.NativeMethodAccessorImpl.invoke(NativeMethodAccessorImpl.java:57)
>>       at sun.reflect.DelegatingMethodAccessorImpl.invoke(DelegatingMethodAccessorImpl.java:43)
>>       at java.lang.reflect.Method.invoke(Method.java:616)
>>       at com.carrotsearch.randomizedtesting.RandomizedRunner.invoke(RandomizedRunner.java:1913)
>>       at com.carrotsearch.randomizedtesting.RandomizedRunner.access$1100(RandomizedRunner.java:131)
>>       at com.carrotsearch.randomizedtesting.RandomizedRunner$6.evaluate(RandomizedRunner.java:805)
>>       at com.carrotsearch.randomizedtesting.RandomizedRunner$7.evaluate(RandomizedRunner.java:866)
>>       at com.carrotsearch.randomizedtesting.RandomizedRunner$8.evaluate(RandomizedRunner.java:880)
>>       at org.apache.lucene.util.SystemPropertiesRestoreRule$1.evaluate(SystemPropertiesRestoreRule.java:63)
>>       at org.apache.lucene.util.LuceneTestCase$SubclassSetupTeardownRule$1.evaluate(LuceneTestCase.java:760)
>>       at org.apache.lucene.util.LuceneTestCase$InternalSetupTeardownRule$1.evaluate(LuceneTestCase.java:682)
>>       at org.apache.lucene.util.SystemPropertiesInvariantRule$1.evaluate(SystemPropertiesInvariantRule.java:69)
>>       at org.apache.lucene.util.LuceneTestCase$TestResultInterceptorRule$1.evaluate(LuceneTestCase.java:615)
>>       at org.apache.lucene.util.UncaughtExceptionsRule$1.evaluate(UncaughtExceptionsRule.java:75)
>>       at org.apache.lucene.util.LuceneTestCase$SaveThreadAndTestNameRule$1.evaluate(LuceneTestCase.java:654)
>>       at com.carrotsearch.randomizedtesting.RandomizedRunner.runSingleTest(RandomizedRunner.java:812)
>>       at com.carrotsearch.randomizedtesting.RandomizedRunner.access$700(RandomizedRunner.java:131)
>>       at com.carrotsearch.randomizedtesting.RandomizedRunner$3$1.run(RandomizedRunner.java:668)
>>       at com.carrotsearch.randomizedtesting.RandomizedRunner$3.evaluate(RandomizedRunner.java:687)
>>       at com.carrotsearch.randomizedtesting.RandomizedRunner$4.evaluate(RandomizedRunner.java:723)
>>       at com.carrotsearch.randomizedtesting.RandomizedRunner$5.evaluate(RandomizedRunner.java:734)
>>       at org.apache.lucene.util.SystemPropertiesRestoreRule$1.evaluate(SystemPropertiesRestoreRule.java:63)
>>       at org.apache.lucene.util.UncaughtExceptionsRule$1.evaluate(UncaughtExceptionsRule.java:75)
>>       at org.apache.lucene.util.StoreClassNameRule$1.evaluate(StoreClassNameRule.java:38)
>>       at org.apache.lucene.util.SystemPropertiesInvariantRule$1.evaluate(SystemPropertiesInvariantRule.java:69)
>>       at com.carrotsearch.randomizedtesting.RandomizedRunner.runSuite(RandomizedRunner.java:604)
>>       at com.carrotsearch.randomizedtesting.RandomizedRunner.access$400(RandomizedRunner.java:131)
>>       at com.carrotsearch.randomizedtesting.RandomizedRunner$2.run(RandomizedRunner.java:550)
>>
>>
>> REGRESSION:  org.apache.solr.cloud.RecoveryZkTest.testDistribSearch
>>
>> Error Message:
>> Could not get the port for ZooKeeper server
>>
>> Stack Trace:
>> java.lang.RuntimeException: Could not get the port for ZooKeeper server
>>       at org.apache.solr.cloud.ZkTestServer.run(ZkTestServer.java:239)
>>       at org.apache.solr.cloud.AbstractDistributedZkTestCase.setUp(AbstractDistributedZkTestCase.java:51)
>>       at org.apache.solr.cloud.FullSolrCloudTest.setUp(FullSolrCloudTest.java:146)
>>       at sun.reflect.NativeMethodAccessorImpl.invoke0(Native Method)
>>       at sun.reflect.NativeMethodAccessorImpl.invoke(NativeMethodAccessorImpl.java:57)
>>       at sun.reflect.DelegatingMethodAccessorImpl.invoke(DelegatingMethodAccessorImpl.java:43)
>>       at java.lang.reflect.Method.invoke(Method.java:616)
>>       at com.carrotsearch.randomizedtesting.RandomizedRunner.invoke(RandomizedRunner.java:1913)
>>       at com.carrotsearch.randomizedtesting.RandomizedRunner.access$1100(RandomizedRunner.java:131)
>>       at com.carrotsearch.randomizedtesting.RandomizedRunner$7.evaluate(RandomizedRunner.java:864)
>>       at com.carrotsearch.randomizedtesting.RandomizedRunner$8.evaluate(RandomizedRunner.java:880)
>>       at org.apache.lucene.util.SystemPropertiesRestoreRule$1.evaluate(SystemPropertiesRestoreRule.java:63)
>>       at org.apache.lucene.util.LuceneTestCase$SubclassSetupTeardownRule$1.evaluate(LuceneTestCase.java:760)
>>       at org.apache.lucene.util.LuceneTestCase$InternalSetupTeardownRule$1.evaluate(LuceneTestCase.java:682)
>>       at org.apache.lucene.util.SystemPropertiesInvariantRule$1.evaluate(SystemPropertiesInvariantRule.java:69)
>>       at org.apache.lucene.util.LuceneTestCase$TestResultInterceptorRule$1.evaluate(LuceneTestCase.java:615)
>>       at org.apache.lucene.util.UncaughtExceptionsRule$1.evaluate(UncaughtExceptionsRule.java:75)
>>       at org.apache.lucene.util.LuceneTestCase$SaveThreadAndTestNameRule$1.evaluate(LuceneTestCase.java:654)
>>       at com.carrotsearch.randomizedtesting.RandomizedRunner.runSingleTest(RandomizedRunner.java:812)
>>       at com.carrotsearch.randomizedtesting.RandomizedRunner.access$700(RandomizedRunner.java:131)
>>       at com.carrotsearch.randomizedtesting.RandomizedRunner$3$1.run(RandomizedRunner.java:668)
>>       at com.carrotsearch.randomizedtesting.RandomizedRunner$3.evaluate(RandomizedRunner.java:687)
>>       at com.carrotsearch.randomizedtesting.RandomizedRunner$4.evaluate(RandomizedRunner.java:723)
>>       at com.carrotsearch.randomizedtesting.RandomizedRunner$5.evaluate(RandomizedRunner.java:734)
>>       at org.apache.lucene.util.SystemPropertiesRestoreRule$1.evaluate(SystemPropertiesRestoreRule.java:63)
>>       at org.apache.lucene.util.UncaughtExceptionsRule$1.evaluate(UncaughtExceptionsRule.java:75)
>>       at org.apache.lucene.util.StoreClassNameRule$1.evaluate(StoreClassNameRule.java:38)
>>       at org.apache.lucene.util.SystemPropertiesInvariantRule$1.evaluate(SystemPropertiesInvariantRule.java:69)
>>       at com.carrotsearch.randomizedtesting.RandomizedRunner.runSuite(RandomizedRunner.java:604)
>>       at com.carrotsearch.randomizedtesting.RandomizedRunner.access$400(RandomizedRunner.java:131)
>>       at com.carrotsearch.randomizedtesting.RandomizedRunner$2.run(RandomizedRunner.java:550)
>>
>>
>> REGRESSION:  org.apache.solr.cloud.TestMultiCoreConfBootstrap.testMultiCoreConfBootstrap
>>
>> Error Message:
>> Could not get the port for ZooKeeper server
>>
>> Stack Trace:
>> java.lang.RuntimeException: Could not get the port for ZooKeeper server
>>       at org.apache.solr.cloud.ZkTestServer.run(ZkTestServer.java:239)
>>       at org.apache.solr.cloud.TestMultiCoreConfBootstrap.setUp(TestMultiCoreConfBootstrap.java:65)
>>       at sun.reflect.NativeMethodAccessorImpl.invoke0(Native Method)
>>       at sun.reflect.NativeMethodAccessorImpl.invoke(NativeMethodAccessorImpl.java:57)
>>       at sun.reflect.DelegatingMethodAccessorImpl.invoke(DelegatingMethodAccessorImpl.java:43)
>>       at java.lang.reflect.Method.invoke(Method.java:616)
>>       at com.carrotsearch.randomizedtesting.RandomizedRunner.invoke(RandomizedRunner.java:1913)
>>       at com.carrotsearch.randomizedtesting.RandomizedRunner.access$1100(RandomizedRunner.java:131)
>>       at com.carrotsearch.randomizedtesting.RandomizedRunner$7.evaluate(RandomizedRunner.java:864)
>>       at com.carrotsearch.randomizedtesting.RandomizedRunner$8.evaluate(RandomizedRunner.java:880)
>>       at org.apache.lucene.util.SystemPropertiesRestoreRule$1.evaluate(SystemPropertiesRestoreRule.java:63)
>>       at org.apache.lucene.util.LuceneTestCase$SubclassSetupTeardownRule$1.evaluate(LuceneTestCase.java:760)
>>       at org.apache.lucene.util.LuceneTestCase$InternalSetupTeardownRule$1.evaluate(LuceneTestCase.java:682)
>>       at org.apache.lucene.util.SystemPropertiesInvariantRule$1.evaluate(SystemPropertiesInvariantRule.java:69)
>>       at org.apache.lucene.util.LuceneTestCase$TestResultInterceptorRule$1.evaluate(LuceneTestCase.java:615)
>>       at org.apache.lucene.util.UncaughtExceptionsRule$1.evaluate(UncaughtExceptionsRule.java:75)
>>       at org.apache.lucene.util.LuceneTestCase$SaveThreadAndTestNameRule$1.evaluate(LuceneTestCase.java:654)
>>       at com.carrotsearch.randomizedtesting.RandomizedRunner.runSingleTest(RandomizedRunner.java:812)
>>       at com.carrotsearch.randomizedtesting.RandomizedRunner.access$700(RandomizedRunner.java:131)
>>       at com.carrotsearch.randomizedtesting.RandomizedRunner$3$1.run(RandomizedRunner.java:668)
>>       at com.carrotsearch.randomizedtesting.RandomizedRunner$3.evaluate(RandomizedRunner.java:687)
>>       at com.carrotsearch.randomizedtesting.RandomizedRunner$4.evaluate(RandomizedRunner.java:723)
>>       at com.carrotsearch.randomizedtesting.RandomizedRunner$5.evaluate(RandomizedRunner.java:734)
>>       at org.apache.lucene.util.SystemPropertiesRestoreRule$1.evaluate(SystemPropertiesRestoreRule.java:63)
>>       at org.apache.lucene.util.UncaughtExceptionsRule$1.evaluate(UncaughtExceptionsRule.java:75)
>>       at org.apache.lucene.util.StoreClassNameRule$1.evaluate(StoreClassNameRule.java:38)
>>       at org.apache.lucene.util.SystemPropertiesInvariantRule$1.evaluate(SystemPropertiesInvariantRule.java:69)
>>       at com.carrotsearch.randomizedtesting.RandomizedRunner.runSuite(RandomizedRunner.java:604)
>>       at com.carrotsearch.randomizedtesting.RandomizedRunner.access$400(RandomizedRunner.java:131)
>>       at com.carrotsearch.randomizedtesting.RandomizedRunner$2.run(RandomizedRunner.java:550)
>>
>>
>> REGRESSION:  org.apache.solr.cloud.ZkControllerTest.testReadConfigName
>>
>> Error Message:
>> null
>>
>> Stack Trace:
>> java.lang.NullPointerException
>>       at __randomizedtesting.SeedInfo.seed([EF242FDB529E9065:FA1CFF0506D88B34]:0)
>>       at org.apache.solr.cloud.ZkTestServer$ZKServerMain.shutdown(ZkTestServer.java:116)
>>       at org.apache.solr.cloud.ZkTestServer.shutdown(ZkTestServer.java:248)
>>       at org.apache.solr.cloud.ZkControllerTest.testReadConfigName(ZkControllerTest.java:95)
>>       at sun.reflect.NativeMethodAccessorImpl.invoke0(Native Method)
>>       at sun.reflect.NativeMethodAccessorImpl.invoke(NativeMethodAccessorImpl.java:57)
>>       at sun.reflect.DelegatingMethodAccessorImpl.invoke(DelegatingMethodAccessorImpl.java:43)
>>       at java.lang.reflect.Method.invoke(Method.java:616)
>>       at com.carrotsearch.randomizedtesting.RandomizedRunner.invoke(RandomizedRunner.java:1913)
>>       at com.carrotsearch.randomizedtesting.RandomizedRunner.access$1100(RandomizedRunner.java:131)
>>       at com.carrotsearch.randomizedtesting.RandomizedRunner$6.evaluate(RandomizedRunner.java:805)
>>       at com.carrotsearch.randomizedtesting.RandomizedRunner$7.evaluate(RandomizedRunner.java:866)
>>       at com.carrotsearch.randomizedtesting.RandomizedRunner$8.evaluate(RandomizedRunner.java:880)
>>       at org.apache.lucene.util.SystemPropertiesRestoreRule$1.evaluate(SystemPropertiesRestoreRule.java:63)
>>       at org.apache.lucene.util.LuceneTestCase$SubclassSetupTeardownRule$1.evaluate(LuceneTestCase.java:760)
>>       at org.apache.lucene.util.LuceneTestCase$InternalSetupTeardownRule$1.evaluate(LuceneTestCase.java:682)
>>       at org.apache.lucene.util.SystemPropertiesInvariantRule$1.evaluate(SystemPropertiesInvariantRule.java:69)
>>       at org.apache.lucene.util.LuceneTestCase$TestResultInterceptorRule$1.evaluate(LuceneTestCase.java:615)
>>       at org.apache.lucene.util.UncaughtExceptionsRule$1.evaluate(UncaughtExceptionsRule.java:75)
>>       at org.apache.lucene.util.LuceneTestCase$SaveThreadAndTestNameRule$1.evaluate(LuceneTestCase.java:654)
>>       at com.carrotsearch.randomizedtesting.RandomizedRunner.runSingleTest(RandomizedRunner.java:812)
>>       at com.carrotsearch.randomizedtesting.RandomizedRunner.access$700(RandomizedRunner.java:131)
>>       at com.carrotsearch.randomizedtesting.RandomizedRunner$3$1.run(RandomizedRunner.java:668)
>>       at com.carrotsearch.randomizedtesting.RandomizedRunner$3.evaluate(RandomizedRunner.java:687)
>>       at com.carrotsearch.randomizedtesting.RandomizedRunner$4.evaluate(RandomizedRunner.java:723)
>>       at com.carrotsearch.randomizedtesting.RandomizedRunner$5.evaluate(RandomizedRunner.java:734)
>>       at org.apache.lucene.util.SystemPropertiesRestoreRule$1.evaluate(SystemPropertiesRestoreRule.java:63)
>>       at org.apache.lucene.util.UncaughtExceptionsRule$1.evaluate(UncaughtExceptionsRule.java:75)
>>       at org.apache.lucene.util.StoreClassNameRule$1.evaluate(StoreClassNameRule.java:38)
>>       at org.apache.lucene.util.SystemPropertiesInvariantRule$1.evaluate(SystemPropertiesInvariantRule.java:69)
>>       at com.carrotsearch.randomizedtesting.RandomizedRunner.runSuite(RandomizedRunner.java:604)
>>       at com.carrotsearch.randomizedtesting.RandomizedRunner.access$400(RandomizedRunner.java:131)
>>       at com.carrotsearch.randomizedtesting.RandomizedRunner$2.run(RandomizedRunner.java:550)
>>
>>
>> REGRESSION:  org.apache.solr.cloud.ZkControllerTest.testUploadToCloud
>>
>> Error Message:
>> null
>>
>> Stack Trace:
>> java.lang.NullPointerException
>>       at __randomizedtesting.SeedInfo.seed([EF242FDB529E9065:CA49593E079C8B56]:0)
>>       at org.apache.solr.cloud.ZkControllerTest.testUploadToCloud(ZkControllerTest.java:136)
>>       at sun.reflect.NativeMethodAccessorImpl.invoke0(Native Method)
>>       at sun.reflect.NativeMethodAccessorImpl.invoke(NativeMethodAccessorImpl.java:57)
>>       at sun.reflect.DelegatingMethodAccessorImpl.invoke(DelegatingMethodAccessorImpl.java:43)
>>       at java.lang.reflect.Method.invoke(Method.java:616)
>>       at com.carrotsearch.randomizedtesting.RandomizedRunner.invoke(RandomizedRunner.java:1913)
>>       at com.carrotsearch.randomizedtesting.RandomizedRunner.access$1100(RandomizedRunner.java:131)
>>       at com.carrotsearch.randomizedtesting.RandomizedRunner$6.evaluate(RandomizedRunner.java:805)
>>       at com.carrotsearch.randomizedtesting.RandomizedRunner$7.evaluate(RandomizedRunner.java:866)
>>       at com.carrotsearch.randomizedtesting.RandomizedRunner$8.evaluate(RandomizedRunner.java:880)
>>       at org.apache.lucene.util.SystemPropertiesRestoreRule$1.evaluate(SystemPropertiesRestoreRule.java:63)
>>       at org.apache.lucene.util.LuceneTestCase$SubclassSetupTeardownRule$1.evaluate(LuceneTestCase.java:760)
>>       at org.apache.lucene.util.LuceneTestCase$InternalSetupTeardownRule$1.evaluate(LuceneTestCase.java:682)
>>       at org.apache.lucene.util.SystemPropertiesInvariantRule$1.evaluate(SystemPropertiesInvariantRule.java:69)
>>       at org.apache.lucene.util.LuceneTestCase$TestResultInterceptorRule$1.evaluate(LuceneTestCase.java:615)
>>       at org.apache.lucene.util.UncaughtExceptionsRule$1.evaluate(UncaughtExceptionsRule.java:75)
>>       at org.apache.lucene.util.LuceneTestCase$SaveThreadAndTestNameRule$1.evaluate(LuceneTestCase.java:654)
>>       at com.carrotsearch.randomizedtesting.RandomizedRunner.runSingleTest(RandomizedRunner.java:812)
>>       at com.carrotsearch.randomizedtesting.RandomizedRunner.access$700(RandomizedRunner.java:131)
>>       at com.carrotsearch.randomizedtesting.RandomizedRunner$3$1.run(RandomizedRunner.java:668)
>>       at com.carrotsearch.randomizedtesting.RandomizedRunner$3.evaluate(RandomizedRunner.java:687)
>>       at com.carrotsearch.randomizedtesting.RandomizedRunner$4.evaluate(RandomizedRunner.java:723)
>>       at com.carrotsearch.randomizedtesting.RandomizedRunner$5.evaluate(RandomizedRunner.java:734)
>>       at org.apache.lucene.util.SystemPropertiesRestoreRule$1.evaluate(SystemPropertiesRestoreRule.java:63)
>>       at org.apache.lucene.util.UncaughtExceptionsRule$1.evaluate(UncaughtExceptionsRule.java:75)
>>       at org.apache.lucene.util.StoreClassNameRule$1.evaluate(StoreClassNameRule.java:38)
>>       at org.apache.lucene.util.SystemPropertiesInvariantRule$1.evaluate(SystemPropertiesInvariantRule.java:69)
>>       at com.carrotsearch.randomizedtesting.RandomizedRunner.runSuite(RandomizedRunner.java:604)
>>       at com.carrotsearch.randomizedtesting.RandomizedRunner.access$400(RandomizedRunner.java:131)
>>       at com.carrotsearch.randomizedtesting.RandomizedRunner$2.run(RandomizedRunner.java:550)
>>
>>
>> REGRESSION:  org.apache.solr.cloud.ZkControllerTest.testCoreUnload
>>
>> Error Message:
>> null
>>
>> Stack Trace:
>> java.lang.NullPointerException
>>       at __randomizedtesting.SeedInfo.seed([EF242FDB529E9065:8A575C7E72EE472F]:0)
>>       at org.apache.solr.cloud.ZkTestServer$ZKServerMain.shutdown(ZkTestServer.java:116)
>>       at org.apache.solr.cloud.ZkTestServer.shutdown(ZkTestServer.java:248)
>>       at org.apache.solr.cloud.ZkControllerTest.testCoreUnload(ZkControllerTest.java:240)
>>       at sun.reflect.NativeMethodAccessorImpl.invoke0(Native Method)
>>       at sun.reflect.NativeMethodAccessorImpl.invoke(NativeMethodAccessorImpl.java:57)
>>       at sun.reflect.DelegatingMethodAccessorImpl.invoke(DelegatingMethodAccessorImpl.java:43)
>>       at java.lang.reflect.Method.invoke(Method.java:616)
>>       at com.carrotsearch.randomizedtesting.RandomizedRunner.invoke(RandomizedRunner.java:1913)
>>       at com.carrotsearch.randomizedtesting.RandomizedRunner.access$1100(RandomizedRunner.java:131)
>>       at com.carrotsearch.randomizedtesting.RandomizedRunner$6.evaluate(RandomizedRunner.java:805)
>>       at com.carrotsearch.randomizedtesting.RandomizedRunner$7.evaluate(RandomizedRunner.java:866)
>>       at com.carrotsearch.randomizedtesting.RandomizedRunner$8.evaluate(RandomizedRunner.java:880)
>>       at org.apache.lucene.util.SystemPropertiesRestoreRule$1.evaluate(SystemPropertiesRestoreRule.java:63)
>>       at org.apache.lucene.util.LuceneTestCase$SubclassSetupTeardownRule$1.evaluate(LuceneTestCase.java:760)
>>       at org.apache.lucene.util.LuceneTestCase$InternalSetupTeardownRule$1.evaluate(LuceneTestCase.java:682)
>>       at org.apache.lucene.util.SystemPropertiesInvariantRule$1.evaluate(SystemPropertiesInvariantRule.java:69)
>>       at org.apache.lucene.util.LuceneTestCase$TestResultInterceptorRule$1.evaluate(LuceneTestCase.java:615)
>>       at org.apache.lucene.util.UncaughtExceptionsRule$1.evaluate(UncaughtExceptionsRule.java:75)
>>       at org.apache.lucene.util.LuceneTestCase$SaveThreadAndTestNameRule$1.evaluate(LuceneTestCase.java:654)
>>       at com.carrotsearch.randomizedtesting.RandomizedRunner.runSingleTest(RandomizedRunner.java:812)
>>       at com.carrotsearch.randomizedtesting.RandomizedRunner.access$700(RandomizedRunner.java:131)
>>       at com.carrotsearch.randomizedtesting.RandomizedRunner$3$1.run(RandomizedRunner.java:668)
>>       at com.carrotsearch.randomizedtesting.RandomizedRunner$3.evaluate(RandomizedRunner.java:687)
>>       at com.carrotsearch.randomizedtesting.RandomizedRunner$4.evaluate(RandomizedRunner.java:723)
>>       at com.carrotsearch.randomizedtesting.RandomizedRunner$5.evaluate(RandomizedRunner.java:734)
>>       at org.apache.lucene.util.SystemPropertiesRestoreRule$1.evaluate(SystemPropertiesRestoreRule.java:63)
>>       at org.apache.lucene.util.UncaughtExceptionsRule$1.evaluate(UncaughtExceptionsRule.java:75)
>>       at org.apache.lucene.util.StoreClassNameRule$1.evaluate(StoreClassNameRule.java:38)
>>       at org.apache.lucene.util.SystemPropertiesInvariantRule$1.evaluate(SystemPropertiesInvariantRule.java:69)
>>       at com.carrotsearch.randomizedtesting.RandomizedRunner.runSuite(RandomizedRunner.java:604)
>>       at com.carrotsearch.randomizedtesting.RandomizedRunner.access$400(RandomizedRunner.java:131)
>>       at com.carrotsearch.randomizedtesting.RandomizedRunner$2.run(RandomizedRunner.java:550)
>>
>>
>> REGRESSION:  org.apache.solr.cloud.ZkSolrClientTest.testReconnect
>>
>> Error Message:
>> null
>>
>> Stack Trace:
>> java.lang.NullPointerException
>>       at __randomizedtesting.SeedInfo.seed([E6128868ED49E445:3F31011AAAD0293A]:0)
>>       at org.apache.solr.cloud.ZkTestServer$ZKServerMain.shutdown(ZkTestServer.java:116)
>>       at org.apache.solr.cloud.ZkTestServer.shutdown(ZkTestServer.java:248)
>>       at org.apache.solr.cloud.ZkSolrClientTest.testReconnect(ZkSolrClientTest.java:159)
>>       at sun.reflect.NativeMethodAccessorImpl.invoke0(Native Method)
>>       at sun.reflect.NativeMethodAccessorImpl.invoke(NativeMethodAccessorImpl.java:57)
>>       at sun.reflect.DelegatingMethodAccessorImpl.invoke(DelegatingMethodAccessorImpl.java:43)
>>       at java.lang.reflect.Method.invoke(Method.java:616)
>>       at com.carrotsearch.randomizedtesting.RandomizedRunner.invoke(RandomizedRunner.java:1913)
>>       at com.carrotsearch.randomizedtesting.RandomizedRunner.access$1100(RandomizedRunner.java:131)
>>       at com.carrotsearch.randomizedtesting.RandomizedRunner$6.evaluate(RandomizedRunner.java:805)
>>       at com.carrotsearch.randomizedtesting.RandomizedRunner$7.evaluate(RandomizedRunner.java:866)
>>       at com.carrotsearch.randomizedtesting.RandomizedRunner$8.evaluate(RandomizedRunner.java:880)
>>       at org.apache.lucene.util.SystemPropertiesRestoreRule$1.evaluate(SystemPropertiesRestoreRule.java:63)
>>       at org.apache.lucene.util.LuceneTestCase$SubclassSetupTeardownRule$1.evaluate(LuceneTestCase.java:760)
>>       at org.apache.lucene.util.LuceneTestCase$InternalSetupTeardownRule$1.evaluate(LuceneTestCase.java:682)
>>       at org.apache.lucene.util.SystemPropertiesInvariantRule$1.evaluate(SystemPropertiesInvariantRule.java:69)
>>       at org.apache.lucene.util.LuceneTestCase$TestResultInterceptorRule$1.evaluate(LuceneTestCase.java:615)
>>       at org.apache.lucene.util.UncaughtExceptionsRule$1.evaluate(UncaughtExceptionsRule.java:75)
>>       at org.apache.lucene.util.LuceneTestCase$SaveThreadAndTestNameRule$1.evaluate(LuceneTestCase.java:654)
>>       at com.carrotsearch.randomizedtesting.RandomizedRunner.runSingleTest(RandomizedRunner.java:812)
>>       at com.carrotsearch.randomizedtesting.RandomizedRunner.access$700(RandomizedRunner.java:131)
>>       at com.carrotsearch.randomizedtesting.RandomizedRunner$3$1.run(RandomizedRunner.java:668)
>>       at com.carrotsearch.randomizedtesting.RandomizedRunner$3.evaluate(RandomizedRunner.java:687)
>>       at com.carrotsearch.randomizedtesting.RandomizedRunner$4.evaluate(RandomizedRunner.java:723)
>>       at com.carrotsearch.randomizedtesting.RandomizedRunner$5.evaluate(RandomizedRunner.java:734)
>>       at org.apache.lucene.util.SystemPropertiesRestoreRule$1.evaluate(SystemPropertiesRestoreRule.java:63)
>>       at org.apache.lucene.util.UncaughtExceptionsRule$1.evaluate(UncaughtExceptionsRule.java:75)
>>       at org.apache.lucene.util.StoreClassNameRule$1.evaluate(StoreClassNameRule.java:38)
>>       at org.apache.lucene.util.SystemPropertiesInvariantRule$1.evaluate(SystemPropertiesInvariantRule.java:69)
>>       at com.carrotsearch.randomizedtesting.RandomizedRunner.runSuite(RandomizedRunner.java:604)
>>       at com.carrotsearch.randomizedtesting.RandomizedRunner.access$400(RandomizedRunner.java:131)
>>       at com.carrotsearch.randomizedtesting.RandomizedRunner$2.run(RandomizedRunner.java:550)
>>
>>
>> REGRESSION:  org.apache.solr.cloud.ZkSolrClientTest.testConnect
>>
>> Error Message:
>> Could not get the port for ZooKeeper server
>>
>> Stack Trace:
>> java.lang.RuntimeException: Could not get the port for ZooKeeper server
>>       at __randomizedtesting.SeedInfo.seed([E6128868ED49E445:E675E2CC3DC1334C]:0)
>>       at org.apache.solr.cloud.ZkTestServer.run(ZkTestServer.java:239)
>>       at org.apache.solr.cloud.ZkSolrClientTest.testConnect(ZkSolrClientTest.java:43)
>>       at sun.reflect.NativeMethodAccessorImpl.invoke0(Native Method)
>>       at sun.reflect.NativeMethodAccessorImpl.invoke(NativeMethodAccessorImpl.java:57)
>>       at sun.reflect.DelegatingMethodAccessorImpl.invoke(DelegatingMethodAccessorImpl.java:43)
>>       at java.lang.reflect.Method.invoke(Method.java:616)
>>       at com.carrotsearch.randomizedtesting.RandomizedRunner.invoke(RandomizedRunner.java:1913)
>>       at com.carrotsearch.randomizedtesting.RandomizedRunner.access$1100(RandomizedRunner.java:131)
>>       at com.carrotsearch.randomizedtesting.RandomizedRunner$6.evaluate(RandomizedRunner.java:805)
>>       at com.carrotsearch.randomizedtesting.RandomizedRunner$7.evaluate(RandomizedRunner.java:866)
>>       at com.carrotsearch.randomizedtesting.RandomizedRunner$8.evaluate(RandomizedRunner.java:880)
>>       at org.apache.lucene.util.SystemPropertiesRestoreRule$1.evaluate(SystemPropertiesRestoreRule.java:63)
>>       at org.apache.lucene.util.LuceneTestCase$SubclassSetupTeardownRule$1.evaluate(LuceneTestCase.java:760)
>>       at org.apache.lucene.util.LuceneTestCase$InternalSetupTeardownRule$1.evaluate(LuceneTestCase.java:682)
>>       at org.apache.lucene.util.SystemPropertiesInvariantRule$1.evaluate(SystemPropertiesInvariantRule.java:69)
>>       at org.apache.lucene.util.LuceneTestCase$TestResultInterceptorRule$1.evaluate(LuceneTestCase.java:615)
>>       at org.apache.lucene.util.UncaughtExceptionsRule$1.evaluate(UncaughtExceptionsRule.java:75)
>>       at org.apache.lucene.util.LuceneTestCase$SaveThreadAndTestNameRule$1.evaluate(LuceneTestCase.java:654)
>>       at com.carrotsearch.randomizedtesting.RandomizedRunner.runSingleTest(RandomizedRunner.java:812)
>>       at com.carrotsearch.randomizedtesting.RandomizedRunner.access$700(RandomizedRunner.java:131)
>>       at com.carrotsearch.randomizedtesting.RandomizedRunner$3$1.run(RandomizedRunner.java:668)
>>       at com.carrotsearch.randomizedtesting.RandomizedRunner$3.evaluate(RandomizedRunner.java:687)
>>       at com.carrotsearch.randomizedtesting.RandomizedRunner$4.evaluate(RandomizedRunner.java:723)
>>       at com.carrotsearch.randomizedtesting.RandomizedRunner$5.evaluate(RandomizedRunner.java:734)
>>       at org.apache.lucene.util.SystemPropertiesRestoreRule$1.evaluate(SystemPropertiesRestoreRule.java:63)
>>       at org.apache.lucene.util.UncaughtExceptionsRule$1.evaluate(UncaughtExceptionsRule.java:75)
>>       at org.apache.lucene.util.StoreClassNameRule$1.evaluate(StoreClassNameRule.java:38)
>>       at org.apache.lucene.util.SystemPropertiesInvariantRule$1.evaluate(SystemPropertiesInvariantRule.java:69)
>>       at com.carrotsearch.randomizedtesting.RandomizedRunner.runSuite(RandomizedRunner.java:604)
>>       at com.carrotsearch.randomizedtesting.RandomizedRunner.access$400(RandomizedRunner.java:131)
>>       at com.carrotsearch.randomizedtesting.RandomizedRunner$2.run(RandomizedRunner.java:550)
>>
>>
>> REGRESSION:  org.apache.solr.cloud.ZkSolrClientTest.testMakeRootNode
>>
>> Error Message:
>> Could not get the port for ZooKeeper server
>>
>> Stack Trace:
>> java.lang.RuntimeException: Could not get the port for ZooKeeper server
>>       at __randomizedtesting.SeedInfo.seed([E6128868ED49E445:811B100F667FD02D]:0)
>>       at org.apache.solr.cloud.ZkTestServer.run(ZkTestServer.java:239)
>>       at org.apache.solr.cloud.ZkSolrClientTest.testMakeRootNode(ZkSolrClientTest.java:57)
>>       at sun.reflect.NativeMethodAccessorImpl.invoke0(Native Method)
>>       at sun.reflect.NativeMethodAccessorImpl.invoke(NativeMethodAccessorImpl.java:57)
>>       at sun.reflect.DelegatingMethodAccessorImpl.invoke(DelegatingMethodAccessorImpl.java:43)
>>       at java.lang.reflect.Method.invoke(Method.java:616)
>>       at com.carrotsearch.randomizedtesting.RandomizedRunner.invoke(RandomizedRunner.java:1913)
>>       at com.carrotsearch.randomizedtesting.RandomizedRunner.access$1100(RandomizedRunner.java:131)
>>       at com.carrotsearch.randomizedtesting.RandomizedRunner$6.evaluate(RandomizedRunner.java:805)
>>       at com.carrotsearch.randomizedtesting.RandomizedRunner$7.evaluate(RandomizedRunner.java:866)
>>       at com.carrotsearch.randomizedtesting.RandomizedRunner$8.evaluate(RandomizedRunner.java:880)
>>       at org.apache.lucene.util.SystemPropertiesRestoreRule$1.evaluate(SystemPropertiesRestoreRule.java:63)
>>       at org.apache.lucene.util.LuceneTestCase$SubclassSetupTeardownRule$1.evaluate(LuceneTestCase.java:760)
>>       at org.apache.lucene.util.LuceneTestCase$InternalSetupTeardownRule$1.evaluate(LuceneTestCase.java:682)
>>       at org.apache.lucene.util.SystemPropertiesInvariantRule$1.evaluate(SystemPropertiesInvariantRule.java:69)
>>       at org.apache.lucene.util.LuceneTestCase$TestResultInterceptorRule$1.evaluate(LuceneTestCase.java:615)
>>       at org.apache.lucene.util.UncaughtExceptionsRule$1.evaluate(UncaughtExceptionsRule.java:75)
>>       at org.apache.lucene.util.LuceneTestCase$SaveThreadAndTestNameRule$1.evaluate(LuceneTestCase.java:654)
>>       at com.carrotsearch.randomizedtesting.RandomizedRunner.runSingleTest(RandomizedRunner.java:812)
>>       at com.carrotsearch.randomizedtesting.RandomizedRunner.access$700(RandomizedRunner.java:131)
>>       at com.carrotsearch.randomizedtesting.RandomizedRunner$3$1.run(RandomizedRunner.java:668)
>>       at com.carrotsearch.randomizedtesting.RandomizedRunner$3.evaluate(RandomizedRunner.java:687)
>>       at com.carrotsearch.randomizedtesting.RandomizedRunner$4.evaluate(RandomizedRunner.java:723)
>>       at com.carrotsearch.randomizedtesting.RandomizedRunner$5.evaluate(RandomizedRunner.java:734)
>>       at org.apache.lucene.util.SystemPropertiesRestoreRule$1.evaluate(SystemPropertiesRestoreRule.java:63)
>>       at org.apache.lucene.util.UncaughtExceptionsRule$1.evaluate(UncaughtExceptionsRule.java:75)
>>       at org.apache.lucene.util.StoreClassNameRule$1.evaluate(StoreClassNameRule.java:38)
>>       at org.apache.lucene.util.SystemPropertiesInvariantRule$1.evaluate(SystemPropertiesInvariantRule.java:69)
>>       at com.carrotsearch.randomizedtesting.RandomizedRunner.runSuite(RandomizedRunner.java:604)
>>       at com.carrotsearch.randomizedtesting.RandomizedRunner.access$400(RandomizedRunner.java:131)
>>       at com.carrotsearch.randomizedtesting.RandomizedRunner$2.run(RandomizedRunner.java:550)
>>
>>
>> REGRESSION:  org.apache.solr.cloud.ZkSolrClientTest.testWatchChildren
>>
>> Error Message:
>> Could not get the port for ZooKeeper server
>>
>> Stack Trace:
>> java.lang.RuntimeException: Could not get the port for ZooKeeper server
>>       at __randomizedtesting.SeedInfo.seed([E6128868ED49E445:AE6CEA74AA8D5EFE]:0)
>>       at org.apache.solr.cloud.ZkTestServer.run(ZkTestServer.java:239)
>>       at org.apache.solr.cloud.ZkSolrClientTest.testWatchChildren(ZkSolrClientTest.java:170)
>>       at sun.reflect.NativeMethodAccessorImpl.invoke0(Native Method)
>>       at sun.reflect.NativeMethodAccessorImpl.invoke(NativeMethodAccessorImpl.java:57)
>>       at sun.reflect.DelegatingMethodAccessorImpl.invoke(DelegatingMethodAccessorImpl.java:43)
>>       at java.lang.reflect.Method.invoke(Method.java:616)
>>       at com.carrotsearch.randomizedtesting.RandomizedRunner.invoke(RandomizedRunner.java:1913)
>>       at com.carrotsearch.randomizedtesting.RandomizedRunner.access$1100(RandomizedRunner.java:131)
>>       at com.carrotsearch.randomizedtesting.RandomizedRunner$6.evaluate(RandomizedRunner.java:805)
>>       at com.carrotsearch.randomizedtesting.RandomizedRunner$7.evaluate(RandomizedRunner.java:866)
>>       at com.carrotsearch.randomizedtesting.RandomizedRunner$8.evaluate(RandomizedRunner.java:880)
>>       at org.apache.lucene.util.SystemPropertiesRestoreRule$1.evaluate(SystemPropertiesRestoreRule.java:63)
>>       at org.apache.lucene.util.LuceneTestCase$SubclassSetupTeardownRule$1.evaluate(LuceneTestCase.java:760)
>>       at org.apache.lucene.util.LuceneTestCase$InternalSetupTeardownRule$1.evaluate(LuceneTestCase.java:682)
>>       at org.apache.lucene.util.SystemPropertiesInvariantRule$1.evaluate(SystemPropertiesInvariantRule.java:69)
>>       at org.apache.lucene.util.LuceneTestCase$TestResultInterceptorRule$1.evaluate(LuceneTestCase.java:615)
>>       at org.apache.lucene.util.UncaughtExceptionsRule$1.evaluate(UncaughtExceptionsRule.java:75)
>>       at org.apache.lucene.util.LuceneTestCase$SaveThreadAndTestNameRule$1.evaluate(LuceneTestCase.java:654)
>>       at com.carrotsearch.randomizedtesting.RandomizedRunner.runSingleTest(RandomizedRunner.java:812)
>>       at com.carrotsearch.randomizedtesting.RandomizedRunner.access$700(RandomizedRunner.java:131)
>>       at com.carrotsearch.randomizedtesting.RandomizedRunner$3$1.run(RandomizedRunner.java:668)
>>       at com.carrotsearch.randomizedtesting.RandomizedRunner$3.evaluate(RandomizedRunner.java:687)
>>       at com.carrotsearch.randomizedtesting.RandomizedRunner$4.evaluate(RandomizedRunner.java:723)
>>       at com.carrotsearch.randomizedtesting.RandomizedRunner$5.evaluate(RandomizedRunner.java:734)
>>       at org.apache.lucene.util.SystemPropertiesRestoreRule$1.evaluate(SystemPropertiesRestoreRule.java:63)
>>       at org.apache.lucene.util.UncaughtExceptionsRule$1.evaluate(UncaughtExceptionsRule.java:75)
>>       at org.apache.lucene.util.StoreClassNameRule$1.evaluate(StoreClassNameRule.java:38)
>>       at org.apache.lucene.util.SystemPropertiesInvariantRule$1.evaluate(SystemPropertiesInvariantRule.java:69)
>>       at com.carrotsearch.randomizedtesting.RandomizedRunner.runSuite(RandomizedRunner.java:604)
>>       at com.carrotsearch.randomizedtesting.RandomizedRunner.access$400(RandomizedRunner.java:131)
>>       at com.carrotsearch.randomizedtesting.RandomizedRunner$2.run(RandomizedRunner.java:550)
>>
>>
>>
>>
>> Build Log (for compile errors):
>> [...truncated 13482 lines...]
>>
>>
>>  B—KKKKKKKKKKKKKKKKKKKKKKKKKKKKKKKKKKKKKKKKKKKKKKKKKKKKKKKKKKKKKKKKKKKKCB È [˛†X˛ØÜ˚X˙K  K[XZ[ √  ]—][˛†X˛ØÜ˚X˙P  XÙ[˙K˘\ XÚ K˝Ü˙ÃBŒ˝Ü√ Y  ] [€˘[  €€[X[˙ Ë  K[XZ[ √  ]—Z [    XÙ[˙K˘\ XÚ K˝Ü˙ÃB∞B
>
> - Mark Miller
> lucidimagination.com
>
>
>
>
>
>
>
>
>
>
>
>
> ---------------------------------------------------------------------
> To unsubscribe, e-mail: dev-unsubscribe@lucene.apache.org
> For additional commands, e-mail: dev-help@lucene.apache.org
>

---------------------------------------------------------------------
To unsubscribe, e-mail: dev-unsubscribe@lucene.apache.org
For additional commands, e-mail: dev-help@lucene.apache.org


Mime
View raw message