lucene-dev mailing list archives

Site index · List index
Message view « Date » · « Thread »
Top « Date » · « Thread »
From Ryan McKinley <ryan...@gmail.com>
Subject Re: [JENKINS] Lucene-Solr-tests-only-trunk-java7 - Build # 2287 - Failure
Date Fri, 20 Apr 2012 23:40:06 GMT
my bad -- fixing it now...

On Fri, Apr 20, 2012 at 4:25 PM, Apache Jenkins Server
<jenkins@builds.apache.org> wrote:
> Build: https://builds.apache.org/job/Lucene-Solr-tests-only-trunk-java7/2287/
>
> 4 tests failed.
> REGRESSION:  org.apache.solr.client.solrj.SolrExampleBinaryTest.testMultiContentStreamRequest
>
> Error Message:
> MIME type may not be null
>
> Stack Trace:
> java.lang.IllegalArgumentException: MIME type may not be null
>        at __randomizedtesting.SeedInfo.seed([F0FD2EF892F2C3E2:1FC903CACCA29BEB]:0)
>        at org.apache.http.entity.mime.content.AbstractContentBody.<init>(AbstractContentBody.java:43)
>        at org.apache.http.entity.mime.content.InputStreamBody.<init>(InputStreamBody.java:46)
>        at org.apache.solr.client.solrj.impl.HttpSolrServer.request(HttpSolrServer.java:293)
>        at org.apache.solr.client.solrj.impl.HttpSolrServer.request(HttpSolrServer.java:218)
>        at org.apache.solr.client.solrj.SolrExampleTests.testMultiContentStreamRequest(SolrExampleTests.java:612)
>        at sun.reflect.NativeMethodAccessorImpl.invoke0(Native Method)
>        at sun.reflect.NativeMethodAccessorImpl.invoke(NativeMethodAccessorImpl.java:57)
>        at sun.reflect.DelegatingMethodAccessorImpl.invoke(DelegatingMethodAccessorImpl.java:43)
>        at java.lang.reflect.Method.invoke(Method.java:601)
>        at com.carrotsearch.randomizedtesting.RandomizedRunner.invoke(RandomizedRunner.java:1913)
>        at com.carrotsearch.randomizedtesting.RandomizedRunner.access$1100(RandomizedRunner.java:131)
>        at com.carrotsearch.randomizedtesting.RandomizedRunner$6.evaluate(RandomizedRunner.java:805)
>        at com.carrotsearch.randomizedtesting.RandomizedRunner$7.evaluate(RandomizedRunner.java:866)
>        at com.carrotsearch.randomizedtesting.RandomizedRunner$8.evaluate(RandomizedRunner.java:880)
>        at org.apache.lucene.util.SystemPropertiesRestoreRule$1.evaluate(SystemPropertiesRestoreRule.java:63)
>        at org.apache.lucene.util.LuceneTestCase$SubclassSetupTeardownRule$1.evaluate(LuceneTestCase.java:760)
>        at org.apache.lucene.util.LuceneTestCase$InternalSetupTeardownRule$1.evaluate(LuceneTestCase.java:682)
>        at org.apache.lucene.util.SystemPropertiesInvariantRule$1.evaluate(SystemPropertiesInvariantRule.java:69)
>        at org.apache.lucene.util.LuceneTestCase$TestResultInterceptorRule$1.evaluate(LuceneTestCase.java:615)
>        at org.apache.lucene.util.UncaughtExceptionsRule$1.evaluate(UncaughtExceptionsRule.java:75)
>        at org.apache.lucene.util.LuceneTestCase$SaveThreadAndTestNameRule$1.evaluate(LuceneTestCase.java:654)
>        at com.carrotsearch.randomizedtesting.RandomizedRunner.runSingleTest(RandomizedRunner.java:812)
>        at com.carrotsearch.randomizedtesting.RandomizedRunner.access$700(RandomizedRunner.java:131)
>        at com.carrotsearch.randomizedtesting.RandomizedRunner$3$1.run(RandomizedRunner.java:668)
>        at com.carrotsearch.randomizedtesting.RandomizedRunner$3.evaluate(RandomizedRunner.java:687)
>        at com.carrotsearch.randomizedtesting.RandomizedRunner$4.evaluate(RandomizedRunner.java:723)
>        at com.carrotsearch.randomizedtesting.RandomizedRunner$5.evaluate(RandomizedRunner.java:734)
>        at org.apache.lucene.util.SystemPropertiesRestoreRule$1.evaluate(SystemPropertiesRestoreRule.java:63)
>        at org.apache.lucene.util.UncaughtExceptionsRule$1.evaluate(UncaughtExceptionsRule.java:75)
>        at org.apache.lucene.util.StoreClassNameRule$1.evaluate(StoreClassNameRule.java:38)
>        at org.apache.lucene.util.SystemPropertiesInvariantRule$1.evaluate(SystemPropertiesInvariantRule.java:69)
>        at com.carrotsearch.randomizedtesting.RandomizedRunner.runSuite(RandomizedRunner.java:604)
>        at com.carrotsearch.randomizedtesting.RandomizedRunner.access$400(RandomizedRunner.java:131)
>        at com.carrotsearch.randomizedtesting.RandomizedRunner$2.run(RandomizedRunner.java:550)
>
>
> REGRESSION:  org.apache.solr.client.solrj.embedded.SolrExampleJettyTest.testMultiContentStreamRequest
>
> Error Message:
> MIME type may not be null
>
> Stack Trace:
> java.lang.IllegalArgumentException: MIME type may not be null
>        at __randomizedtesting.SeedInfo.seed([F0FD2EF892F2C3E2:1FC903CACCA29BEB]:0)
>        at org.apache.http.entity.mime.content.AbstractContentBody.<init>(AbstractContentBody.java:43)
>        at org.apache.http.entity.mime.content.InputStreamBody.<init>(InputStreamBody.java:46)
>        at org.apache.solr.client.solrj.impl.HttpSolrServer.request(HttpSolrServer.java:293)
>        at org.apache.solr.client.solrj.impl.HttpSolrServer.request(HttpSolrServer.java:218)
>        at org.apache.solr.client.solrj.SolrExampleTests.testMultiContentStreamRequest(SolrExampleTests.java:612)
>        at sun.reflect.NativeMethodAccessorImpl.invoke0(Native Method)
>        at sun.reflect.NativeMethodAccessorImpl.invoke(NativeMethodAccessorImpl.java:57)
>        at sun.reflect.DelegatingMethodAccessorImpl.invoke(DelegatingMethodAccessorImpl.java:43)
>        at java.lang.reflect.Method.invoke(Method.java:601)
>        at com.carrotsearch.randomizedtesting.RandomizedRunner.invoke(RandomizedRunner.java:1913)
>        at com.carrotsearch.randomizedtesting.RandomizedRunner.access$1100(RandomizedRunner.java:131)
>        at com.carrotsearch.randomizedtesting.RandomizedRunner$6.evaluate(RandomizedRunner.java:805)
>        at com.carrotsearch.randomizedtesting.RandomizedRunner$7.evaluate(RandomizedRunner.java:866)
>        at com.carrotsearch.randomizedtesting.RandomizedRunner$8.evaluate(RandomizedRunner.java:880)
>        at org.apache.lucene.util.SystemPropertiesRestoreRule$1.evaluate(SystemPropertiesRestoreRule.java:63)
>        at org.apache.lucene.util.LuceneTestCase$SubclassSetupTeardownRule$1.evaluate(LuceneTestCase.java:760)
>        at org.apache.lucene.util.LuceneTestCase$InternalSetupTeardownRule$1.evaluate(LuceneTestCase.java:682)
>        at org.apache.lucene.util.SystemPropertiesInvariantRule$1.evaluate(SystemPropertiesInvariantRule.java:69)
>        at org.apache.lucene.util.LuceneTestCase$TestResultInterceptorRule$1.evaluate(LuceneTestCase.java:615)
>        at org.apache.lucene.util.UncaughtExceptionsRule$1.evaluate(UncaughtExceptionsRule.java:75)
>        at org.apache.lucene.util.LuceneTestCase$SaveThreadAndTestNameRule$1.evaluate(LuceneTestCase.java:654)
>        at com.carrotsearch.randomizedtesting.RandomizedRunner.runSingleTest(RandomizedRunner.java:812)
>        at com.carrotsearch.randomizedtesting.RandomizedRunner.access$700(RandomizedRunner.java:131)
>        at com.carrotsearch.randomizedtesting.RandomizedRunner$3$1.run(RandomizedRunner.java:668)
>        at com.carrotsearch.randomizedtesting.RandomizedRunner$3.evaluate(RandomizedRunner.java:687)
>        at com.carrotsearch.randomizedtesting.RandomizedRunner$4.evaluate(RandomizedRunner.java:723)
>        at com.carrotsearch.randomizedtesting.RandomizedRunner$5.evaluate(RandomizedRunner.java:734)
>        at org.apache.lucene.util.SystemPropertiesRestoreRule$1.evaluate(SystemPropertiesRestoreRule.java:63)
>        at org.apache.lucene.util.UncaughtExceptionsRule$1.evaluate(UncaughtExceptionsRule.java:75)
>        at org.apache.lucene.util.StoreClassNameRule$1.evaluate(StoreClassNameRule.java:38)
>        at org.apache.lucene.util.SystemPropertiesInvariantRule$1.evaluate(SystemPropertiesInvariantRule.java:69)
>        at com.carrotsearch.randomizedtesting.RandomizedRunner.runSuite(RandomizedRunner.java:604)
>        at com.carrotsearch.randomizedtesting.RandomizedRunner.access$400(RandomizedRunner.java:131)
>        at com.carrotsearch.randomizedtesting.RandomizedRunner$2.run(RandomizedRunner.java:550)
>
>
> REGRESSION:  org.apache.solr.client.solrj.embedded.SolrExampleStreamingBinaryTest.testMultiContentStreamRequest
>
> Error Message:
> MIME type may not be null
>
> Stack Trace:
> java.lang.IllegalArgumentException: MIME type may not be null
>        at __randomizedtesting.SeedInfo.seed([F0FD2EF892F2C3E2:1FC903CACCA29BEB]:0)
>        at org.apache.http.entity.mime.content.AbstractContentBody.<init>(AbstractContentBody.java:43)
>        at org.apache.http.entity.mime.content.InputStreamBody.<init>(InputStreamBody.java:46)
>        at org.apache.solr.client.solrj.impl.HttpSolrServer.request(HttpSolrServer.java:293)
>        at org.apache.solr.client.solrj.impl.HttpSolrServer.request(HttpSolrServer.java:218)
>        at org.apache.solr.client.solrj.impl.ConcurrentUpdateSolrServer.request(ConcurrentUpdateSolrServer.java:248)
>        at org.apache.solr.client.solrj.SolrExampleTests.testMultiContentStreamRequest(SolrExampleTests.java:612)
>        at sun.reflect.NativeMethodAccessorImpl.invoke0(Native Method)
>        at sun.reflect.NativeMethodAccessorImpl.invoke(NativeMethodAccessorImpl.java:57)
>        at sun.reflect.DelegatingMethodAccessorImpl.invoke(DelegatingMethodAccessorImpl.java:43)
>        at java.lang.reflect.Method.invoke(Method.java:601)
>        at com.carrotsearch.randomizedtesting.RandomizedRunner.invoke(RandomizedRunner.java:1913)
>        at com.carrotsearch.randomizedtesting.RandomizedRunner.access$1100(RandomizedRunner.java:131)
>        at com.carrotsearch.randomizedtesting.RandomizedRunner$6.evaluate(RandomizedRunner.java:805)
>        at com.carrotsearch.randomizedtesting.RandomizedRunner$7.evaluate(RandomizedRunner.java:866)
>        at com.carrotsearch.randomizedtesting.RandomizedRunner$8.evaluate(RandomizedRunner.java:880)
>        at org.apache.lucene.util.SystemPropertiesRestoreRule$1.evaluate(SystemPropertiesRestoreRule.java:63)
>        at org.apache.lucene.util.LuceneTestCase$SubclassSetupTeardownRule$1.evaluate(LuceneTestCase.java:760)
>        at org.apache.lucene.util.LuceneTestCase$InternalSetupTeardownRule$1.evaluate(LuceneTestCase.java:682)
>        at org.apache.lucene.util.SystemPropertiesInvariantRule$1.evaluate(SystemPropertiesInvariantRule.java:69)
>        at org.apache.lucene.util.LuceneTestCase$TestResultInterceptorRule$1.evaluate(LuceneTestCase.java:615)
>        at org.apache.lucene.util.UncaughtExceptionsRule$1.evaluate(UncaughtExceptionsRule.java:75)
>        at org.apache.lucene.util.LuceneTestCase$SaveThreadAndTestNameRule$1.evaluate(LuceneTestCase.java:654)
>        at com.carrotsearch.randomizedtesting.RandomizedRunner.runSingleTest(RandomizedRunner.java:812)
>        at com.carrotsearch.randomizedtesting.RandomizedRunner.access$700(RandomizedRunner.java:131)
>        at com.carrotsearch.randomizedtesting.RandomizedRunner$3$1.run(RandomizedRunner.java:668)
>        at com.carrotsearch.randomizedtesting.RandomizedRunner$3.evaluate(RandomizedRunner.java:687)
>        at com.carrotsearch.randomizedtesting.RandomizedRunner$4.evaluate(RandomizedRunner.java:723)
>        at com.carrotsearch.randomizedtesting.RandomizedRunner$5.evaluate(RandomizedRunner.java:734)
>        at org.apache.lucene.util.SystemPropertiesRestoreRule$1.evaluate(SystemPropertiesRestoreRule.java:63)
>        at org.apache.lucene.util.UncaughtExceptionsRule$1.evaluate(UncaughtExceptionsRule.java:75)
>        at org.apache.lucene.util.StoreClassNameRule$1.evaluate(StoreClassNameRule.java:38)
>        at org.apache.lucene.util.SystemPropertiesInvariantRule$1.evaluate(SystemPropertiesInvariantRule.java:69)
>        at com.carrotsearch.randomizedtesting.RandomizedRunner.runSuite(RandomizedRunner.java:604)
>        at com.carrotsearch.randomizedtesting.RandomizedRunner.access$400(RandomizedRunner.java:131)
>        at com.carrotsearch.randomizedtesting.RandomizedRunner$2.run(RandomizedRunner.java:550)
>
>
> REGRESSION:  org.apache.solr.client.solrj.embedded.SolrExampleStreamingTest.testMultiContentStreamRequest
>
> Error Message:
> MIME type may not be null
>
> Stack Trace:
> java.lang.IllegalArgumentException: MIME type may not be null
>        at __randomizedtesting.SeedInfo.seed([F0FD2EF892F2C3E2:1FC903CACCA29BEB]:0)
>        at org.apache.http.entity.mime.content.AbstractContentBody.<init>(AbstractContentBody.java:43)
>        at org.apache.http.entity.mime.content.InputStreamBody.<init>(InputStreamBody.java:46)
>        at org.apache.solr.client.solrj.impl.HttpSolrServer.request(HttpSolrServer.java:293)
>        at org.apache.solr.client.solrj.impl.HttpSolrServer.request(HttpSolrServer.java:218)
>        at org.apache.solr.client.solrj.impl.ConcurrentUpdateSolrServer.request(ConcurrentUpdateSolrServer.java:248)
>        at org.apache.solr.client.solrj.SolrExampleTests.testMultiContentStreamRequest(SolrExampleTests.java:612)
>        at sun.reflect.NativeMethodAccessorImpl.invoke0(Native Method)
>        at sun.reflect.NativeMethodAccessorImpl.invoke(NativeMethodAccessorImpl.java:57)
>        at sun.reflect.DelegatingMethodAccessorImpl.invoke(DelegatingMethodAccessorImpl.java:43)
>        at java.lang.reflect.Method.invoke(Method.java:601)
>        at com.carrotsearch.randomizedtesting.RandomizedRunner.invoke(RandomizedRunner.java:1913)
>        at com.carrotsearch.randomizedtesting.RandomizedRunner.access$1100(RandomizedRunner.java:131)
>        at com.carrotsearch.randomizedtesting.RandomizedRunner$6.evaluate(RandomizedRunner.java:805)
>        at com.carrotsearch.randomizedtesting.RandomizedRunner$7.evaluate(RandomizedRunner.java:866)
>        at com.carrotsearch.randomizedtesting.RandomizedRunner$8.evaluate(RandomizedRunner.java:880)
>        at org.apache.lucene.util.SystemPropertiesRestoreRule$1.evaluate(SystemPropertiesRestoreRule.java:63)
>        at org.apache.lucene.util.LuceneTestCase$SubclassSetupTeardownRule$1.evaluate(LuceneTestCase.java:760)
>        at org.apache.lucene.util.LuceneTestCase$InternalSetupTeardownRule$1.evaluate(LuceneTestCase.java:682)
>        at org.apache.lucene.util.SystemPropertiesInvariantRule$1.evaluate(SystemPropertiesInvariantRule.java:69)
>        at org.apache.lucene.util.LuceneTestCase$TestResultInterceptorRule$1.evaluate(LuceneTestCase.java:615)
>        at org.apache.lucene.util.UncaughtExceptionsRule$1.evaluate(UncaughtExceptionsRule.java:75)
>        at org.apache.lucene.util.LuceneTestCase$SaveThreadAndTestNameRule$1.evaluate(LuceneTestCase.java:654)
>        at com.carrotsearch.randomizedtesting.RandomizedRunner.runSingleTest(RandomizedRunner.java:812)
>        at com.carrotsearch.randomizedtesting.RandomizedRunner.access$700(RandomizedRunner.java:131)
>        at com.carrotsearch.randomizedtesting.RandomizedRunner$3$1.run(RandomizedRunner.java:668)
>        at com.carrotsearch.randomizedtesting.RandomizedRunner$3.evaluate(RandomizedRunner.java:687)
>        at com.carrotsearch.randomizedtesting.RandomizedRunner$4.evaluate(RandomizedRunner.java:723)
>        at com.carrotsearch.randomizedtesting.RandomizedRunner$5.evaluate(RandomizedRunner.java:734)
>        at org.apache.lucene.util.SystemPropertiesRestoreRule$1.evaluate(SystemPropertiesRestoreRule.java:63)
>        at org.apache.lucene.util.UncaughtExceptionsRule$1.evaluate(UncaughtExceptionsRule.java:75)
>        at org.apache.lucene.util.StoreClassNameRule$1.evaluate(StoreClassNameRule.java:38)
>        at org.apache.lucene.util.SystemPropertiesInvariantRule$1.evaluate(SystemPropertiesInvariantRule.java:69)
>        at com.carrotsearch.randomizedtesting.RandomizedRunner.runSuite(RandomizedRunner.java:604)
>        at com.carrotsearch.randomizedtesting.RandomizedRunner.access$400(RandomizedRunner.java:131)
>        at com.carrotsearch.randomizedtesting.RandomizedRunner$2.run(RandomizedRunner.java:550)
>
>
>
>
> Build Log (for compile errors):
> [...truncated 9467 lines...]
>
>
>
>
> ---------------------------------------------------------------------
> To unsubscribe, e-mail: dev-unsubscribe@lucene.apache.org
> For additional commands, e-mail: dev-help@lucene.apache.org

---------------------------------------------------------------------
To unsubscribe, e-mail: dev-unsubscribe@lucene.apache.org
For additional commands, e-mail: dev-help@lucene.apache.org


Mime
View raw message