lucene-dev mailing list archives

Site index · List index
Message view « Date » · « Thread »
Top « Date » · « Thread »
From "Dyer, James" <James.D...@ingrambook.com>
Subject RE: [JENKINS-MAVEN] Lucene-Solr-Maven-3.x #449: POMs out of sync
Date Wed, 04 Apr 2012 20:32:44 GMT
SOLR-3011 (3.x only bug fixes for DIH Threading) included some more-intense multi-threaded
unit tests.  I fear that the bugs were not fully solved but occur on certain platforms/environments.
 This is the second time this test has failed this week, both times during the Maven build.
 I'd imagine the Maven tests run just so to trigger whatever is happening.

This feature is removed in Trunk, and the best solution might be to dial back the tests a
little and increase the severity of the warning on the wiki about using "threads" with DIH.


James Dyer
E-Commerce Systems
Ingram Content Group
(615) 213-4311

-----Original Message-----
From: Steven A Rowe [mailto:sarowe@syr.edu] 
Sent: Wednesday, April 04, 2012 2:46 PM
To: dev@lucene.apache.org
Subject: RE: [JENKINS-MAVEN] Lucene-Solr-Maven-3.x #449: POMs out of sync

This doesn't reproduce for me locally under Ant or under Maven. - Steve

-----Original Message-----
From: Apache Jenkins Server [mailto:jenkins@builds.apache.org] 
Sent: Wednesday, April 04, 2012 3:13 PM
To: dev@lucene.apache.org
Subject: [JENKINS-MAVEN] Lucene-Solr-Maven-3.x #449: POMs out of sync

Build: https://builds.apache.org/job/Lucene-Solr-Maven-3.x/449/

1 tests failed.
REGRESSION:  org.apache.solr.handler.dataimport.TestThreaded.testCachedThread_FullImport

Error Message:
Exception during query

Stack Trace:
java.lang.RuntimeException: Exception during query
	at org.apache.solr.SolrTestCaseJ4.assertQ(SolrTestCaseJ4.java:409)
	at org.apache.solr.SolrTestCaseJ4.assertQ(SolrTestCaseJ4.java:376)
	at org.apache.solr.handler.dataimport.TestThreaded.verify(TestThreaded.java:73)
	at sun.reflect.NativeMethodAccessorImpl.invoke0(Native Method)
	at sun.reflect.NativeMethodAccessorImpl.invoke(NativeMethodAccessorImpl.java:57)
	at sun.reflect.DelegatingMethodAccessorImpl.invoke(DelegatingMethodAccessorImpl.java:43)
	at java.lang.reflect.Method.invoke(Method.java:616)
	at org.junit.runners.model.FrameworkMethod$1.runReflectiveCall(FrameworkMethod.java:45)
	at org.junit.internal.runners.model.ReflectiveCallable.run(ReflectiveCallable.java:15)
	at org.junit.runners.model.FrameworkMethod.invokeExplosively(FrameworkMethod.java:42)
	at org.junit.internal.runners.statements.RunAfters.evaluate(RunAfters.java:36)
	at org.apache.lucene.util.SystemPropertiesRestoreRule$1.evaluate(SystemPropertiesRestoreRule.java:61)
	at org.apache.lucene.util.LuceneTestCase$SubclassSetupTeardownRule$1.evaluate(LuceneTestCase.java:630)
	at org.apache.lucene.util.LuceneTestCase$InternalSetupTeardownRule$1.evaluate(LuceneTestCase.java:536)
	at org.apache.lucene.util.SystemPropertiesInvariantRule$1.evaluate(SystemPropertiesInvariantRule.java:67)
	at org.apache.lucene.util.LuceneTestCase$TestResultInterceptorRule$1.evaluate(LuceneTestCase.java:457)
	at org.apache.lucene.util.UncaughtExceptionsRule$1.evaluate(UncaughtExceptionsRule.java:74)
	at org.apache.lucene.util.LuceneTestCase$SaveThreadAndTestNameRule$1.evaluate(LuceneTestCase.java:508)
	at org.junit.rules.RunRules.evaluate(RunRules.java:18)
	at org.junit.runners.ParentRunner.runLeaf(ParentRunner.java:263)
	at org.junit.runners.BlockJUnit4ClassRunner.runChild(BlockJUnit4ClassRunner.java:68)
	at org.apache.lucene.util.LuceneTestCaseRunner.runChild(LuceneTestCaseRunner.java:146)
	at org.apache.lucene.util.LuceneTestCaseRunner.runChild(LuceneTestCaseRunner.java:50)
	at org.junit.runners.ParentRunner$3.run(ParentRunner.java:231)
	at org.junit.runners.ParentRunner$1.schedule(ParentRunner.java:60)
	at org.junit.runners.ParentRunner.runChildren(ParentRunner.java:229)
	at org.junit.runners.ParentRunner.access$000(ParentRunner.java:50)
	at org.junit.runners.ParentRunner$2.evaluate(ParentRunner.java:222)
	at org.junit.internal.runners.statements.RunBefores.evaluate(RunBefores.java:28)
	at org.junit.internal.runners.statements.RunAfters.evaluate(RunAfters.java:30)
	at org.apache.lucene.util.SystemPropertiesRestoreRule$1.evaluate(SystemPropertiesRestoreRule.java:61)
	at org.apache.lucene.util.UncaughtExceptionsRule$1.evaluate(UncaughtExceptionsRule.java:74)
	at org.apache.lucene.util.StoreClassNameRule$1.evaluate(StoreClassNameRule.java:36)
	at org.apache.lucene.util.SystemPropertiesInvariantRule$1.evaluate(SystemPropertiesInvariantRule.java:67)
	at org.junit.rules.RunRules.evaluate(RunRules.java:18)
	at org.junit.runners.ParentRunner.run(ParentRunner.java:300)
	at org.apache.maven.surefire.junit4.JUnit4TestSet.execute(JUnit4TestSet.java:53)
	at org.apache.maven.surefire.junit4.JUnit4Provider.executeTestSet(JUnit4Provider.java:123)
	at org.apache.maven.surefire.junit4.JUnit4Provider.invoke(JUnit4Provider.java:104)
	at sun.reflect.NativeMethodAccessorImpl.invoke0(Native Method)
	at sun.reflect.NativeMethodAccessorImpl.invoke(NativeMethodAccessorImpl.java:57)
	at sun.reflect.DelegatingMethodAccessorImpl.invoke(DelegatingMethodAccessorImpl.java:43)
	at java.lang.reflect.Method.invoke(Method.java:616)
	at org.apache.maven.surefire.util.ReflectionUtils.invokeMethodWithArray(ReflectionUtils.java:164)
	at org.apache.maven.surefire.booter.ProviderFactory$ProviderProxy.invoke(ProviderFactory.java:110)
	at org.apache.maven.surefire.booter.SurefireStarter.invokeProvider(SurefireStarter.java:175)
	at org.apache.maven.surefire.booter.SurefireStarter.runSuitesInProcessWhenForked(SurefireStarter.java:107)
	at org.apache.maven.surefire.booter.ForkedBooter.main(ForkedBooter.java:68)
Caused by: java.lang.RuntimeException: REQUEST FAILED: xpath=//*[@numFound='1']
	xml response was: <?xml version="1.0" encoding="UTF-8"?> <response> <lst name="responseHeader"><int
name="status">0</int><int name="QTime">19</int><lst name="params"><str
name="start">0</str><str name="q">id:3</str><str name="qt">standard</str><str
name="rows">20</str><str name="version">2.2</str></lst></lst><result
name="response" numFound="0" start="0"/> </response>

	request was:start=0&q=id:3&qt=standard&rows=20&version=2.2
	at org.apache.solr.SolrTestCaseJ4.assertQ(SolrTestCaseJ4.java:402)
	... 47 more




Build Log (for compile errors):
[...truncated 15921 lines...]



---------------------------------------------------------------------
To unsubscribe, e-mail: dev-unsubscribe@lucene.apache.org
For additional commands, e-mail: dev-help@lucene.apache.org

Mime
View raw message