lucene-dev mailing list archives

Site index · List index
Message view « Date » · « Thread »
Top « Date » · « Thread »
From Apache Jenkins Server <jenk...@builds.apache.org>
Subject [JENKINS] Lucene-trunk - Build # 1893 - Failure
Date Sun, 15 Apr 2012 03:10:12 GMT
Build: https://builds.apache.org/job/Lucene-trunk/1893/

2 tests failed.
REGRESSION:  org.apache.lucene.index.TestIndexableField.testArbitraryFields

Error Message:
/usr/home/hudson/hudson-slave/workspace/Lucene-trunk/checkout/lucene/build/core/test/1/index2716727191tmp/_t_6.frq
(Too many open files in system)

Stack Trace:
java.io.FileNotFoundException: /usr/home/hudson/hudson-slave/workspace/Lucene-trunk/checkout/lucene/build/core/test/1/index2716727191tmp/_t_6.frq
(Too many open files in system)
	at java.io.RandomAccessFile.open(Native Method)
	at java.io.RandomAccessFile.<init>(RandomAccessFile.java:233)
	at org.apache.lucene.store.SimpleFSDirectory$SimpleFSIndexInput$Descriptor.<init>(SimpleFSDirectory.java:98)
	at org.apache.lucene.store.SimpleFSDirectory$SimpleFSIndexInput.<init>(SimpleFSDirectory.java:121)
	at org.apache.lucene.store.NIOFSDirectory$NIOFSIndexInput.<init>(NIOFSDirectory.java:116)
	at org.apache.lucene.store.NIOFSDirectory.openInput(NIOFSDirectory.java:81)
	at org.apache.lucene.store.MockDirectoryWrapper.openInput(MockDirectoryWrapper.java:503)
	at org.apache.lucene.codecs.mocksep.MockSingleIntIndexInput.<init>(MockSingleIntIndexInput.java:41)
	at org.apache.lucene.codecs.mocksep.MockSingleIntFactory.openInput(MockSingleIntFactory.java:32)
	at org.apache.lucene.codecs.mockrandom.MockRandomPostingsFormat$MockIntStreamFactory.openInput(MockRandomPostingsFormat.java:115)
	at org.apache.lucene.codecs.sep.SepPostingsReader.<init>(SepPostingsReader.java:73)
	at org.apache.lucene.codecs.mockrandom.MockRandomPostingsFormat.fieldsProducer(MockRandomPostingsFormat.java:296)
	at org.apache.lucene.codecs.perfield.PerFieldPostingsFormat$FieldsReader$1.visitOneFormat(PerFieldPostingsFormat.java:197)
	at org.apache.lucene.codecs.perfield.PerFieldPostingsFormat$VisitPerFieldFile.<init>(PerFieldPostingsFormat.java:288)
	at org.apache.lucene.codecs.perfield.PerFieldPostingsFormat$FieldsReader$1.<init>(PerFieldPostingsFormat.java:194)
	at org.apache.lucene.codecs.perfield.PerFieldPostingsFormat$FieldsReader.<init>(PerFieldPostingsFormat.java:194)
	at org.apache.lucene.codecs.perfield.PerFieldPostingsFormat.fieldsProducer(PerFieldPostingsFormat.java:264)
	at org.apache.lucene.index.SegmentCoreReaders.<init>(SegmentCoreReaders.java:108)
	at org.apache.lucene.index.SegmentReader.<init>(SegmentReader.java:55)
	at org.apache.lucene.index.ReadersAndLiveDocs.getMergeReader(ReadersAndLiveDocs.java:152)
	at org.apache.lucene.index.IndexWriter.mergeMiddle(IndexWriter.java:3344)
	at org.apache.lucene.index.IndexWriter.merge(IndexWriter.java:3004)
	at org.apache.lucene.index.SerialMergeScheduler.merge(SerialMergeScheduler.java:37)
	at org.apache.lucene.index.IndexWriter.maybeMerge(IndexWriter.java:1644)
	at org.apache.lucene.index.IndexWriter.maybeMerge(IndexWriter.java:1638)
	at org.apache.lucene.index.IndexWriter.updateDocument(IndexWriter.java:1287)
	at org.apache.lucene.index.IndexWriter.addDocument(IndexWriter.java:1034)
	at org.apache.lucene.index.RandomIndexWriter.addDocument(RandomIndexWriter.java:178)
	at org.apache.lucene.index.RandomIndexWriter.addDocument(RandomIndexWriter.java:137)
	at org.apache.lucene.index.TestIndexableField.testArbitraryFields(TestIndexableField.java:181)
	at sun.reflect.NativeMethodAccessorImpl.invoke0(Native Method)
	at sun.reflect.NativeMethodAccessorImpl.invoke(NativeMethodAccessorImpl.java:57)
	at sun.reflect.DelegatingMethodAccessorImpl.invoke(DelegatingMethodAccessorImpl.java:43)
	at java.lang.reflect.Method.invoke(Method.java:616)
	at org.junit.runners.model.FrameworkMethod$1.runReflectiveCall(FrameworkMethod.java:45)
	at org.junit.internal.runners.model.ReflectiveCallable.run(ReflectiveCallable.java:15)
	at org.junit.runners.model.FrameworkMethod.invokeExplosively(FrameworkMethod.java:42)
	at org.junit.internal.runners.statements.InvokeMethod.evaluate(InvokeMethod.java:20)
	at org.junit.internal.runners.statements.RunBefores.evaluate(RunBefores.java:28)
	at org.junit.internal.runners.statements.RunAfters.evaluate(RunAfters.java:30)
	at org.apache.lucene.util.LuceneTestCase$SubclassSetupTeardownRule$1.evaluate(LuceneTestCase.java:754)
	at org.apache.lucene.util.LuceneTestCase$InternalSetupTeardownRule$1.evaluate(LuceneTestCase.java:670)
	at org.apache.lucene.util.SystemPropertiesInvariantRule$1.evaluate(SystemPropertiesInvariantRule.java:69)
	at org.apache.lucene.util.LuceneTestCase$TestResultInterceptorRule$1.evaluate(LuceneTestCase.java:591)
	at org.apache.lucene.util.UncaughtExceptionsRule$1.evaluate(UncaughtExceptionsRule.java:75)
	at org.apache.lucene.util.LuceneTestCase$SaveThreadAndTestNameRule$1.evaluate(LuceneTestCase.java:642)
	at org.junit.rules.RunRules.evaluate(RunRules.java:18)
	at org.junit.runners.ParentRunner.runLeaf(ParentRunner.java:263)
	at org.junit.runners.BlockJUnit4ClassRunner.runChild(BlockJUnit4ClassRunner.java:68)
	at org.apache.lucene.util.LuceneTestCaseRunner.runChild(LuceneTestCaseRunner.java:164)
	at org.apache.lucene.util.LuceneTestCaseRunner.runChild(LuceneTestCaseRunner.java:57)
	at org.junit.runners.ParentRunner$3.run(ParentRunner.java:231)
	at org.junit.runners.ParentRunner$1.schedule(ParentRunner.java:60)
	at org.junit.runners.ParentRunner.runChildren(ParentRunner.java:229)
	at org.junit.runners.ParentRunner.access$000(ParentRunner.java:50)
	at org.junit.runners.ParentRunner$2.evaluate(ParentRunner.java:222)
	at org.junit.internal.runners.statements.RunBefores.evaluate(RunBefores.java:28)
	at org.junit.internal.runners.statements.RunAfters.evaluate(RunAfters.java:30)
	at org.apache.lucene.util.UncaughtExceptionsRule$1.evaluate(UncaughtExceptionsRule.java:75)
	at org.apache.lucene.util.StoreClassNameRule$1.evaluate(StoreClassNameRule.java:38)
	at org.apache.lucene.util.SystemPropertiesInvariantRule$1.evaluate(SystemPropertiesInvariantRule.java:69)
	at org.junit.rules.RunRules.evaluate(RunRules.java:18)
	at org.junit.runners.ParentRunner.run(ParentRunner.java:300)
	at junit.framework.JUnit4TestAdapter.run(JUnit4TestAdapter.java:39)
	at org.apache.tools.ant.taskdefs.optional.junit.JUnitTestRunner.run(JUnitTestRunner.java:420)
	at org.apache.tools.ant.taskdefs.optional.junit.JUnitTestRunner.launch(JUnitTestRunner.java:911)
	at org.apache.tools.ant.taskdefs.optional.junit.JUnitTestRunner.main(JUnitTestRunner.java:743)


REGRESSION:  org.apache.lucene.search.TestSearcherManager.testSearcherManager

Error Message:
Uncaught exception by thread: Thread[Thread-1228,5,]

Stack Trace:
org.apache.lucene.util.UncaughtExceptionsRule$UncaughtExceptionsInBackgroundThread: Uncaught
exception by thread: Thread[Thread-1228,5,]
	at org.apache.lucene.util.UncaughtExceptionsRule$1.evaluate(UncaughtExceptionsRule.java:84)
	at org.apache.lucene.util.LuceneTestCase$SaveThreadAndTestNameRule$1.evaluate(LuceneTestCase.java:642)
	at org.junit.rules.RunRules.evaluate(RunRules.java:18)
	at org.junit.runners.ParentRunner.runLeaf(ParentRunner.java:263)
	at org.junit.runners.BlockJUnit4ClassRunner.runChild(BlockJUnit4ClassRunner.java:68)
	at org.apache.lucene.util.LuceneTestCaseRunner.runChild(LuceneTestCaseRunner.java:164)
	at org.apache.lucene.util.LuceneTestCaseRunner.runChild(LuceneTestCaseRunner.java:57)
	at org.junit.runners.ParentRunner$3.run(ParentRunner.java:231)
	at org.junit.runners.ParentRunner$1.schedule(ParentRunner.java:60)
	at org.junit.runners.ParentRunner.runChildren(ParentRunner.java:229)
	at org.junit.runners.ParentRunner.access$000(ParentRunner.java:50)
	at org.junit.runners.ParentRunner$2.evaluate(ParentRunner.java:222)
	at org.junit.internal.runners.statements.RunBefores.evaluate(RunBefores.java:28)
	at org.junit.internal.runners.statements.RunAfters.evaluate(RunAfters.java:30)
	at org.apache.lucene.util.UncaughtExceptionsRule$1.evaluate(UncaughtExceptionsRule.java:75)
	at org.apache.lucene.util.StoreClassNameRule$1.evaluate(StoreClassNameRule.java:38)
	at org.apache.lucene.util.SystemPropertiesInvariantRule$1.evaluate(SystemPropertiesInvariantRule.java:69)
	at org.junit.rules.RunRules.evaluate(RunRules.java:18)
	at org.junit.runners.ParentRunner.run(ParentRunner.java:300)
	at junit.framework.JUnit4TestAdapter.run(JUnit4TestAdapter.java:39)
	at org.apache.tools.ant.taskdefs.optional.junit.JUnitTestRunner.run(JUnitTestRunner.java:420)
	at org.apache.tools.ant.taskdefs.optional.junit.JUnitTestRunner.launch(JUnitTestRunner.java:911)
	at org.apache.tools.ant.taskdefs.optional.junit.JUnitTestRunner.main(JUnitTestRunner.java:743)
Caused by: java.lang.RuntimeException: java.io.FileNotFoundException: /usr/home/hudson/hudson-slave/workspace/Lucene-trunk/checkout/lucene/build/core/test/2/TestSearcherManager6432564399tmp/_s_1.tip
(Too many open files in system)
	at org.apache.lucene.search.TestSearcherManager$2.run(TestSearcherManager.java:120)
Caused by: java.io.FileNotFoundException: /usr/home/hudson/hudson-slave/workspace/Lucene-trunk/checkout/lucene/build/core/test/2/TestSearcherManager6432564399tmp/_s_1.tip
(Too many open files in system)
	at java.io.RandomAccessFile.open(Native Method)
	at java.io.RandomAccessFile.<init>(RandomAccessFile.java:233)
	at org.apache.lucene.store.SimpleFSDirectory$SimpleFSIndexInput$Descriptor.<init>(SimpleFSDirectory.java:98)
	at org.apache.lucene.store.SimpleFSDirectory$SimpleFSIndexInput.<init>(SimpleFSDirectory.java:121)
	at org.apache.lucene.store.NIOFSDirectory$NIOFSIndexInput.<init>(NIOFSDirectory.java:116)
	at org.apache.lucene.store.NIOFSDirectory.openInput(NIOFSDirectory.java:81)
	at org.apache.lucene.store.MockDirectoryWrapper.openInput(MockDirectoryWrapper.java:503)
	at org.apache.lucene.codecs.BlockTreeTermsReader.<init>(BlockTreeTermsReader.java:124)
	at org.apache.lucene.codecs.pulsing.PulsingPostingsFormat.fieldsProducer(PulsingPostingsFormat.java:97)
	at org.apache.lucene.codecs.perfield.PerFieldPostingsFormat$FieldsReader$1.visitOneFormat(PerFieldPostingsFormat.java:197)
	at org.apache.lucene.codecs.perfield.PerFieldPostingsFormat$VisitPerFieldFile.<init>(PerFieldPostingsFormat.java:288)
	at org.apache.lucene.codecs.perfield.PerFieldPostingsFormat$FieldsReader$1.<init>(PerFieldPostingsFormat.java:194)
	at org.apache.lucene.codecs.perfield.PerFieldPostingsFormat$FieldsReader.<init>(PerFieldPostingsFormat.java:194)
	at org.apache.lucene.codecs.perfield.PerFieldPostingsFormat.fieldsProducer(PerFieldPostingsFormat.java:264)
	at org.apache.lucene.index.SegmentCoreReaders.<init>(SegmentCoreReaders.java:108)
	at org.apache.lucene.index.SegmentReader.<init>(SegmentReader.java:55)
	at org.apache.lucene.index.ReadersAndLiveDocs.getReader(ReadersAndLiveDocs.java:120)
	at org.apache.lucene.index.BufferedDeletesStream.applyDeletes(BufferedDeletesStream.java:267)
	at org.apache.lucene.index.IndexWriter.applyAllDeletes(IndexWriter.java:2683)
	at org.apache.lucene.index.IndexWriter.maybeApplyDeletes(IndexWriter.java:2674)
	at org.apache.lucene.index.IndexWriter.prepareCommit(IndexWriter.java:2425)
	at org.apache.lucene.index.IndexWriter.commitInternal(IndexWriter.java:2548)
	at org.apache.lucene.index.IndexWriter.commit(IndexWriter.java:2530)
	at org.apache.lucene.index.IndexWriter.commit(IndexWriter.java:2514)
	at org.apache.lucene.search.TestSearcherManager$2.run(TestSearcherManager.java:108)




Build Log (for compile errors):
[...truncated 14704 lines...]



Mime
View raw message