lucene-dev mailing list archives

Site index · List index
Message view « Date » · « Thread »
Top « Date » · « Thread »
From Apache Jenkins Server <jenk...@builds.apache.org>
Subject [JENKINS] Lucene-Solr-tests-only-trunk - Build # 13126 - Still Failing
Date Sat, 14 Apr 2012 20:12:49 GMT
Build: https://builds.apache.org/job/Lucene-Solr-tests-only-trunk/13126/

45 tests failed.
REGRESSION:  org.apache.lucene.index.TestDirectoryReaderReopen.testThreadSafety

Error Message:
Uncaught exception by thread: Thread[Lucene Merge Thread #0,6,]

Stack Trace:
org.apache.lucene.util.UncaughtExceptionsRule$UncaughtExceptionsInBackgroundThread: Uncaught exception by thread: Thread[Lucene Merge Thread #0,6,]
	at org.apache.lucene.util.UncaughtExceptionsRule$1.evaluate(UncaughtExceptionsRule.java:84)
	at org.apache.lucene.util.LuceneTestCase$SaveThreadAndTestNameRule$1.evaluate(LuceneTestCase.java:642)
	at org.junit.rules.RunRules.evaluate(RunRules.java:18)
	at org.junit.runners.ParentRunner.runLeaf(ParentRunner.java:263)
	at org.junit.runners.BlockJUnit4ClassRunner.runChild(BlockJUnit4ClassRunner.java:68)
	at org.apache.lucene.util.LuceneTestCaseRunner.runChild(LuceneTestCaseRunner.java:164)
	at org.apache.lucene.util.LuceneTestCaseRunner.runChild(LuceneTestCaseRunner.java:57)
	at org.junit.runners.ParentRunner$3.run(ParentRunner.java:231)
	at org.junit.runners.ParentRunner$1.schedule(ParentRunner.java:60)
	at org.junit.runners.ParentRunner.runChildren(ParentRunner.java:229)
	at org.junit.runners.ParentRunner.access$000(ParentRunner.java:50)
	at org.junit.runners.ParentRunner$2.evaluate(ParentRunner.java:222)
	at org.junit.internal.runners.statements.RunBefores.evaluate(RunBefores.java:28)
	at org.junit.internal.runners.statements.RunAfters.evaluate(RunAfters.java:30)
	at org.apache.lucene.util.UncaughtExceptionsRule$1.evaluate(UncaughtExceptionsRule.java:75)
	at org.apache.lucene.util.StoreClassNameRule$1.evaluate(StoreClassNameRule.java:38)
	at org.apache.lucene.util.SystemPropertiesInvariantRule$1.evaluate(SystemPropertiesInvariantRule.java:69)
	at org.junit.rules.RunRules.evaluate(RunRules.java:18)
	at org.junit.runners.ParentRunner.run(ParentRunner.java:300)
	at junit.framework.JUnit4TestAdapter.run(JUnit4TestAdapter.java:39)
	at org.apache.tools.ant.taskdefs.optional.junit.JUnitTestRunner.run(JUnitTestRunner.java:420)
	at org.apache.tools.ant.taskdefs.optional.junit.JUnitTestRunner.launch(JUnitTestRunner.java:911)
	at org.apache.tools.ant.taskdefs.optional.junit.JUnitTestRunner.main(JUnitTestRunner.java:743)
Caused by: org.apache.lucene.index.MergePolicy$MergeException: java.io.FileNotFoundException: /usr/home/hudson/hudson-slave/workspace/Lucene-Solr-tests-only-trunk/checkout/lucene/build/core/test/1/index3457334575tmp/_4_nrm.cfe (Too many open files in system)
	at org.apache.lucene.index.ConcurrentMergeScheduler.handleMergeException(ConcurrentMergeScheduler.java:507)
	at org.apache.lucene.index.ConcurrentMergeScheduler$MergeThread.run(ConcurrentMergeScheduler.java:480)
Caused by: java.io.FileNotFoundException: /usr/home/hudson/hudson-slave/workspace/Lucene-Solr-tests-only-trunk/checkout/lucene/build/core/test/1/index3457334575tmp/_4_nrm.cfe (Too many open files in system)
	at java.io.RandomAccessFile.open(Native Method)
	at java.io.RandomAccessFile.<init>(RandomAccessFile.java:233)
	at org.apache.lucene.store.SimpleFSDirectory$SimpleFSIndexInput$Descriptor.<init>(SimpleFSDirectory.java:98)
	at org.apache.lucene.store.SimpleFSDirectory$SimpleFSIndexInput.<init>(SimpleFSDirectory.java:121)
	at org.apache.lucene.store.NIOFSDirectory$NIOFSIndexInput.<init>(NIOFSDirectory.java:116)
	at org.apache.lucene.store.NIOFSDirectory.openInput(NIOFSDirectory.java:81)
	at org.apache.lucene.store.MockDirectoryWrapper.openInput(MockDirectoryWrapper.java:503)
	at org.apache.lucene.store.CompoundFileDirectory.readEntries(CompoundFileDirectory.java:101)
	at org.apache.lucene.store.CompoundFileDirectory.<init>(CompoundFileDirectory.java:67)
	at org.apache.lucene.codecs.lucene40.Lucene40DocValuesProducer.<init>(Lucene40DocValuesProducer.java:53)
	at org.apache.lucene.codecs.lucene40.Lucene40NormsFormat$Lucene40NormsDocValuesProducer.<init>(Lucene40NormsFormat.java:60)
	at org.apache.lucene.codecs.lucene40.Lucene40NormsFormat.docsProducer(Lucene40NormsFormat.java:48)
	at org.apache.lucene.index.SegmentCoreReaders.<init>(SegmentCoreReaders.java:113)
	at org.apache.lucene.index.SegmentReader.<init>(SegmentReader.java:55)
	at org.apache.lucene.index.ReadersAndLiveDocs.getMergeReader(ReadersAndLiveDocs.java:152)
	at org.apache.lucene.index.IndexWriter.mergeMiddle(IndexWriter.java:3344)
	at org.apache.lucene.index.IndexWriter.merge(IndexWriter.java:3004)
	at org.apache.lucene.index.ConcurrentMergeScheduler.doMerge(ConcurrentMergeScheduler.java:382)
	at org.apache.lucene.index.ConcurrentMergeScheduler$MergeThread.run(ConcurrentMergeScheduler.java:451)


REGRESSION:  org.apache.lucene.index.TestIndexWriterOnDiskFull.testAddIndexOnDiskFull

Error Message:
addIndexes(Directory[]) + forceMerge(1) hit IOException after disk space was freed up

Stack Trace:
junit.framework.AssertionFailedError: addIndexes(Directory[]) + forceMerge(1) hit IOException after disk space was freed up
	at org.apache.tools.ant.taskdefs.optional.junit.JUnitTestRunner$3.addError(JUnitTestRunner.java:974)
	at junit.framework.TestResult.addError(TestResult.java:38)
	at junit.framework.JUnit4TestAdapterCache$1.testFailure(JUnit4TestAdapterCache.java:51)
	at org.junit.runner.notification.RunNotifier$4.notifyListener(RunNotifier.java:100)
	at org.junit.runner.notification.RunNotifier$SafeNotifier.run(RunNotifier.java:41)
	at org.junit.runner.notification.RunNotifier.fireTestFailure(RunNotifier.java:97)
	at org.junit.internal.runners.model.EachTestNotifier.addFailure(EachTestNotifier.java:26)
	at org.junit.runners.ParentRunner.runLeaf(ParentRunner.java:267)
	at org.junit.runners.BlockJUnit4ClassRunner.runChild(BlockJUnit4ClassRunner.java:68)
	at org.apache.lucene.util.LuceneTestCaseRunner.runChild(LuceneTestCaseRunner.java:164)
	at org.apache.lucene.util.LuceneTestCaseRunner.runChild(LuceneTestCaseRunner.java:57)
	at org.junit.runners.ParentRunner$3.run(ParentRunner.java:231)
	at org.junit.runners.ParentRunner$1.schedule(ParentRunner.java:60)
	at org.junit.runners.ParentRunner.runChildren(ParentRunner.java:229)
	at org.junit.runners.ParentRunner.access$000(ParentRunner.java:50)
	at org.junit.runners.ParentRunner$2.evaluate(ParentRunner.java:222)
	at org.junit.internal.runners.statements.RunBefores.evaluate(RunBefores.java:28)
	at org.junit.internal.runners.statements.RunAfters.evaluate(RunAfters.java:30)
	at org.apache.lucene.util.UncaughtExceptionsRule$1.evaluate(UncaughtExceptionsRule.java:75)
	at org.apache.lucene.util.StoreClassNameRule$1.evaluate(StoreClassNameRule.java:38)
	at org.apache.lucene.util.SystemPropertiesInvariantRule$1.evaluate(SystemPropertiesInvariantRule.java:69)
	at org.junit.rules.RunRules.evaluate(RunRules.java:18)
	at org.junit.runners.ParentRunner.run(ParentRunner.java:300)
	at junit.framework.JUnit4TestAdapter.run(JUnit4TestAdapter.java:39)
	at org.apache.tools.ant.taskdefs.optional.junit.JUnitTestRunner.run(JUnitTestRunner.java:420)
	at org.apache.tools.ant.taskdefs.optional.junit.JUnitTestRunner.launch(JUnitTestRunner.java:911)
	at org.apache.tools.ant.taskdefs.optional.junit.JUnitTestRunner.main(JUnitTestRunner.java:743)
Caused by: java.lang.AssertionError: addIndexes(Directory[]) + forceMerge(1) hit IOException after disk space was freed up
	at org.junit.Assert.fail(Assert.java:93)
	at org.apache.lucene.index.TestIndexWriterOnDiskFull.testAddIndexOnDiskFull(TestIndexWriterOnDiskFull.java:347)
	at sun.reflect.NativeMethodAccessorImpl.invoke0(Native Method)
	at sun.reflect.NativeMethodAccessorImpl.invoke(NativeMethodAccessorImpl.java:57)
	at sun.reflect.DelegatingMethodAccessorImpl.invoke(DelegatingMethodAccessorImpl.java:43)
	at java.lang.reflect.Method.invoke(Method.java:616)
	at org.junit.runners.model.FrameworkMethod$1.runReflectiveCall(FrameworkMethod.java:45)
	at org.junit.internal.runners.model.ReflectiveCallable.run(ReflectiveCallable.java:15)
	at org.junit.runners.model.FrameworkMethod.invokeExplosively(FrameworkMethod.java:42)
	at org.junit.internal.runners.statements.InvokeMethod.evaluate(InvokeMethod.java:20)
	at org.junit.internal.runners.statements.RunBefores.evaluate(RunBefores.java:28)
	at org.junit.internal.runners.statements.RunAfters.evaluate(RunAfters.java:30)
	at org.apache.lucene.util.LuceneTestCase$SubclassSetupTeardownRule$1.evaluate(LuceneTestCase.java:754)
	at org.apache.lucene.util.LuceneTestCase$InternalSetupTeardownRule$1.evaluate(LuceneTestCase.java:670)
	at org.apache.lucene.util.SystemPropertiesInvariantRule$1.evaluate(SystemPropertiesInvariantRule.java:69)
	at org.apache.lucene.util.LuceneTestCase$TestResultInterceptorRule$1.evaluate(LuceneTestCase.java:591)
	at org.apache.lucene.util.UncaughtExceptionsRule$1.evaluate(UncaughtExceptionsRule.java:75)
	at org.apache.lucene.util.LuceneTestCase$SaveThreadAndTestNameRule$1.evaluate(LuceneTestCase.java:642)
	at org.junit.rules.RunRules.evaluate(RunRules.java:18)
	at org.junit.runners.ParentRunner.runLeaf(ParentRunner.java:263)
	... 19 more


REGRESSION:  org.apache.lucene.index.TestIndexWriterWithThreads.testCloseWithThreads

Error Message:
/usr/home/hudson/hudson-slave/workspace/Lucene-Solr-tests-only-trunk/checkout/lucene/build/core/test/4/index4559845628tmp/_4.tvf (Too many open files in system)

Stack Trace:
java.io.FileNotFoundException: /usr/home/hudson/hudson-slave/workspace/Lucene-Solr-tests-only-trunk/checkout/lucene/build/core/test/4/index4559845628tmp/_4.tvf (Too many open files in system)
	at java.io.RandomAccessFile.open(Native Method)
	at java.io.RandomAccessFile.<init>(RandomAccessFile.java:233)
	at org.apache.lucene.store.SimpleFSDirectory$SimpleFSIndexInput$Descriptor.<init>(SimpleFSDirectory.java:98)
	at org.apache.lucene.store.SimpleFSDirectory$SimpleFSIndexInput.<init>(SimpleFSDirectory.java:121)
	at org.apache.lucene.store.SimpleFSDirectory.openInput(SimpleFSDirectory.java:60)
	at org.apache.lucene.store.MockDirectoryWrapper.openInput(MockDirectoryWrapper.java:503)
	at org.apache.lucene.codecs.lucene40.Lucene40TermVectorsReader.<init>(Lucene40TermVectorsReader.java:115)
	at org.apache.lucene.codecs.lucene40.Lucene40TermVectorsFormat.vectorsReader(Lucene40TermVectorsFormat.java:35)
	at org.apache.lucene.index.SegmentCoreReaders.<init>(SegmentCoreReaders.java:119)
	at org.apache.lucene.index.SegmentReader.<init>(SegmentReader.java:55)
	at org.apache.lucene.index.ReadersAndLiveDocs.getReader(ReadersAndLiveDocs.java:120)
	at org.apache.lucene.index.BufferedDeletesStream.applyDeletes(BufferedDeletesStream.java:267)
	at org.apache.lucene.index.IndexWriter.applyAllDeletes(IndexWriter.java:2683)
	at org.apache.lucene.index.IndexWriter.maybeApplyDeletes(IndexWriter.java:2674)
	at org.apache.lucene.index.IndexWriter.doFlush(IndexWriter.java:2647)
	at org.apache.lucene.index.IndexWriter.flush(IndexWriter.java:2616)
	at org.apache.lucene.index.IndexWriter.closeInternal(IndexWriter.java:851)
	at org.apache.lucene.index.IndexWriter.close(IndexWriter.java:810)
	at org.apache.lucene.index.TestIndexWriterWithThreads.testCloseWithThreads(TestIndexWriterWithThreads.java:201)
	at sun.reflect.NativeMethodAccessorImpl.invoke0(Native Method)
	at sun.reflect.NativeMethodAccessorImpl.invoke(NativeMethodAccessorImpl.java:57)
	at sun.reflect.DelegatingMethodAccessorImpl.invoke(DelegatingMethodAccessorImpl.java:43)
	at java.lang.reflect.Method.invoke(Method.java:616)
	at org.junit.runners.model.FrameworkMethod$1.runReflectiveCall(FrameworkMethod.java:45)
	at org.junit.internal.runners.model.ReflectiveCallable.run(ReflectiveCallable.java:15)
	at org.junit.runners.model.FrameworkMethod.invokeExplosively(FrameworkMethod.java:42)
	at org.junit.internal.runners.statements.InvokeMethod.evaluate(InvokeMethod.java:20)
	at org.junit.internal.runners.statements.RunBefores.evaluate(RunBefores.java:28)
	at org.junit.internal.runners.statements.RunAfters.evaluate(RunAfters.java:30)
	at org.apache.lucene.util.LuceneTestCase$SubclassSetupTeardownRule$1.evaluate(LuceneTestCase.java:754)
	at org.apache.lucene.util.LuceneTestCase$InternalSetupTeardownRule$1.evaluate(LuceneTestCase.java:670)
	at org.apache.lucene.util.SystemPropertiesInvariantRule$1.evaluate(SystemPropertiesInvariantRule.java:69)
	at org.apache.lucene.util.LuceneTestCase$TestResultInterceptorRule$1.evaluate(LuceneTestCase.java:591)
	at org.apache.lucene.util.UncaughtExceptionsRule$1.evaluate(UncaughtExceptionsRule.java:75)
	at org.apache.lucene.util.LuceneTestCase$SaveThreadAndTestNameRule$1.evaluate(LuceneTestCase.java:642)
	at org.junit.rules.RunRules.evaluate(RunRules.java:18)
	at org.junit.runners.ParentRunner.runLeaf(ParentRunner.java:263)
	at org.junit.runners.BlockJUnit4ClassRunner.runChild(BlockJUnit4ClassRunner.java:68)
	at org.apache.lucene.util.LuceneTestCaseRunner.runChild(LuceneTestCaseRunner.java:164)
	at org.apache.lucene.util.LuceneTestCaseRunner.runChild(LuceneTestCaseRunner.java:57)
	at org.junit.runners.ParentRunner$3.run(ParentRunner.java:231)
	at org.junit.runners.ParentRunner$1.schedule(ParentRunner.java:60)
	at org.junit.runners.ParentRunner.runChildren(ParentRunner.java:229)
	at org.junit.runners.ParentRunner.access$000(ParentRunner.java:50)
	at org.junit.runners.ParentRunner$2.evaluate(ParentRunner.java:222)
	at org.junit.internal.runners.statements.RunBefores.evaluate(RunBefores.java:28)
	at org.junit.internal.runners.statements.RunAfters.evaluate(RunAfters.java:30)
	at org.apache.lucene.util.UncaughtExceptionsRule$1.evaluate(UncaughtExceptionsRule.java:75)
	at org.apache.lucene.util.StoreClassNameRule$1.evaluate(StoreClassNameRule.java:38)
	at org.apache.lucene.util.SystemPropertiesInvariantRule$1.evaluate(SystemPropertiesInvariantRule.java:69)
	at org.junit.rules.RunRules.evaluate(RunRules.java:18)
	at org.junit.runners.ParentRunner.run(ParentRunner.java:300)
	at junit.framework.JUnit4TestAdapter.run(JUnit4TestAdapter.java:39)
	at org.apache.tools.ant.taskdefs.optional.junit.JUnitTestRunner.run(JUnitTestRunner.java:420)
	at org.apache.tools.ant.taskdefs.optional.junit.JUnitTestRunner.launch(JUnitTestRunner.java:911)
	at org.apache.tools.ant.taskdefs.optional.junit.JUnitTestRunner.main(JUnitTestRunner.java:743)


REGRESSION:  org.apache.lucene.index.TestNeverDelete.testIndexing

Error Message:
/usr/home/hudson/hudson-slave/workspace/Lucene-Solr-tests-only-trunk/checkout/lucene/build/core/test/1/TestNeverDelete3457334585tmp/_b.cfe (Too many open files in system)

Stack Trace:
java.io.FileNotFoundException: /usr/home/hudson/hudson-slave/workspace/Lucene-Solr-tests-only-trunk/checkout/lucene/build/core/test/1/TestNeverDelete3457334585tmp/_b.cfe (Too many open files in system)
	at java.io.RandomAccessFile.open(Native Method)
	at java.io.RandomAccessFile.<init>(RandomAccessFile.java:233)
	at org.apache.lucene.store.SimpleFSDirectory$SimpleFSIndexInput$Descriptor.<init>(SimpleFSDirectory.java:98)
	at org.apache.lucene.store.SimpleFSDirectory$SimpleFSIndexInput.<init>(SimpleFSDirectory.java:121)
	at org.apache.lucene.store.SimpleFSDirectory.openInput(SimpleFSDirectory.java:60)
	at org.apache.lucene.store.MockDirectoryWrapper.openInput(MockDirectoryWrapper.java:503)
	at org.apache.lucene.store.CompoundFileDirectory.readEntries(CompoundFileDirectory.java:101)
	at org.apache.lucene.store.CompoundFileDirectory.<init>(CompoundFileDirectory.java:67)
	at org.apache.lucene.index.SegmentInfo.loadFieldInfos(SegmentInfo.java:196)
	at org.apache.lucene.index.SegmentInfo.getFieldInfos(SegmentInfo.java:227)
	at org.apache.lucene.index.SegmentInfo.files(SegmentInfo.java:415)
	at org.apache.lucene.index.SegmentInfos.files(SegmentInfos.java:756)
	at org.apache.lucene.index.StandardDirectoryReader$ReaderCommit.<init>(StandardDirectoryReader.java:369)
	at org.apache.lucene.index.StandardDirectoryReader.getIndexCommit(StandardDirectoryReader.java:354)
	at org.apache.lucene.index.TestNeverDelete.testIndexing(TestNeverDelete.java:85)
	at sun.reflect.NativeMethodAccessorImpl.invoke0(Native Method)
	at sun.reflect.NativeMethodAccessorImpl.invoke(NativeMethodAccessorImpl.java:57)
	at sun.reflect.DelegatingMethodAccessorImpl.invoke(DelegatingMethodAccessorImpl.java:43)
	at java.lang.reflect.Method.invoke(Method.java:616)
	at org.junit.runners.model.FrameworkMethod$1.runReflectiveCall(FrameworkMethod.java:45)
	at org.junit.internal.runners.model.ReflectiveCallable.run(ReflectiveCallable.java:15)
	at org.junit.runners.model.FrameworkMethod.invokeExplosively(FrameworkMethod.java:42)
	at org.junit.internal.runners.statements.InvokeMethod.evaluate(InvokeMethod.java:20)
	at org.junit.internal.runners.statements.RunBefores.evaluate(RunBefores.java:28)
	at org.junit.internal.runners.statements.RunAfters.evaluate(RunAfters.java:30)
	at org.apache.lucene.util.LuceneTestCase$SubclassSetupTeardownRule$1.evaluate(LuceneTestCase.java:754)
	at org.apache.lucene.util.LuceneTestCase$InternalSetupTeardownRule$1.evaluate(LuceneTestCase.java:670)
	at org.apache.lucene.util.SystemPropertiesInvariantRule$1.evaluate(SystemPropertiesInvariantRule.java:69)
	at org.apache.lucene.util.LuceneTestCase$TestResultInterceptorRule$1.evaluate(LuceneTestCase.java:591)
	at org.apache.lucene.util.UncaughtExceptionsRule$1.evaluate(UncaughtExceptionsRule.java:75)
	at org.apache.lucene.util.LuceneTestCase$SaveThreadAndTestNameRule$1.evaluate(LuceneTestCase.java:642)
	at org.junit.rules.RunRules.evaluate(RunRules.java:18)
	at org.junit.runners.ParentRunner.runLeaf(ParentRunner.java:263)
	at org.junit.runners.BlockJUnit4ClassRunner.runChild(BlockJUnit4ClassRunner.java:68)
	at org.apache.lucene.util.LuceneTestCaseRunner.runChild(LuceneTestCaseRunner.java:164)
	at org.apache.lucene.util.LuceneTestCaseRunner.runChild(LuceneTestCaseRunner.java:57)
	at org.junit.runners.ParentRunner$3.run(ParentRunner.java:231)
	at org.junit.runners.ParentRunner$1.schedule(ParentRunner.java:60)
	at org.junit.runners.ParentRunner.runChildren(ParentRunner.java:229)
	at org.junit.runners.ParentRunner.access$000(ParentRunner.java:50)
	at org.junit.runners.ParentRunner$2.evaluate(ParentRunner.java:222)
	at org.junit.internal.runners.statements.RunBefores.evaluate(RunBefores.java:28)
	at org.junit.internal.runners.statements.RunAfters.evaluate(RunAfters.java:30)
	at org.apache.lucene.util.UncaughtExceptionsRule$1.evaluate(UncaughtExceptionsRule.java:75)
	at org.apache.lucene.util.StoreClassNameRule$1.evaluate(StoreClassNameRule.java:38)
	at org.apache.lucene.util.SystemPropertiesInvariantRule$1.evaluate(SystemPropertiesInvariantRule.java:69)
	at org.junit.rules.RunRules.evaluate(RunRules.java:18)
	at org.junit.runners.ParentRunner.run(ParentRunner.java:300)
	at junit.framework.JUnit4TestAdapter.run(JUnit4TestAdapter.java:39)
	at org.apache.tools.ant.taskdefs.optional.junit.JUnitTestRunner.run(JUnitTestRunner.java:420)
	at org.apache.tools.ant.taskdefs.optional.junit.JUnitTestRunner.launch(JUnitTestRunner.java:911)
	at org.apache.tools.ant.taskdefs.optional.junit.JUnitTestRunner.main(JUnitTestRunner.java:743)


REGRESSION:  org.apache.lucene.index.TestNorms.testNormsNotPresent

Error Message:
/usr/home/hudson/hudson-slave/workspace/Lucene-Solr-tests-only-trunk/checkout/lucene/build/core/test/2/index5714457175tmp/_8_3.frq (Too many open files in system)

Stack Trace:
java.io.FileNotFoundException: /usr/home/hudson/hudson-slave/workspace/Lucene-Solr-tests-only-trunk/checkout/lucene/build/core/test/2/index5714457175tmp/_8_3.frq (Too many open files in system)
	at java.io.RandomAccessFile.open(Native Method)
	at java.io.RandomAccessFile.<init>(RandomAccessFile.java:233)
	at org.apache.lucene.store.SimpleFSDirectory$SimpleFSIndexInput$Descriptor.<init>(SimpleFSDirectory.java:98)
	at org.apache.lucene.store.SimpleFSDirectory$SimpleFSIndexInput.<init>(SimpleFSDirectory.java:121)
	at org.apache.lucene.store.NIOFSDirectory$NIOFSIndexInput.<init>(NIOFSDirectory.java:116)
	at org.apache.lucene.store.NIOFSDirectory.openInput(NIOFSDirectory.java:81)
	at org.apache.lucene.store.MockDirectoryWrapper.openInput(MockDirectoryWrapper.java:503)
	at org.apache.lucene.codecs.mockintblock.MockVariableIntBlockPostingsFormat$MockIntFactory.openInput(MockVariableIntBlockPostingsFormat.java:86)
	at org.apache.lucene.codecs.mockrandom.MockRandomPostingsFormat$MockIntStreamFactory.openInput(MockRandomPostingsFormat.java:115)
	at org.apache.lucene.codecs.sep.SepPostingsReader.<init>(SepPostingsReader.java:73)
	at org.apache.lucene.codecs.mockrandom.MockRandomPostingsFormat.fieldsProducer(MockRandomPostingsFormat.java:296)
	at org.apache.lucene.codecs.perfield.PerFieldPostingsFormat$FieldsReader$1.visitOneFormat(PerFieldPostingsFormat.java:197)
	at org.apache.lucene.codecs.perfield.PerFieldPostingsFormat$VisitPerFieldFile.<init>(PerFieldPostingsFormat.java:288)
	at org.apache.lucene.codecs.perfield.PerFieldPostingsFormat$FieldsReader$1.<init>(PerFieldPostingsFormat.java:194)
	at org.apache.lucene.codecs.perfield.PerFieldPostingsFormat$FieldsReader.<init>(PerFieldPostingsFormat.java:194)
	at org.apache.lucene.codecs.perfield.PerFieldPostingsFormat.fieldsProducer(PerFieldPostingsFormat.java:264)
	at org.apache.lucene.index.SegmentCoreReaders.<init>(SegmentCoreReaders.java:108)
	at org.apache.lucene.index.SegmentReader.<init>(SegmentReader.java:55)
	at org.apache.lucene.index.StandardDirectoryReader$1.doBody(StandardDirectoryReader.java:62)
	at org.apache.lucene.index.SegmentInfos$FindSegmentsFile.run(SegmentInfos.java:629)
	at org.apache.lucene.index.StandardDirectoryReader.open(StandardDirectoryReader.java:52)
	at org.apache.lucene.index.DirectoryReader.open(DirectoryReader.java:64)
	at org.apache.lucene.index.IndexReader.open(IndexReader.java:290)
	at org.apache.lucene.index.TestNorms.testNormsNotPresent(TestNorms.java:125)
	at sun.reflect.NativeMethodAccessorImpl.invoke0(Native Method)
	at sun.reflect.NativeMethodAccessorImpl.invoke(NativeMethodAccessorImpl.java:57)
	at sun.reflect.DelegatingMethodAccessorImpl.invoke(DelegatingMethodAccessorImpl.java:43)
	at java.lang.reflect.Method.invoke(Method.java:616)
	at org.junit.runners.model.FrameworkMethod$1.runReflectiveCall(FrameworkMethod.java:45)
	at org.junit.internal.runners.model.ReflectiveCallable.run(ReflectiveCallable.java:15)
	at org.junit.runners.model.FrameworkMethod.invokeExplosively(FrameworkMethod.java:42)
	at org.junit.internal.runners.statements.InvokeMethod.evaluate(InvokeMethod.java:20)
	at org.junit.internal.runners.statements.RunBefores.evaluate(RunBefores.java:28)
	at org.junit.internal.runners.statements.RunAfters.evaluate(RunAfters.java:30)
	at org.apache.lucene.util.LuceneTestCase$SubclassSetupTeardownRule$1.evaluate(LuceneTestCase.java:754)
	at org.apache.lucene.util.LuceneTestCase$InternalSetupTeardownRule$1.evaluate(LuceneTestCase.java:670)
	at org.apache.lucene.util.SystemPropertiesInvariantRule$1.evaluate(SystemPropertiesInvariantRule.java:69)
	at org.apache.lucene.util.LuceneTestCase$TestResultInterceptorRule$1.evaluate(LuceneTestCase.java:591)
	at org.apache.lucene.util.UncaughtExceptionsRule$1.evaluate(UncaughtExceptionsRule.java:75)
	at org.apache.lucene.util.LuceneTestCase$SaveThreadAndTestNameRule$1.evaluate(LuceneTestCase.java:642)
	at org.junit.rules.RunRules.evaluate(RunRules.java:18)
	at org.junit.runners.ParentRunner.runLeaf(ParentRunner.java:263)
	at org.junit.runners.BlockJUnit4ClassRunner.runChild(BlockJUnit4ClassRunner.java:68)
	at org.apache.lucene.util.LuceneTestCaseRunner.runChild(LuceneTestCaseRunner.java:164)
	at org.apache.lucene.util.LuceneTestCaseRunner.runChild(LuceneTestCaseRunner.java:57)
	at org.junit.runners.ParentRunner$3.run(ParentRunner.java:231)
	at org.junit.runners.ParentRunner$1.schedule(ParentRunner.java:60)
	at org.junit.runners.ParentRunner.runChildren(ParentRunner.java:229)
	at org.junit.runners.ParentRunner.access$000(ParentRunner.java:50)
	at org.junit.runners.ParentRunner$2.evaluate(ParentRunner.java:222)
	at org.junit.internal.runners.statements.RunBefores.evaluate(RunBefores.java:28)
	at org.junit.internal.runners.statements.RunAfters.evaluate(RunAfters.java:30)
	at org.apache.lucene.util.UncaughtExceptionsRule$1.evaluate(UncaughtExceptionsRule.java:75)
	at org.apache.lucene.util.StoreClassNameRule$1.evaluate(StoreClassNameRule.java:38)
	at org.apache.lucene.util.SystemPropertiesInvariantRule$1.evaluate(SystemPropertiesInvariantRule.java:69)
	at org.junit.rules.RunRules.evaluate(RunRules.java:18)
	at org.junit.runners.ParentRunner.run(ParentRunner.java:300)
	at junit.framework.JUnit4TestAdapter.run(JUnit4TestAdapter.java:39)
	at org.apache.tools.ant.taskdefs.optional.junit.JUnitTestRunner.run(JUnitTestRunner.java:420)
	at org.apache.tools.ant.taskdefs.optional.junit.JUnitTestRunner.launch(JUnitTestRunner.java:911)
	at org.apache.tools.ant.taskdefs.optional.junit.JUnitTestRunner.main(JUnitTestRunner.java:743)


REGRESSION:  org.apache.lucene.index.TestParallelAtomicReader.testIncompatibleIndexes

Error Message:
/usr/home/hudson/hudson-slave/workspace/Lucene-Solr-tests-only-trunk/checkout/lucene/build/core/test/4/index4559845629tmp/_0.fdx (Too many open files in system)

Stack Trace:
java.io.FileNotFoundException: /usr/home/hudson/hudson-slave/workspace/Lucene-Solr-tests-only-trunk/checkout/lucene/build/core/test/4/index4559845629tmp/_0.fdx (Too many open files in system)
	at java.io.RandomAccessFile.open(Native Method)
	at java.io.RandomAccessFile.<init>(RandomAccessFile.java:233)
	at org.apache.lucene.store.SimpleFSDirectory$SimpleFSIndexInput$Descriptor.<init>(SimpleFSDirectory.java:98)
	at org.apache.lucene.store.SimpleFSDirectory$SimpleFSIndexInput.<init>(SimpleFSDirectory.java:121)
	at org.apache.lucene.store.SimpleFSDirectory.openInput(SimpleFSDirectory.java:60)
	at org.apache.lucene.store.NRTCachingDirectory.openInput(NRTCachingDirectory.java:228)
	at org.apache.lucene.store.MockDirectoryWrapper.openInput(MockDirectoryWrapper.java:503)
	at org.apache.lucene.codecs.lucene40.Lucene40StoredFieldsReader.<init>(Lucene40StoredFieldsReader.java:82)
	at org.apache.lucene.codecs.lucene40.Lucene40StoredFieldsFormat.fieldsReader(Lucene40StoredFieldsFormat.java:37)
	at org.apache.lucene.index.SegmentCoreReaders.<init>(SegmentCoreReaders.java:116)
	at org.apache.lucene.index.SegmentReader.<init>(SegmentReader.java:55)
	at org.apache.lucene.index.StandardDirectoryReader$1.doBody(StandardDirectoryReader.java:62)
	at org.apache.lucene.index.SegmentInfos$FindSegmentsFile.run(SegmentInfos.java:629)
	at org.apache.lucene.index.StandardDirectoryReader.open(StandardDirectoryReader.java:52)
	at org.apache.lucene.index.DirectoryReader.open(DirectoryReader.java:64)
	at org.apache.lucene.index.TestParallelAtomicReader.testIncompatibleIndexes(TestParallelAtomicReader.java:130)
	at sun.reflect.NativeMethodAccessorImpl.invoke0(Native Method)
	at sun.reflect.NativeMethodAccessorImpl.invoke(NativeMethodAccessorImpl.java:57)
	at sun.reflect.DelegatingMethodAccessorImpl.invoke(DelegatingMethodAccessorImpl.java:43)
	at java.lang.reflect.Method.invoke(Method.java:616)
	at org.junit.runners.model.FrameworkMethod$1.runReflectiveCall(FrameworkMethod.java:45)
	at org.junit.internal.runners.model.ReflectiveCallable.run(ReflectiveCallable.java:15)
	at org.junit.runners.model.FrameworkMethod.invokeExplosively(FrameworkMethod.java:42)
	at org.junit.internal.runners.statements.InvokeMethod.evaluate(InvokeMethod.java:20)
	at org.junit.internal.runners.statements.RunBefores.evaluate(RunBefores.java:28)
	at org.junit.internal.runners.statements.RunAfters.evaluate(RunAfters.java:30)
	at org.apache.lucene.util.LuceneTestCase$SubclassSetupTeardownRule$1.evaluate(LuceneTestCase.java:754)
	at org.apache.lucene.util.LuceneTestCase$InternalSetupTeardownRule$1.evaluate(LuceneTestCase.java:670)
	at org.apache.lucene.util.SystemPropertiesInvariantRule$1.evaluate(SystemPropertiesInvariantRule.java:69)
	at org.apache.lucene.util.LuceneTestCase$TestResultInterceptorRule$1.evaluate(LuceneTestCase.java:591)
	at org.apache.lucene.util.UncaughtExceptionsRule$1.evaluate(UncaughtExceptionsRule.java:75)
	at org.apache.lucene.util.LuceneTestCase$SaveThreadAndTestNameRule$1.evaluate(LuceneTestCase.java:642)
	at org.junit.rules.RunRules.evaluate(RunRules.java:18)
	at org.junit.runners.ParentRunner.runLeaf(ParentRunner.java:263)
	at org.junit.runners.BlockJUnit4ClassRunner.runChild(BlockJUnit4ClassRunner.java:68)
	at org.apache.lucene.util.LuceneTestCaseRunner.runChild(LuceneTestCaseRunner.java:164)
	at org.apache.lucene.util.LuceneTestCaseRunner.runChild(LuceneTestCaseRunner.java:57)
	at org.junit.runners.ParentRunner$3.run(ParentRunner.java:231)
	at org.junit.runners.ParentRunner$1.schedule(ParentRunner.java:60)
	at org.junit.runners.ParentRunner.runChildren(ParentRunner.java:229)
	at org.junit.runners.ParentRunner.access$000(ParentRunner.java:50)
	at org.junit.runners.ParentRunner$2.evaluate(ParentRunner.java:222)
	at org.junit.internal.runners.statements.RunBefores.evaluate(RunBefores.java:28)
	at org.junit.internal.runners.statements.RunAfters.evaluate(RunAfters.java:30)
	at org.apache.lucene.util.UncaughtExceptionsRule$1.evaluate(UncaughtExceptionsRule.java:75)
	at org.apache.lucene.util.StoreClassNameRule$1.evaluate(StoreClassNameRule.java:38)
	at org.apache.lucene.util.SystemPropertiesInvariantRule$1.evaluate(SystemPropertiesInvariantRule.java:69)
	at org.junit.rules.RunRules.evaluate(RunRules.java:18)
	at org.junit.runners.ParentRunner.run(ParentRunner.java:300)
	at junit.framework.JUnit4TestAdapter.run(JUnit4TestAdapter.java:39)
	at org.apache.tools.ant.taskdefs.optional.junit.JUnitTestRunner.run(JUnitTestRunner.java:420)
	at org.apache.tools.ant.taskdefs.optional.junit.JUnitTestRunner.launch(JUnitTestRunner.java:911)
	at org.apache.tools.ant.taskdefs.optional.junit.JUnitTestRunner.main(JUnitTestRunner.java:743)


REGRESSION:  org.apache.lucene.index.TestPayloads.testPayloadFieldBit

Error Message:
/usr/home/hudson/hudson-slave/workspace/Lucene-Solr-tests-only-trunk/checkout/lucene/build/core/test/4/index4559845630tmp/_0_1.pyl (Too many open files in system)

Stack Trace:
java.io.FileNotFoundException: /usr/home/hudson/hudson-slave/workspace/Lucene-Solr-tests-only-trunk/checkout/lucene/build/core/test/4/index4559845630tmp/_0_1.pyl (Too many open files in system)
	at java.io.RandomAccessFile.open(Native Method)
	at java.io.RandomAccessFile.<init>(RandomAccessFile.java:233)
	at org.apache.lucene.store.FSDirectory$FSIndexOutput.<init>(FSDirectory.java:449)
	at org.apache.lucene.store.FSDirectory.createOutput(FSDirectory.java:288)
	at org.apache.lucene.store.MockDirectoryWrapper.createOutput(MockDirectoryWrapper.java:450)
	at org.apache.lucene.codecs.sep.SepPostingsWriter.<init>(SepPostingsWriter.java:135)
	at org.apache.lucene.codecs.mockrandom.MockRandomPostingsFormat.fieldsConsumer(MockRandomPostingsFormat.java:158)
	at org.apache.lucene.codecs.perfield.PerFieldPostingsFormat$FieldsWriter.addField(PerFieldPostingsFormat.java:126)
	at org.apache.lucene.index.FreqProxTermsWriterPerField.flush(FreqProxTermsWriterPerField.java:322)
	at org.apache.lucene.index.FreqProxTermsWriter.flush(FreqProxTermsWriter.java:92)
	at org.apache.lucene.index.TermsHash.flush(TermsHash.java:117)
	at org.apache.lucene.index.DocInverter.flush(DocInverter.java:53)
	at org.apache.lucene.index.DocFieldProcessor.flush(DocFieldProcessor.java:81)
	at org.apache.lucene.index.DocumentsWriterPerThread.flush(DocumentsWriterPerThread.java:475)
	at org.apache.lucene.index.DocumentsWriter.doFlush(DocumentsWriter.java:422)
	at org.apache.lucene.index.DocumentsWriter.flushAllThreads(DocumentsWriter.java:553)
	at org.apache.lucene.index.IndexWriter.doFlush(IndexWriter.java:2640)
	at org.apache.lucene.index.IndexWriter.flush(IndexWriter.java:2616)
	at org.apache.lucene.index.IndexWriter.closeInternal(IndexWriter.java:851)
	at org.apache.lucene.index.IndexWriter.close(IndexWriter.java:810)
	at org.apache.lucene.index.IndexWriter.close(IndexWriter.java:774)
	at org.apache.lucene.index.TestPayloads.testPayloadFieldBit(TestPayloads.java:112)
	at sun.reflect.NativeMethodAccessorImpl.invoke0(Native Method)
	at sun.reflect.NativeMethodAccessorImpl.invoke(NativeMethodAccessorImpl.java:57)
	at sun.reflect.DelegatingMethodAccessorImpl.invoke(DelegatingMethodAccessorImpl.java:43)
	at java.lang.reflect.Method.invoke(Method.java:616)
	at org.junit.runners.model.FrameworkMethod$1.runReflectiveCall(FrameworkMethod.java:45)
	at org.junit.internal.runners.model.ReflectiveCallable.run(ReflectiveCallable.java:15)
	at org.junit.runners.model.FrameworkMethod.invokeExplosively(FrameworkMethod.java:42)
	at org.junit.internal.runners.statements.InvokeMethod.evaluate(InvokeMethod.java:20)
	at org.junit.internal.runners.statements.RunBefores.evaluate(RunBefores.java:28)
	at org.junit.internal.runners.statements.RunAfters.evaluate(RunAfters.java:30)
	at org.apache.lucene.util.LuceneTestCase$SubclassSetupTeardownRule$1.evaluate(LuceneTestCase.java:754)
	at org.apache.lucene.util.LuceneTestCase$InternalSetupTeardownRule$1.evaluate(LuceneTestCase.java:670)
	at org.apache.lucene.util.SystemPropertiesInvariantRule$1.evaluate(SystemPropertiesInvariantRule.java:69)
	at org.apache.lucene.util.LuceneTestCase$TestResultInterceptorRule$1.evaluate(LuceneTestCase.java:591)
	at org.apache.lucene.util.UncaughtExceptionsRule$1.evaluate(UncaughtExceptionsRule.java:75)
	at org.apache.lucene.util.LuceneTestCase$SaveThreadAndTestNameRule$1.evaluate(LuceneTestCase.java:642)
	at org.junit.rules.RunRules.evaluate(RunRules.java:18)
	at org.junit.runners.ParentRunner.runLeaf(ParentRunner.java:263)
	at org.junit.runners.BlockJUnit4ClassRunner.runChild(BlockJUnit4ClassRunner.java:68)
	at org.apache.lucene.util.LuceneTestCaseRunner.runChild(LuceneTestCaseRunner.java:164)
	at org.apache.lucene.util.LuceneTestCaseRunner.runChild(LuceneTestCaseRunner.java:57)
	at org.junit.runners.ParentRunner$3.run(ParentRunner.java:231)
	at org.junit.runners.ParentRunner$1.schedule(ParentRunner.java:60)
	at org.junit.runners.ParentRunner.runChildren(ParentRunner.java:229)
	at org.junit.runners.ParentRunner.access$000(ParentRunner.java:50)
	at org.junit.runners.ParentRunner$2.evaluate(ParentRunner.java:222)
	at org.junit.internal.runners.statements.RunBefores.evaluate(RunBefores.java:28)
	at org.junit.internal.runners.statements.RunAfters.evaluate(RunAfters.java:30)
	at org.apache.lucene.util.UncaughtExceptionsRule$1.evaluate(UncaughtExceptionsRule.java:75)
	at org.apache.lucene.util.StoreClassNameRule$1.evaluate(StoreClassNameRule.java:38)
	at org.apache.lucene.util.SystemPropertiesInvariantRule$1.evaluate(SystemPropertiesInvariantRule.java:69)
	at org.junit.rules.RunRules.evaluate(RunRules.java:18)
	at org.junit.runners.ParentRunner.run(ParentRunner.java:300)
	at junit.framework.JUnit4TestAdapter.run(JUnit4TestAdapter.java:39)
	at org.apache.tools.ant.taskdefs.optional.junit.JUnitTestRunner.run(JUnitTestRunner.java:420)
	at org.apache.tools.ant.taskdefs.optional.junit.JUnitTestRunner.launch(JUnitTestRunner.java:911)
	at org.apache.tools.ant.taskdefs.optional.junit.JUnitTestRunner.main(JUnitTestRunner.java:743)


REGRESSION:  org.apache.lucene.index.TestSegmentReader.testNorms

Error Message:
/usr/home/hudson/hudson-slave/workspace/Lucene-Solr-tests-only-trunk/checkout/lucene/build/core/test/1/index3457334586tmp/_0.prx (Too many open files in system)

Stack Trace:
java.io.FileNotFoundException: /usr/home/hudson/hudson-slave/workspace/Lucene-Solr-tests-only-trunk/checkout/lucene/build/core/test/1/index3457334586tmp/_0.prx (Too many open files in system)
	at java.io.RandomAccessFile.open(Native Method)
	at java.io.RandomAccessFile.<init>(RandomAccessFile.java:233)
	at org.apache.lucene.store.FSDirectory$FSIndexOutput.<init>(FSDirectory.java:449)
	at org.apache.lucene.store.FSDirectory.createOutput(FSDirectory.java:288)
	at org.apache.lucene.store.NRTCachingDirectory.createOutput(NRTCachingDirectory.java:202)
	at org.apache.lucene.store.MockDirectoryWrapper.createOutput(MockDirectoryWrapper.java:450)
	at org.apache.lucene.codecs.lucene3x.PreFlexRWFieldsWriter.<init>(PreFlexRWFieldsWriter.java:67)
	at org.apache.lucene.codecs.lucene3x.PreFlexRWPostingsFormat.fieldsConsumer(PreFlexRWPostingsFormat.java:42)
	at org.apache.lucene.index.FreqProxTermsWriter.flush(FreqProxTermsWriter.java:60)
	at org.apache.lucene.index.TermsHash.flush(TermsHash.java:117)
	at org.apache.lucene.index.DocInverter.flush(DocInverter.java:53)
	at org.apache.lucene.index.DocFieldProcessor.flush(DocFieldProcessor.java:81)
	at org.apache.lucene.index.DocumentsWriterPerThread.flush(DocumentsWriterPerThread.java:475)
	at org.apache.lucene.index.DocumentsWriter.doFlush(DocumentsWriter.java:422)
	at org.apache.lucene.index.DocumentsWriter.flushAllThreads(DocumentsWriter.java:553)
	at org.apache.lucene.index.IndexWriter.prepareCommit(IndexWriter.java:2416)
	at org.apache.lucene.index.IndexWriter.commitInternal(IndexWriter.java:2548)
	at org.apache.lucene.index.IndexWriter.commit(IndexWriter.java:2530)
	at org.apache.lucene.index.IndexWriter.commit(IndexWriter.java:2514)
	at org.apache.lucene.index.DocHelper.writeDoc(DocHelper.java:284)
	at org.apache.lucene.index.DocHelper.writeDoc(DocHelper.java:266)
	at org.apache.lucene.index.TestSegmentReader.setUp(TestSegmentReader.java:44)
	at sun.reflect.GeneratedMethodAccessor1.invoke(Unknown Source)
	at sun.reflect.DelegatingMethodAccessorImpl.invoke(DelegatingMethodAccessorImpl.java:43)
	at java.lang.reflect.Method.invoke(Method.java:616)
	at org.junit.runners.model.FrameworkMethod$1.runReflectiveCall(FrameworkMethod.java:45)
	at org.junit.internal.runners.model.ReflectiveCallable.run(ReflectiveCallable.java:15)
	at org.junit.runners.model.FrameworkMethod.invokeExplosively(FrameworkMethod.java:42)
	at org.junit.internal.runners.statements.RunBefores.evaluate(RunBefores.java:27)
	at org.junit.internal.runners.statements.RunAfters.evaluate(RunAfters.java:30)
	at org.apache.lucene.util.LuceneTestCase$SubclassSetupTeardownRule$1.evaluate(LuceneTestCase.java:754)
	at org.apache.lucene.util.LuceneTestCase$InternalSetupTeardownRule$1.evaluate(LuceneTestCase.java:670)
	at org.apache.lucene.util.SystemPropertiesInvariantRule$1.evaluate(SystemPropertiesInvariantRule.java:69)
	at org.apache.lucene.util.LuceneTestCase$TestResultInterceptorRule$1.evaluate(LuceneTestCase.java:591)
	at org.apache.lucene.util.UncaughtExceptionsRule$1.evaluate(UncaughtExceptionsRule.java:75)
	at org.apache.lucene.util.LuceneTestCase$SaveThreadAndTestNameRule$1.evaluate(LuceneTestCase.java:642)
	at org.junit.rules.RunRules.evaluate(RunRules.java:18)
	at org.junit.runners.ParentRunner.runLeaf(ParentRunner.java:263)
	at org.junit.runners.BlockJUnit4ClassRunner.runChild(BlockJUnit4ClassRunner.java:68)
	at org.apache.lucene.util.LuceneTestCaseRunner.runChild(LuceneTestCaseRunner.java:164)
	at org.apache.lucene.util.LuceneTestCaseRunner.runChild(LuceneTestCaseRunner.java:57)
	at org.junit.runners.ParentRunner$3.run(ParentRunner.java:231)
	at org.junit.runners.ParentRunner$1.schedule(ParentRunner.java:60)
	at org.junit.runners.ParentRunner.runChildren(ParentRunner.java:229)
	at org.junit.runners.ParentRunner.access$000(ParentRunner.java:50)
	at org.junit.runners.ParentRunner$2.evaluate(ParentRunner.java:222)
	at org.junit.internal.runners.statements.RunBefores.evaluate(RunBefores.java:28)
	at org.junit.internal.runners.statements.RunAfters.evaluate(RunAfters.java:30)
	at org.apache.lucene.util.UncaughtExceptionsRule$1.evaluate(UncaughtExceptionsRule.java:75)
	at org.apache.lucene.util.StoreClassNameRule$1.evaluate(StoreClassNameRule.java:38)
	at org.apache.lucene.util.SystemPropertiesInvariantRule$1.evaluate(SystemPropertiesInvariantRule.java:69)
	at org.junit.rules.RunRules.evaluate(RunRules.java:18)
	at org.junit.runners.ParentRunner.run(ParentRunner.java:300)
	at junit.framework.JUnit4TestAdapter.run(JUnit4TestAdapter.java:39)
	at org.apache.tools.ant.taskdefs.optional.junit.JUnitTestRunner.run(JUnitTestRunner.java:420)
	at org.apache.tools.ant.taskdefs.optional.junit.JUnitTestRunner.launch(JUnitTestRunner.java:911)
	at org.apache.tools.ant.taskdefs.optional.junit.JUnitTestRunner.main(JUnitTestRunner.java:743)


REGRESSION:  org.apache.lucene.index.TestSegmentTermDocs.testIndexDivisor

Error Message:
/usr/home/hudson/hudson-slave/workspace/Lucene-Solr-tests-only-trunk/checkout/lucene/build/core/test/1/index3457334587tmp/_0.frq (Too many open files in system)

Stack Trace:
java.io.FileNotFoundException: /usr/home/hudson/hudson-slave/workspace/Lucene-Solr-tests-only-trunk/checkout/lucene/build/core/test/1/index3457334587tmp/_0.frq (Too many open files in system)
	at java.io.RandomAccessFile.open(Native Method)
	at java.io.RandomAccessFile.<init>(RandomAccessFile.java:233)
	at org.apache.lucene.store.FSDirectory$FSIndexOutput.<init>(FSDirectory.java:449)
	at org.apache.lucene.store.FSDirectory.createOutput(FSDirectory.java:288)
	at org.apache.lucene.store.NRTCachingDirectory.createOutput(NRTCachingDirectory.java:202)
	at org.apache.lucene.store.MockDirectoryWrapper.createOutput(MockDirectoryWrapper.java:450)
	at org.apache.lucene.codecs.lucene3x.PreFlexRWFieldsWriter.<init>(PreFlexRWFieldsWriter.java:54)
	at org.apache.lucene.codecs.lucene3x.PreFlexRWPostingsFormat.fieldsConsumer(PreFlexRWPostingsFormat.java:42)
	at org.apache.lucene.index.FreqProxTermsWriter.flush(FreqProxTermsWriter.java:60)
	at org.apache.lucene.index.TermsHash.flush(TermsHash.java:117)
	at org.apache.lucene.index.DocInverter.flush(DocInverter.java:53)
	at org.apache.lucene.index.DocFieldProcessor.flush(DocFieldProcessor.java:81)
	at org.apache.lucene.index.DocumentsWriterPerThread.flush(DocumentsWriterPerThread.java:475)
	at org.apache.lucene.index.DocumentsWriter.doFlush(DocumentsWriter.java:422)
	at org.apache.lucene.index.DocumentsWriter.flushAllThreads(DocumentsWriter.java:553)
	at org.apache.lucene.index.IndexWriter.prepareCommit(IndexWriter.java:2416)
	at org.apache.lucene.index.IndexWriter.commitInternal(IndexWriter.java:2548)
	at org.apache.lucene.index.IndexWriter.commit(IndexWriter.java:2530)
	at org.apache.lucene.index.IndexWriter.commit(IndexWriter.java:2514)
	at org.apache.lucene.index.DocHelper.writeDoc(DocHelper.java:284)
	at org.apache.lucene.index.DocHelper.writeDoc(DocHelper.java:266)
	at org.apache.lucene.index.TestSegmentTermDocs.setUp(TestSegmentTermDocs.java:41)
	at sun.reflect.GeneratedMethodAccessor1.invoke(Unknown Source)
	at sun.reflect.DelegatingMethodAccessorImpl.invoke(DelegatingMethodAccessorImpl.java:43)
	at java.lang.reflect.Method.invoke(Method.java:616)
	at org.junit.runners.model.FrameworkMethod$1.runReflectiveCall(FrameworkMethod.java:45)
	at org.junit.internal.runners.model.ReflectiveCallable.run(ReflectiveCallable.java:15)
	at org.junit.runners.model.FrameworkMethod.invokeExplosively(FrameworkMethod.java:42)
	at org.junit.internal.runners.statements.RunBefores.evaluate(RunBefores.java:27)
	at org.junit.internal.runners.statements.RunAfters.evaluate(RunAfters.java:30)
	at org.apache.lucene.util.LuceneTestCase$SubclassSetupTeardownRule$1.evaluate(LuceneTestCase.java:754)
	at org.apache.lucene.util.LuceneTestCase$InternalSetupTeardownRule$1.evaluate(LuceneTestCase.java:670)
	at org.apache.lucene.util.SystemPropertiesInvariantRule$1.evaluate(SystemPropertiesInvariantRule.java:69)
	at org.apache.lucene.util.LuceneTestCase$TestResultInterceptorRule$1.evaluate(LuceneTestCase.java:591)
	at org.apache.lucene.util.UncaughtExceptionsRule$1.evaluate(UncaughtExceptionsRule.java:75)
	at org.apache.lucene.util.LuceneTestCase$SaveThreadAndTestNameRule$1.evaluate(LuceneTestCase.java:642)
	at org.junit.rules.RunRules.evaluate(RunRules.java:18)
	at org.junit.runners.ParentRunner.runLeaf(ParentRunner.java:263)
	at org.junit.runners.BlockJUnit4ClassRunner.runChild(BlockJUnit4ClassRunner.java:68)
	at org.apache.lucene.util.LuceneTestCaseRunner.runChild(LuceneTestCaseRunner.java:164)
	at org.apache.lucene.util.LuceneTestCaseRunner.runChild(LuceneTestCaseRunner.java:57)
	at org.junit.runners.ParentRunner$3.run(ParentRunner.java:231)
	at org.junit.runners.ParentRunner$1.schedule(ParentRunner.java:60)
	at org.junit.runners.ParentRunner.runChildren(ParentRunner.java:229)
	at org.junit.runners.ParentRunner.access$000(ParentRunner.java:50)
	at org.junit.runners.ParentRunner$2.evaluate(ParentRunner.java:222)
	at org.junit.internal.runners.statements.RunBefores.evaluate(RunBefores.java:28)
	at org.junit.internal.runners.statements.RunAfters.evaluate(RunAfters.java:30)
	at org.apache.lucene.util.UncaughtExceptionsRule$1.evaluate(UncaughtExceptionsRule.java:75)
	at org.apache.lucene.util.StoreClassNameRule$1.evaluate(StoreClassNameRule.java:38)
	at org.apache.lucene.util.SystemPropertiesInvariantRule$1.evaluate(SystemPropertiesInvariantRule.java:69)
	at org.junit.rules.RunRules.evaluate(RunRules.java:18)
	at org.junit.runners.ParentRunner.run(ParentRunner.java:300)
	at junit.framework.JUnit4TestAdapter.run(JUnit4TestAdapter.java:39)
	at org.apache.tools.ant.taskdefs.optional.junit.JUnitTestRunner.run(JUnitTestRunner.java:420)
	at org.apache.tools.ant.taskdefs.optional.junit.JUnitTestRunner.launch(JUnitTestRunner.java:911)
	at org.apache.tools.ant.taskdefs.optional.junit.JUnitTestRunner.main(JUnitTestRunner.java:743)


REGRESSION:  org.apache.lucene.index.TestSegmentTermEnum.testTermEnum

Error Message:
/usr/home/hudson/hudson-slave/workspace/Lucene-Solr-tests-only-trunk/checkout/lucene/build/core/test/2/index5714457176tmp/_0_0.pos (Too many open files in system)

Stack Trace:
java.io.FileNotFoundException: /usr/home/hudson/hudson-slave/workspace/Lucene-Solr-tests-only-trunk/checkout/lucene/build/core/test/2/index5714457176tmp/_0_0.pos (Too many open files in system)
	at java.io.RandomAccessFile.open(Native Method)
	at java.io.RandomAccessFile.<init>(RandomAccessFile.java:233)
	at org.apache.lucene.store.FSDirectory$FSIndexOutput.<init>(FSDirectory.java:449)
	at org.apache.lucene.store.FSDirectory.createOutput(FSDirectory.java:288)
	at org.apache.lucene.store.MockDirectoryWrapper.createOutput(MockDirectoryWrapper.java:450)
	at org.apache.lucene.codecs.mocksep.MockSingleIntIndexOutput.<init>(MockSingleIntIndexOutput.java:41)
	at org.apache.lucene.codecs.mocksep.MockSingleIntFactory.createOutput(MockSingleIntFactory.java:36)
	at org.apache.lucene.codecs.sep.SepPostingsWriter.<init>(SepPostingsWriter.java:130)
	at org.apache.lucene.codecs.sep.SepPostingsWriter.<init>(SepPostingsWriter.java:105)
	at org.apache.lucene.codecs.mocksep.MockSepPostingsFormat.fieldsConsumer(MockSepPostingsFormat.java:57)
	at org.apache.lucene.codecs.perfield.PerFieldPostingsFormat$FieldsWriter.addField(PerFieldPostingsFormat.java:126)
	at org.apache.lucene.index.FreqProxTermsWriterPerField.flush(FreqProxTermsWriterPerField.java:322)
	at org.apache.lucene.index.FreqProxTermsWriter.flush(FreqProxTermsWriter.java:92)
	at org.apache.lucene.index.TermsHash.flush(TermsHash.java:117)
	at org.apache.lucene.index.DocInverter.flush(DocInverter.java:53)
	at org.apache.lucene.index.DocFieldProcessor.flush(DocFieldProcessor.java:81)
	at org.apache.lucene.index.DocumentsWriterPerThread.flush(DocumentsWriterPerThread.java:475)
	at org.apache.lucene.index.DocumentsWriter.doFlush(DocumentsWriter.java:422)
	at org.apache.lucene.index.DocumentsWriter.flushAllThreads(DocumentsWriter.java:553)
	at org.apache.lucene.index.IndexWriter.doFlush(IndexWriter.java:2640)
	at org.apache.lucene.index.IndexWriter.flush(IndexWriter.java:2616)
	at org.apache.lucene.index.IndexWriter.closeInternal(IndexWriter.java:851)
	at org.apache.lucene.index.IndexWriter.close(IndexWriter.java:810)
	at org.apache.lucene.index.IndexWriter.close(IndexWriter.java:774)
	at org.apache.lucene.index.TestSegmentTermEnum.testTermEnum(TestSegmentTermEnum.java:62)
	at sun.reflect.NativeMethodAccessorImpl.invoke0(Native Method)
	at sun.reflect.NativeMethodAccessorImpl.invoke(NativeMethodAccessorImpl.java:57)
	at sun.reflect.DelegatingMethodAccessorImpl.invoke(DelegatingMethodAccessorImpl.java:43)
	at java.lang.reflect.Method.invoke(Method.java:616)
	at org.junit.runners.model.FrameworkMethod$1.runReflectiveCall(FrameworkMethod.java:45)
	at org.junit.internal.runners.model.ReflectiveCallable.run(ReflectiveCallable.java:15)
	at org.junit.runners.model.FrameworkMethod.invokeExplosively(FrameworkMethod.java:42)
	at org.junit.internal.runners.statements.InvokeMethod.evaluate(InvokeMethod.java:20)
	at org.junit.internal.runners.statements.RunBefores.evaluate(RunBefores.java:28)
	at org.junit.internal.runners.statements.RunAfters.evaluate(RunAfters.java:30)
	at org.apache.lucene.util.LuceneTestCase$SubclassSetupTeardownRule$1.evaluate(LuceneTestCase.java:754)
	at org.apache.lucene.util.LuceneTestCase$InternalSetupTeardownRule$1.evaluate(LuceneTestCase.java:670)
	at org.apache.lucene.util.SystemPropertiesInvariantRule$1.evaluate(SystemPropertiesInvariantRule.java:69)
	at org.apache.lucene.util.LuceneTestCase$TestResultInterceptorRule$1.evaluate(LuceneTestCase.java:591)
	at org.apache.lucene.util.UncaughtExceptionsRule$1.evaluate(UncaughtExceptionsRule.java:75)
	at org.apache.lucene.util.LuceneTestCase$SaveThreadAndTestNameRule$1.evaluate(LuceneTestCase.java:642)
	at org.junit.rules.RunRules.evaluate(RunRules.java:18)
	at org.junit.runners.ParentRunner.runLeaf(ParentRunner.java:263)
	at org.junit.runners.BlockJUnit4ClassRunner.runChild(BlockJUnit4ClassRunner.java:68)
	at org.apache.lucene.util.LuceneTestCaseRunner.runChild(LuceneTestCaseRunner.java:164)
	at org.apache.lucene.util.LuceneTestCaseRunner.runChild(LuceneTestCaseRunner.java:57)
	at org.junit.runners.ParentRunner$3.run(ParentRunner.java:231)
	at org.junit.runners.ParentRunner$1.schedule(ParentRunner.java:60)
	at org.junit.runners.ParentRunner.runChildren(ParentRunner.java:229)
	at org.junit.runners.ParentRunner.access$000(ParentRunner.java:50)
	at org.junit.runners.ParentRunner$2.evaluate(ParentRunner.java:222)
	at org.junit.internal.runners.statements.RunBefores.evaluate(RunBefores.java:28)
	at org.junit.internal.runners.statements.RunAfters.evaluate(RunAfters.java:30)
	at org.apache.lucene.util.UncaughtExceptionsRule$1.evaluate(UncaughtExceptionsRule.java:75)
	at org.apache.lucene.util.StoreClassNameRule$1.evaluate(StoreClassNameRule.java:38)
	at org.apache.lucene.util.SystemPropertiesInvariantRule$1.evaluate(SystemPropertiesInvariantRule.java:69)
	at org.junit.rules.RunRules.evaluate(RunRules.java:18)
	at org.junit.runners.ParentRunner.run(ParentRunner.java:300)
	at junit.framework.JUnit4TestAdapter.run(JUnit4TestAdapter.java:39)
	at org.apache.tools.ant.taskdefs.optional.junit.JUnitTestRunner.run(JUnitTestRunner.java:420)
	at org.apache.tools.ant.taskdefs.optional.junit.JUnitTestRunner.launch(JUnitTestRunner.java:911)
	at org.apache.tools.ant.taskdefs.optional.junit.JUnitTestRunner.main(JUnitTestRunner.java:743)


REGRESSION:  org.apache.lucene.index.TestSnapshotDeletionPolicy.testExistingSnapshots

Error Message:
/usr/home/hudson/hudson-slave/workspace/Lucene-Solr-tests-only-trunk/checkout/lucene/build/core/test/2/index5714457178tmp/_0.tip (Too many open files in system)

Stack Trace:
java.io.FileNotFoundException: /usr/home/hudson/hudson-slave/workspace/Lucene-Solr-tests-only-trunk/checkout/lucene/build/core/test/2/index5714457178tmp/_0.tip (Too many open files in system)
	at java.io.RandomAccessFile.open(Native Method)
	at java.io.RandomAccessFile.<init>(RandomAccessFile.java:233)
	at org.apache.lucene.store.SimpleFSDirectory$SimpleFSIndexInput$Descriptor.<init>(SimpleFSDirectory.java:98)
	at org.apache.lucene.store.SimpleFSDirectory$SimpleFSIndexInput.<init>(SimpleFSDirectory.java:121)
	at org.apache.lucene.store.SimpleFSDirectory.openInput(SimpleFSDirectory.java:60)
	at org.apache.lucene.store.MockDirectoryWrapper.openInput(MockDirectoryWrapper.java:503)
	at org.apache.lucene.codecs.BlockTreeTermsReader.<init>(BlockTreeTermsReader.java:124)
	at org.apache.lucene.codecs.appending.AppendingTermsReader.<init>(AppendingTermsReader.java:38)
	at org.apache.lucene.codecs.appending.AppendingPostingsFormat.fieldsProducer(AppendingPostingsFormat.java:67)
	at org.apache.lucene.index.SegmentCoreReaders.<init>(SegmentCoreReaders.java:108)
	at org.apache.lucene.index.SegmentReader.<init>(SegmentReader.java:55)
	at org.apache.lucene.index.StandardDirectoryReader$1.doBody(StandardDirectoryReader.java:62)
	at org.apache.lucene.index.SegmentInfos$FindSegmentsFile.run(SegmentInfos.java:484)
	at org.apache.lucene.index.StandardDirectoryReader.open(StandardDirectoryReader.java:52)
	at org.apache.lucene.index.DirectoryReader.open(DirectoryReader.java:117)
	at org.apache.lucene.index.IndexReader.open(IndexReader.java:349)
	at org.apache.lucene.index.TestSnapshotDeletionPolicy.checkMaxDoc(TestSnapshotDeletionPolicy.java:57)
	at org.apache.lucene.index.TestSnapshotDeletionPolicy.assertSnapshotExists(TestSnapshotDeletionPolicy.java:87)
	at org.apache.lucene.index.TestSnapshotDeletionPolicy.testExistingSnapshots(TestSnapshotDeletionPolicy.java:381)
	at sun.reflect.NativeMethodAccessorImpl.invoke0(Native Method)
	at sun.reflect.NativeMethodAccessorImpl.invoke(NativeMethodAccessorImpl.java:57)
	at sun.reflect.DelegatingMethodAccessorImpl.invoke(DelegatingMethodAccessorImpl.java:43)
	at java.lang.reflect.Method.invoke(Method.java:616)
	at org.junit.runners.model.FrameworkMethod$1.runReflectiveCall(FrameworkMethod.java:45)
	at org.junit.internal.runners.model.ReflectiveCallable.run(ReflectiveCallable.java:15)
	at org.junit.runners.model.FrameworkMethod.invokeExplosively(FrameworkMethod.java:42)
	at org.junit.internal.runners.statements.InvokeMethod.evaluate(InvokeMethod.java:20)
	at org.junit.internal.runners.statements.RunBefores.evaluate(RunBefores.java:28)
	at org.junit.internal.runners.statements.RunAfters.evaluate(RunAfters.java:30)
	at org.apache.lucene.util.LuceneTestCase$SubclassSetupTeardownRule$1.evaluate(LuceneTestCase.java:754)
	at org.apache.lucene.util.LuceneTestCase$InternalSetupTeardownRule$1.evaluate(LuceneTestCase.java:670)
	at org.apache.lucene.util.SystemPropertiesInvariantRule$1.evaluate(SystemPropertiesInvariantRule.java:69)
	at org.apache.lucene.util.LuceneTestCase$TestResultInterceptorRule$1.evaluate(LuceneTestCase.java:591)
	at org.apache.lucene.util.UncaughtExceptionsRule$1.evaluate(UncaughtExceptionsRule.java:75)
	at org.apache.lucene.util.LuceneTestCase$SaveThreadAndTestNameRule$1.evaluate(LuceneTestCase.java:642)
	at org.junit.rules.RunRules.evaluate(RunRules.java:18)
	at org.junit.runners.ParentRunner.runLeaf(ParentRunner.java:263)
	at org.junit.runners.BlockJUnit4ClassRunner.runChild(BlockJUnit4ClassRunner.java:68)
	at org.apache.lucene.util.LuceneTestCaseRunner.runChild(LuceneTestCaseRunner.java:164)
	at org.apache.lucene.util.LuceneTestCaseRunner.runChild(LuceneTestCaseRunner.java:57)
	at org.junit.runners.ParentRunner$3.run(ParentRunner.java:231)
	at org.junit.runners.ParentRunner$1.schedule(ParentRunner.java:60)
	at org.junit.runners.ParentRunner.runChildren(ParentRunner.java:229)
	at org.junit.runners.ParentRunner.access$000(ParentRunner.java:50)
	at org.junit.runners.ParentRunner$2.evaluate(ParentRunner.java:222)
	at org.junit.internal.runners.statements.RunBefores.evaluate(RunBefores.java:28)
	at org.junit.internal.runners.statements.RunAfters.evaluate(RunAfters.java:30)
	at org.apache.lucene.util.UncaughtExceptionsRule$1.evaluate(UncaughtExceptionsRule.java:75)
	at org.apache.lucene.util.StoreClassNameRule$1.evaluate(StoreClassNameRule.java:38)
	at org.apache.lucene.util.SystemPropertiesInvariantRule$1.evaluate(SystemPropertiesInvariantRule.java:69)
	at org.junit.rules.RunRules.evaluate(RunRules.java:18)
	at org.junit.runners.ParentRunner.run(ParentRunner.java:300)
	at junit.framework.JUnit4TestAdapter.run(JUnit4TestAdapter.java:39)
	at org.apache.tools.ant.taskdefs.optional.junit.JUnitTestRunner.run(JUnitTestRunner.java:420)
	at org.apache.tools.ant.taskdefs.optional.junit.JUnitTestRunner.launch(JUnitTestRunner.java:911)
	at org.apache.tools.ant.taskdefs.optional.junit.JUnitTestRunner.main(JUnitTestRunner.java:743)


REGRESSION:  org.apache.lucene.index.TestTypePromotion.testMergeIncompatibleTypes

Error Message:
/usr/home/hudson/hudson-slave/workspace/Lucene-Solr-tests-only-trunk/checkout/lucene/build/core/test/2/index5714457179tmp/_20.fdx (Too many open files in system)

Stack Trace:
java.io.FileNotFoundException: /usr/home/hudson/hudson-slave/workspace/Lucene-Solr-tests-only-trunk/checkout/lucene/build/core/test/2/index5714457179tmp/_20.fdx (Too many open files in system)
	at java.io.RandomAccessFile.open(Native Method)
	at java.io.RandomAccessFile.<init>(RandomAccessFile.java:233)
	at org.apache.lucene.store.FSDirectory$FSIndexOutput.<init>(FSDirectory.java:449)
	at org.apache.lucene.store.FSDirectory.createOutput(FSDirectory.java:288)
	at org.apache.lucene.store.MockDirectoryWrapper.createOutput(MockDirectoryWrapper.java:450)
	at org.apache.lucene.codecs.lucene40.Lucene40StoredFieldsWriter.<init>(Lucene40StoredFieldsWriter.java:88)
	at org.apache.lucene.codecs.lucene40.Lucene40StoredFieldsFormat.fieldsWriter(Lucene40StoredFieldsFormat.java:43)
	at org.apache.lucene.index.StoredFieldsConsumer.initFieldsWriter(StoredFieldsConsumer.java:83)
	at org.apache.lucene.index.StoredFieldsConsumer.finishDocument(StoredFieldsConsumer.java:113)
	at org.apache.lucene.index.DocFieldProcessor.finishDocument(DocFieldProcessor.java:305)
	at org.apache.lucene.index.DocumentsWriterPerThread.updateDocument(DocumentsWriterPerThread.java:259)
	at org.apache.lucene.index.DocumentsWriter.updateDocument(DocumentsWriter.java:376)
	at org.apache.lucene.index.IndexWriter.updateDocument(IndexWriter.java:1276)
	at org.apache.lucene.index.IndexWriter.addDocument(IndexWriter.java:1034)
	at org.apache.lucene.index.IndexWriter.addDocument(IndexWriter.java:1015)
	at org.apache.lucene.index.TestTypePromotion.index(TestTypePromotion.java:277)
	at org.apache.lucene.index.TestTypePromotion.testMergeIncompatibleTypes(TestTypePromotion.java:309)
	at sun.reflect.NativeMethodAccessorImpl.invoke0(Native Method)
	at sun.reflect.NativeMethodAccessorImpl.invoke(NativeMethodAccessorImpl.java:57)
	at sun.reflect.DelegatingMethodAccessorImpl.invoke(DelegatingMethodAccessorImpl.java:43)
	at java.lang.reflect.Method.invoke(Method.java:616)
	at org.junit.runners.model.FrameworkMethod$1.runReflectiveCall(FrameworkMethod.java:45)
	at org.junit.internal.runners.model.ReflectiveCallable.run(ReflectiveCallable.java:15)
	at org.junit.runners.model.FrameworkMethod.invokeExplosively(FrameworkMethod.java:42)
	at org.junit.internal.runners.statements.InvokeMethod.evaluate(InvokeMethod.java:20)
	at org.junit.internal.runners.statements.RunBefores.evaluate(RunBefores.java:28)
	at org.junit.internal.runners.statements.RunAfters.evaluate(RunAfters.java:30)
	at org.apache.lucene.util.LuceneTestCase$SubclassSetupTeardownRule$1.evaluate(LuceneTestCase.java:754)
	at org.apache.lucene.util.LuceneTestCase$InternalSetupTeardownRule$1.evaluate(LuceneTestCase.java:670)
	at org.apache.lucene.util.SystemPropertiesInvariantRule$1.evaluate(SystemPropertiesInvariantRule.java:69)
	at org.apache.lucene.util.LuceneTestCase$TestResultInterceptorRule$1.evaluate(LuceneTestCase.java:591)
	at org.apache.lucene.util.UncaughtExceptionsRule$1.evaluate(UncaughtExceptionsRule.java:75)
	at org.apache.lucene.util.LuceneTestCase$SaveThreadAndTestNameRule$1.evaluate(LuceneTestCase.java:642)
	at org.junit.rules.RunRules.evaluate(RunRules.java:18)
	at org.junit.runners.ParentRunner.runLeaf(ParentRunner.java:263)
	at org.junit.runners.BlockJUnit4ClassRunner.runChild(BlockJUnit4ClassRunner.java:68)
	at org.apache.lucene.util.LuceneTestCaseRunner.runChild(LuceneTestCaseRunner.java:164)
	at org.apache.lucene.util.LuceneTestCaseRunner.runChild(LuceneTestCaseRunner.java:57)
	at org.junit.runners.ParentRunner$3.run(ParentRunner.java:231)
	at org.junit.runners.ParentRunner$1.schedule(ParentRunner.java:60)
	at org.junit.runners.ParentRunner.runChildren(ParentRunner.java:229)
	at org.junit.runners.ParentRunner.access$000(ParentRunner.java:50)
	at org.junit.runners.ParentRunner$2.evaluate(ParentRunner.java:222)
	at org.junit.internal.runners.statements.RunBefores.evaluate(RunBefores.java:28)
	at org.junit.internal.runners.statements.RunAfters.evaluate(RunAfters.java:30)
	at org.apache.lucene.util.UncaughtExceptionsRule$1.evaluate(UncaughtExceptionsRule.java:75)
	at org.apache.lucene.util.StoreClassNameRule$1.evaluate(StoreClassNameRule.java:38)
	at org.apache.lucene.util.SystemPropertiesInvariantRule$1.evaluate(SystemPropertiesInvariantRule.java:69)
	at org.junit.rules.RunRules.evaluate(RunRules.java:18)
	at org.junit.runners.ParentRunner.run(ParentRunner.java:300)
	at junit.framework.JUnit4TestAdapter.run(JUnit4TestAdapter.java:39)
	at org.apache.tools.ant.taskdefs.optional.junit.JUnitTestRunner.run(JUnitTestRunner.java:420)
	at org.apache.tools.ant.taskdefs.optional.junit.JUnitTestRunner.launch(JUnitTestRunner.java:911)
	at org.apache.tools.ant.taskdefs.optional.junit.JUnitTestRunner.main(JUnitTestRunner.java:743)


REGRESSION:  org.apache.lucene.index.TestTypePromotion.testPromotFloatingPoint

Error Message:
/usr/home/hudson/hudson-slave/workspace/Lucene-Solr-tests-only-trunk/checkout/lucene/build/core/test/2/index5714457180tmp/_0.fdx (Too many open files in system)

Stack Trace:
java.io.FileNotFoundException: /usr/home/hudson/hudson-slave/workspace/Lucene-Solr-tests-only-trunk/checkout/lucene/build/core/test/2/index5714457180tmp/_0.fdx (Too many open files in system)
	at java.io.RandomAccessFile.open(Native Method)
	at java.io.RandomAccessFile.<init>(RandomAccessFile.java:233)
	at org.apache.lucene.store.FSDirectory$FSIndexOutput.<init>(FSDirectory.java:449)
	at org.apache.lucene.store.FSDirectory.createOutput(FSDirectory.java:288)
	at org.apache.lucene.store.MockDirectoryWrapper.createOutput(MockDirectoryWrapper.java:450)
	at org.apache.lucene.codecs.lucene40.Lucene40StoredFieldsWriter.<init>(Lucene40StoredFieldsWriter.java:88)
	at org.apache.lucene.codecs.lucene40.Lucene40StoredFieldsFormat.fieldsWriter(Lucene40StoredFieldsFormat.java:43)
	at org.apache.lucene.index.StoredFieldsConsumer.initFieldsWriter(StoredFieldsConsumer.java:83)
	at org.apache.lucene.index.StoredFieldsConsumer.finishDocument(StoredFieldsConsumer.java:113)
	at org.apache.lucene.index.DocFieldProcessor.finishDocument(DocFieldProcessor.java:305)
	at org.apache.lucene.index.DocumentsWriterPerThread.updateDocument(DocumentsWriterPerThread.java:259)
	at org.apache.lucene.index.DocumentsWriter.updateDocument(DocumentsWriter.java:376)
	at org.apache.lucene.index.IndexWriter.updateDocument(IndexWriter.java:1276)
	at org.apache.lucene.index.IndexWriter.addDocument(IndexWriter.java:1034)
	at org.apache.lucene.index.IndexWriter.addDocument(IndexWriter.java:1015)
	at org.apache.lucene.index.TestTypePromotion.index(TestTypePromotion.java:277)
	at org.apache.lucene.index.TestTypePromotion.runTest(TestTypePromotion.java:77)
	at org.apache.lucene.index.TestTypePromotion.testPromotFloatingPoint(TestTypePromotion.java:298)
	at sun.reflect.NativeMethodAccessorImpl.invoke0(Native Method)
	at sun.reflect.NativeMethodAccessorImpl.invoke(NativeMethodAccessorImpl.java:57)
	at sun.reflect.DelegatingMethodAccessorImpl.invoke(DelegatingMethodAccessorImpl.java:43)
	at java.lang.reflect.Method.invoke(Method.java:616)
	at org.junit.runners.model.FrameworkMethod$1.runReflectiveCall(FrameworkMethod.java:45)
	at org.junit.internal.runners.model.ReflectiveCallable.run(ReflectiveCallable.java:15)
	at org.junit.runners.model.FrameworkMethod.invokeExplosively(FrameworkMethod.java:42)
	at org.junit.internal.runners.statements.InvokeMethod.evaluate(InvokeMethod.java:20)
	at org.junit.internal.runners.statements.RunBefores.evaluate(RunBefores.java:28)
	at org.junit.internal.runners.statements.RunAfters.evaluate(RunAfters.java:30)
	at org.apache.lucene.util.LuceneTestCase$SubclassSetupTeardownRule$1.evaluate(LuceneTestCase.java:754)
	at org.apache.lucene.util.LuceneTestCase$InternalSetupTeardownRule$1.evaluate(LuceneTestCase.java:670)
	at org.apache.lucene.util.SystemPropertiesInvariantRule$1.evaluate(SystemPropertiesInvariantRule.java:69)
	at org.apache.lucene.util.LuceneTestCase$TestResultInterceptorRule$1.evaluate(LuceneTestCase.java:591)
	at org.apache.lucene.util.UncaughtExceptionsRule$1.evaluate(UncaughtExceptionsRule.java:75)
	at org.apache.lucene.util.LuceneTestCase$SaveThreadAndTestNameRule$1.evaluate(LuceneTestCase.java:642)
	at org.junit.rules.RunRules.evaluate(RunRules.java:18)
	at org.junit.runners.ParentRunner.runLeaf(ParentRunner.java:263)
	at org.junit.runners.BlockJUnit4ClassRunner.runChild(BlockJUnit4ClassRunner.java:68)
	at org.apache.lucene.util.LuceneTestCaseRunner.runChild(LuceneTestCaseRunner.java:164)
	at org.apache.lucene.util.LuceneTestCaseRunner.runChild(LuceneTestCaseRunner.java:57)
	at org.junit.runners.ParentRunner$3.run(ParentRunner.java:231)
	at org.junit.runners.ParentRunner$1.schedule(ParentRunner.java:60)
	at org.junit.runners.ParentRunner.runChildren(ParentRunner.java:229)
	at org.junit.runners.ParentRunner.access$000(ParentRunner.java:50)
	at org.junit.runners.ParentRunner$2.evaluate(ParentRunner.java:222)
	at org.junit.internal.runners.statements.RunBefores.evaluate(RunBefores.java:28)
	at org.junit.internal.runners.statements.RunAfters.evaluate(RunAfters.java:30)
	at org.apache.lucene.util.UncaughtExceptionsRule$1.evaluate(UncaughtExceptionsRule.java:75)
	at org.apache.lucene.util.StoreClassNameRule$1.evaluate(StoreClassNameRule.java:38)
	at org.apache.lucene.util.SystemPropertiesInvariantRule$1.evaluate(SystemPropertiesInvariantRule.java:69)
	at org.junit.rules.RunRules.evaluate(RunRules.java:18)
	at org.junit.runners.ParentRunner.run(ParentRunner.java:300)
	at junit.framework.JUnit4TestAdapter.run(JUnit4TestAdapter.java:39)
	at org.apache.tools.ant.taskdefs.optional.junit.JUnitTestRunner.run(JUnitTestRunner.java:420)
	at org.apache.tools.ant.taskdefs.optional.junit.JUnitTestRunner.launch(JUnitTestRunner.java:911)
	at org.apache.tools.ant.taskdefs.optional.junit.JUnitTestRunner.main(JUnitTestRunner.java:743)


REGRESSION:  org.apache.lucene.search.TestMultiPhraseQuery.testPhrasePrefixWithBooleanQuery

Error Message:
/usr/home/hudson/hudson-slave/workspace/Lucene-Solr-tests-only-trunk/checkout/lucene/build/core/test/4/index4559845632tmp/_0_1.doc (Too many open files in system)

Stack Trace:
java.io.FileNotFoundException: /usr/home/hudson/hudson-slave/workspace/Lucene-Solr-tests-only-trunk/checkout/lucene/build/core/test/4/index4559845632tmp/_0_1.doc (Too many open files in system)
	at java.io.RandomAccessFile.open(Native Method)
	at java.io.RandomAccessFile.<init>(RandomAccessFile.java:233)
	at org.apache.lucene.store.FSDirectory$FSIndexOutput.<init>(FSDirectory.java:449)
	at org.apache.lucene.store.FSDirectory.createOutput(FSDirectory.java:288)
	at org.apache.lucene.store.MockDirectoryWrapper.createOutput(MockDirectoryWrapper.java:450)
	at org.apache.lucene.codecs.mocksep.MockSingleIntIndexOutput.<init>(MockSingleIntIndexOutput.java:41)
	at org.apache.lucene.codecs.mocksep.MockSingleIntFactory.createOutput(MockSingleIntFactory.java:36)
	at org.apache.lucene.codecs.sep.SepPostingsWriter.<init>(SepPostingsWriter.java:119)
	at org.apache.lucene.codecs.sep.SepPostingsWriter.<init>(SepPostingsWriter.java:105)
	at org.apache.lucene.codecs.mocksep.MockSepPostingsFormat.fieldsConsumer(MockSepPostingsFormat.java:57)
	at org.apache.lucene.codecs.perfield.PerFieldPostingsFormat$FieldsWriter.addField(PerFieldPostingsFormat.java:126)
	at org.apache.lucene.index.FreqProxTermsWriterPerField.flush(FreqProxTermsWriterPerField.java:322)
	at org.apache.lucene.index.FreqProxTermsWriter.flush(FreqProxTermsWriter.java:92)
	at org.apache.lucene.index.TermsHash.flush(TermsHash.java:117)
	at org.apache.lucene.index.DocInverter.flush(DocInverter.java:53)
	at org.apache.lucene.index.DocFieldProcessor.flush(DocFieldProcessor.java:81)
	at org.apache.lucene.index.DocumentsWriterPerThread.flush(DocumentsWriterPerThread.java:475)
	at org.apache.lucene.index.DocumentsWriter.doFlush(DocumentsWriter.java:422)
	at org.apache.lucene.index.DocumentsWriter.flushAllThreads(DocumentsWriter.java:553)
	at org.apache.lucene.index.IndexWriter.getReader(IndexWriter.java:353)
	at org.apache.lucene.index.RandomIndexWriter.getReader(RandomIndexWriter.java:395)
	at org.apache.lucene.index.RandomIndexWriter.getReader(RandomIndexWriter.java:342)
	at org.apache.lucene.search.TestMultiPhraseQuery.testPhrasePrefixWithBooleanQuery(TestMultiPhraseQuery.java:245)
	at sun.reflect.NativeMethodAccessorImpl.invoke0(Native Method)
	at sun.reflect.NativeMethodAccessorImpl.invoke(NativeMethodAccessorImpl.java:57)
	at sun.reflect.DelegatingMethodAccessorImpl.invoke(DelegatingMethodAccessorImpl.java:43)
	at java.lang.reflect.Method.invoke(Method.java:616)
	at org.junit.runners.model.FrameworkMethod$1.runReflectiveCall(FrameworkMethod.java:45)
	at org.junit.internal.runners.model.ReflectiveCallable.run(ReflectiveCallable.java:15)
	at org.junit.runners.model.FrameworkMethod.invokeExplosively(FrameworkMethod.java:42)
	at org.junit.internal.runners.statements.InvokeMethod.evaluate(InvokeMethod.java:20)
	at org.junit.internal.runners.statements.RunBefores.evaluate(RunBefores.java:28)
	at org.junit.internal.runners.statements.RunAfters.evaluate(RunAfters.java:30)
	at org.apache.lucene.util.LuceneTestCase$SubclassSetupTeardownRule$1.evaluate(LuceneTestCase.java:754)
	at org.apache.lucene.util.LuceneTestCase$InternalSetupTeardownRule$1.evaluate(LuceneTestCase.java:670)
	at org.apache.lucene.util.SystemPropertiesInvariantRule$1.evaluate(SystemPropertiesInvariantRule.java:69)
	at org.apache.lucene.util.LuceneTestCase$TestResultInterceptorRule$1.evaluate(LuceneTestCase.java:591)
	at org.apache.lucene.util.UncaughtExceptionsRule$1.evaluate(UncaughtExceptionsRule.java:75)
	at org.apache.lucene.util.LuceneTestCase$SaveThreadAndTestNameRule$1.evaluate(LuceneTestCase.java:642)
	at org.junit.rules.RunRules.evaluate(RunRules.java:18)
	at org.junit.runners.ParentRunner.runLeaf(ParentRunner.java:263)
	at org.junit.runners.BlockJUnit4ClassRunner.runChild(BlockJUnit4ClassRunner.java:68)
	at org.apache.lucene.util.LuceneTestCaseRunner.runChild(LuceneTestCaseRunner.java:164)
	at org.apache.lucene.util.LuceneTestCaseRunner.runChild(LuceneTestCaseRunner.java:57)
	at org.junit.runners.ParentRunner$3.run(ParentRunner.java:231)
	at org.junit.runners.ParentRunner$1.schedule(ParentRunner.java:60)
	at org.junit.runners.ParentRunner.runChildren(ParentRunner.java:229)
	at org.junit.runners.ParentRunner.access$000(ParentRunner.java:50)
	at org.junit.runners.ParentRunner$2.evaluate(ParentRunner.java:222)
	at org.junit.internal.runners.statements.RunBefores.evaluate(RunBefores.java:28)
	at org.junit.internal.runners.statements.RunAfters.evaluate(RunAfters.java:30)
	at org.apache.lucene.util.UncaughtExceptionsRule$1.evaluate(UncaughtExceptionsRule.java:75)
	at org.apache.lucene.util.StoreClassNameRule$1.evaluate(StoreClassNameRule.java:38)
	at org.apache.lucene.util.SystemPropertiesInvariantRule$1.evaluate(SystemPropertiesInvariantRule.java:69)
	at org.junit.rules.RunRules.evaluate(RunRules.java:18)
	at org.junit.runners.ParentRunner.run(ParentRunner.java:300)
	at junit.framework.JUnit4TestAdapter.run(JUnit4TestAdapter.java:39)
	at org.apache.tools.ant.taskdefs.optional.junit.JUnitTestRunner.run(JUnitTestRunner.java:420)
	at org.apache.tools.ant.taskdefs.optional.junit.JUnitTestRunner.launch(JUnitTestRunner.java:911)
	at org.apache.tools.ant.taskdefs.optional.junit.JUnitTestRunner.main(JUnitTestRunner.java:743)


REGRESSION:  org.apache.lucene.search.TestMultiPhraseQuery.testZeroPosIncrSloppyPqAnd

Error Message:
/usr/home/hudson/hudson-slave/workspace/Lucene-Solr-tests-only-trunk/checkout/lucene/build/core/test/4/index4559845633tmp/_0_0.tib (Too many open files in system)

Stack Trace:
java.io.FileNotFoundException: /usr/home/hudson/hudson-slave/workspace/Lucene-Solr-tests-only-trunk/checkout/lucene/build/core/test/4/index4559845633tmp/_0_0.tib (Too many open files in system)
	at java.io.RandomAccessFile.open(Native Method)
	at java.io.RandomAccessFile.<init>(RandomAccessFile.java:233)
	at org.apache.lucene.store.FSDirectory$FSIndexOutput.<init>(FSDirectory.java:449)
	at org.apache.lucene.store.FSDirectory.createOutput(FSDirectory.java:288)
	at org.apache.lucene.store.MockDirectoryWrapper.createOutput(MockDirectoryWrapper.java:450)
	at org.apache.lucene.codecs.BlockTermsWriter.<init>(BlockTermsWriter.java:76)
	at org.apache.lucene.codecs.lucene40ords.Lucene40WithOrds.fieldsConsumer(Lucene40WithOrds.java:73)
	at org.apache.lucene.codecs.perfield.PerFieldPostingsFormat$FieldsWriter.addField(PerFieldPostingsFormat.java:126)
	at org.apache.lucene.index.FreqProxTermsWriterPerField.flush(FreqProxTermsWriterPerField.java:322)
	at org.apache.lucene.index.FreqProxTermsWriter.flush(FreqProxTermsWriter.java:92)
	at org.apache.lucene.index.TermsHash.flush(TermsHash.java:117)
	at org.apache.lucene.index.DocInverter.flush(DocInverter.java:53)
	at org.apache.lucene.index.DocFieldProcessor.flush(DocFieldProcessor.java:81)
	at org.apache.lucene.index.DocumentsWriterPerThread.flush(DocumentsWriterPerThread.java:475)
	at org.apache.lucene.index.DocumentsWriter.doFlush(DocumentsWriter.java:422)
	at org.apache.lucene.index.DocumentsWriter.flushAllThreads(DocumentsWriter.java:553)
	at org.apache.lucene.index.IndexWriter.getReader(IndexWriter.java:353)
	at org.apache.lucene.index.DirectoryReader.open(DirectoryReader.java:107)
	at org.apache.lucene.index.IndexReader.open(IndexReader.java:337)
	at org.apache.lucene.search.TestMultiPhraseQuery.doTestZeroPosIncrSloppy(TestMultiPhraseQuery.java:473)
	at org.apache.lucene.search.TestMultiPhraseQuery.testZeroPosIncrSloppyPqAnd(TestMultiPhraseQuery.java:505)
	at sun.reflect.NativeMethodAccessorImpl.invoke0(Native Method)
	at sun.reflect.NativeMethodAccessorImpl.invoke(NativeMethodAccessorImpl.java:57)
	at sun.reflect.DelegatingMethodAccessorImpl.invoke(DelegatingMethodAccessorImpl.java:43)
	at java.lang.reflect.Method.invoke(Method.java:616)
	at org.junit.runners.model.FrameworkMethod$1.runReflectiveCall(FrameworkMethod.java:45)
	at org.junit.internal.runners.model.ReflectiveCallable.run(ReflectiveCallable.java:15)
	at org.junit.runners.model.FrameworkMethod.invokeExplosively(FrameworkMethod.java:42)
	at org.junit.internal.runners.statements.InvokeMethod.evaluate(InvokeMethod.java:20)
	at org.junit.internal.runners.statements.RunBefores.evaluate(RunBefores.java:28)
	at org.junit.internal.runners.statements.RunAfters.evaluate(RunAfters.java:30)
	at org.apache.lucene.util.LuceneTestCase$SubclassSetupTeardownRule$1.evaluate(LuceneTestCase.java:754)
	at org.apache.lucene.util.LuceneTestCase$InternalSetupTeardownRule$1.evaluate(LuceneTestCase.java:670)
	at org.apache.lucene.util.SystemPropertiesInvariantRule$1.evaluate(SystemPropertiesInvariantRule.java:69)
	at org.apache.lucene.util.LuceneTestCase$TestResultInterceptorRule$1.evaluate(LuceneTestCase.java:591)
	at org.apache.lucene.util.UncaughtExceptionsRule$1.evaluate(UncaughtExceptionsRule.java:75)
	at org.apache.lucene.util.LuceneTestCase$SaveThreadAndTestNameRule$1.evaluate(LuceneTestCase.java:642)
	at org.junit.rules.RunRules.evaluate(RunRules.java:18)
	at org.junit.runners.ParentRunner.runLeaf(ParentRunner.java:263)
	at org.junit.runners.BlockJUnit4ClassRunner.runChild(BlockJUnit4ClassRunner.java:68)
	at org.apache.lucene.util.LuceneTestCaseRunner.runChild(LuceneTestCaseRunner.java:164)
	at org.apache.lucene.util.LuceneTestCaseRunner.runChild(LuceneTestCaseRunner.java:57)
	at org.junit.runners.ParentRunner$3.run(ParentRunner.java:231)
	at org.junit.runners.ParentRunner$1.schedule(ParentRunner.java:60)
	at org.junit.runners.ParentRunner.runChildren(ParentRunner.java:229)
	at org.junit.runners.ParentRunner.access$000(ParentRunner.java:50)
	at org.junit.runners.ParentRunner$2.evaluate(ParentRunner.java:222)
	at org.junit.internal.runners.statements.RunBefores.evaluate(RunBefores.java:28)
	at org.junit.internal.runners.statements.RunAfters.evaluate(RunAfters.java:30)
	at org.apache.lucene.util.UncaughtExceptionsRule$1.evaluate(UncaughtExceptionsRule.java:75)
	at org.apache.lucene.util.StoreClassNameRule$1.evaluate(StoreClassNameRule.java:38)
	at org.apache.lucene.util.SystemPropertiesInvariantRule$1.evaluate(SystemPropertiesInvariantRule.java:69)
	at org.junit.rules.RunRules.evaluate(RunRules.java:18)
	at org.junit.runners.ParentRunner.run(ParentRunner.java:300)
	at junit.framework.JUnit4TestAdapter.run(JUnit4TestAdapter.java:39)
	at org.apache.tools.ant.taskdefs.optional.junit.JUnitTestRunner.run(JUnitTestRunner.java:420)
	at org.apache.tools.ant.taskdefs.optional.junit.JUnitTestRunner.launch(JUnitTestRunner.java:911)
	at org.apache.tools.ant.taskdefs.optional.junit.JUnitTestRunner.main(JUnitTestRunner.java:743)


FAILED:  junit.framework.TestSuite.org.apache.lucene.search.TestMultiTermConstantScore

Error Message:
/usr/home/hudson/hudson-slave/workspace/Lucene-Solr-tests-only-trunk/checkout/lucene/build/core/test/3/index1734117385tmp/_6_0.sd (Too many open files in system)

Stack Trace:
java.io.FileNotFoundException: /usr/home/hudson/hudson-slave/workspace/Lucene-Solr-tests-only-trunk/checkout/lucene/build/core/test/3/index1734117385tmp/_6_0.sd (Too many open files in system)
	at java.io.RandomAccessFile.open(Native Method)
	at java.io.RandomAccessFile.<init>(RandomAccessFile.java:233)
	at org.apache.lucene.store.FSDirectory$FSIndexOutput.<init>(FSDirectory.java:449)
	at org.apache.lucene.store.FSDirectory.createOutput(FSDirectory.java:288)
	at org.apache.lucene.store.MockDirectoryWrapper.createOutput(MockDirectoryWrapper.java:450)
	at org.apache.lucene.codecs.mockrandom.MockRandomPostingsFormat.fieldsConsumer(MockRandomPostingsFormat.java:145)
	at org.apache.lucene.codecs.perfield.PerFieldPostingsFormat$FieldsWriter.addField(PerFieldPostingsFormat.java:126)
	at org.apache.lucene.index.FreqProxTermsWriterPerField.flush(FreqProxTermsWriterPerField.java:322)
	at org.apache.lucene.index.FreqProxTermsWriter.flush(FreqProxTermsWriter.java:92)
	at org.apache.lucene.index.TermsHash.flush(TermsHash.java:117)
	at org.apache.lucene.index.DocInverter.flush(DocInverter.java:53)
	at org.apache.lucene.index.DocFieldProcessor.flush(DocFieldProcessor.java:81)
	at org.apache.lucene.index.DocumentsWriterPerThread.flush(DocumentsWriterPerThread.java:475)
	at org.apache.lucene.index.DocumentsWriter.doFlush(DocumentsWriter.java:422)
	at org.apache.lucene.index.DocumentsWriter.flushAllThreads(DocumentsWriter.java:553)
	at org.apache.lucene.index.IndexWriter.prepareCommit(IndexWriter.java:2416)
	at org.apache.lucene.index.IndexWriter.commitInternal(IndexWriter.java:2548)
	at org.apache.lucene.index.IndexWriter.commit(IndexWriter.java:2530)
	at org.apache.lucene.index.IndexWriter.commit(IndexWriter.java:2514)
	at org.apache.lucene.index.RandomIndexWriter.getReader(RandomIndexWriter.java:400)
	at org.apache.lucene.index.RandomIndexWriter.getReader(RandomIndexWriter.java:342)
	at org.apache.lucene.search.BaseTestRangeFilter.build(BaseTestRangeFilter.java:164)
	at org.apache.lucene.search.BaseTestRangeFilter.beforeClassBaseTestRangeFilter(BaseTestRangeFilter.java:100)
	at sun.reflect.NativeMethodAccessorImpl.invoke0(Native Method)
	at sun.reflect.NativeMethodAccessorImpl.invoke(NativeMethodAccessorImpl.java:57)
	at sun.reflect.DelegatingMethodAccessorImpl.invoke(DelegatingMethodAccessorImpl.java:43)
	at java.lang.reflect.Method.invoke(Method.java:616)
	at org.junit.runners.model.FrameworkMethod$1.runReflectiveCall(FrameworkMethod.java:45)
	at org.junit.internal.runners.model.ReflectiveCallable.run(ReflectiveCallable.java:15)
	at org.junit.runners.model.FrameworkMethod.invokeExplosively(FrameworkMethod.java:42)
	at org.junit.internal.runners.statements.RunBefores.evaluate(RunBefores.java:27)
	at org.junit.internal.runners.statements.RunAfters.evaluate(RunAfters.java:30)
	at org.apache.lucene.util.UncaughtExceptionsRule$1.evaluate(UncaughtExceptionsRule.java:75)
	at org.apache.lucene.util.StoreClassNameRule$1.evaluate(StoreClassNameRule.java:38)
	at org.apache.lucene.util.SystemPropertiesInvariantRule$1.evaluate(SystemPropertiesInvariantRule.java:69)
	at org.junit.rules.RunRules.evaluate(RunRules.java:18)
	at org.junit.runners.ParentRunner.run(ParentRunner.java:300)
	at junit.framework.JUnit4TestAdapter.run(JUnit4TestAdapter.java:39)
	at org.apache.tools.ant.taskdefs.optional.junit.JUnitTestRunner.run(JUnitTestRunner.java:420)
	at org.apache.tools.ant.taskdefs.optional.junit.JUnitTestRunner.launch(JUnitTestRunner.java:911)
	at org.apache.tools.ant.taskdefs.optional.junit.JUnitTestRunner.main(JUnitTestRunner.java:743)


REGRESSION:  org.apache.lucene.search.TestNRTManager.testEvilSearcherFactory

Error Message:
directory '/usr/home/hudson/hudson-slave/workspace/Lucene-Solr-tests-only-trunk/checkout/lucene/build/core/test/4/index4559845634tmp' exists and is a directory, but cannot be listed: list() returned null

Stack Trace:
java.io.IOException: directory '/usr/home/hudson/hudson-slave/workspace/Lucene-Solr-tests-only-trunk/checkout/lucene/build/core/test/4/index4559845634tmp' exists and is a directory, but cannot be listed: list() returned null
	at org.apache.lucene.store.FSDirectory.listAll(FSDirectory.java:231)
	at org.apache.lucene.store.FSDirectory.listAll(FSDirectory.java:242)
	at org.apache.lucene.store.MockDirectoryWrapper.listAll(MockDirectoryWrapper.java:716)
	at org.apache.lucene.index.IndexFileDeleter.<init>(IndexFileDeleter.java:145)
	at org.apache.lucene.index.IndexWriter.<init>(IndexWriter.java:670)
	at org.apache.lucene.index.RandomIndexWriter$MockIndexWriter.<init>(RandomIndexWriter.java:64)
	at org.apache.lucene.index.RandomIndexWriter.<init>(RandomIndexWriter.java:97)
	at org.apache.lucene.index.RandomIndexWriter.<init>(RandomIndexWriter.java:81)
	at org.apache.lucene.search.TestNRTManager.testEvilSearcherFactory(TestNRTManager.java:394)
	at sun.reflect.NativeMethodAccessorImpl.invoke0(Native Method)
	at sun.reflect.NativeMethodAccessorImpl.invoke(NativeMethodAccessorImpl.java:57)
	at sun.reflect.DelegatingMethodAccessorImpl.invoke(DelegatingMethodAccessorImpl.java:43)
	at java.lang.reflect.Method.invoke(Method.java:616)
	at org.junit.runners.model.FrameworkMethod$1.runReflectiveCall(FrameworkMethod.java:45)
	at org.junit.internal.runners.model.ReflectiveCallable.run(ReflectiveCallable.java:15)
	at org.junit.runners.model.FrameworkMethod.invokeExplosively(FrameworkMethod.java:42)
	at org.junit.internal.runners.statements.InvokeMethod.evaluate(InvokeMethod.java:20)
	at org.junit.internal.runners.statements.RunBefores.evaluate(RunBefores.java:28)
	at org.junit.internal.runners.statements.RunAfters.evaluate(RunAfters.java:30)
	at org.apache.lucene.util.LuceneTestCase$SubclassSetupTeardownRule$1.evaluate(LuceneTestCase.java:754)
	at org.apache.lucene.util.LuceneTestCase$InternalSetupTeardownRule$1.evaluate(LuceneTestCase.java:670)
	at org.apache.lucene.util.SystemPropertiesInvariantRule$1.evaluate(SystemPropertiesInvariantRule.java:69)
	at org.apache.lucene.util.LuceneTestCase$TestResultInterceptorRule$1.evaluate(LuceneTestCase.java:591)
	at org.apache.lucene.util.UncaughtExceptionsRule$1.evaluate(UncaughtExceptionsRule.java:75)
	at org.apache.lucene.util.LuceneTestCase$SaveThreadAndTestNameRule$1.evaluate(LuceneTestCase.java:642)
	at org.junit.rules.RunRules.evaluate(RunRules.java:18)
	at org.junit.runners.ParentRunner.runLeaf(ParentRunner.java:263)
	at org.junit.runners.BlockJUnit4ClassRunner.runChild(BlockJUnit4ClassRunner.java:68)
	at org.apache.lucene.util.LuceneTestCaseRunner.runChild(LuceneTestCaseRunner.java:164)
	at org.apache.lucene.util.LuceneTestCaseRunner.runChild(LuceneTestCaseRunner.java:57)
	at org.junit.runners.ParentRunner$3.run(ParentRunner.java:231)
	at org.junit.runners.ParentRunner$1.schedule(ParentRunner.java:60)
	at org.junit.runners.ParentRunner.runChildren(ParentRunner.java:229)
	at org.junit.runners.ParentRunner.access$000(ParentRunner.java:50)
	at org.junit.runners.ParentRunner$2.evaluate(ParentRunner.java:222)
	at org.junit.internal.runners.statements.RunBefores.evaluate(RunBefores.java:28)
	at org.junit.internal.runners.statements.RunAfters.evaluate(RunAfters.java:30)
	at org.apache.lucene.util.UncaughtExceptionsRule$1.evaluate(UncaughtExceptionsRule.java:75)
	at org.apache.lucene.util.StoreClassNameRule$1.evaluate(StoreClassNameRule.java:38)
	at org.apache.lucene.util.SystemPropertiesInvariantRule$1.evaluate(SystemPropertiesInvariantRule.java:69)
	at org.junit.rules.RunRules.evaluate(RunRules.java:18)
	at org.junit.runners.ParentRunner.run(ParentRunner.java:300)
	at junit.framework.JUnit4TestAdapter.run(JUnit4TestAdapter.java:39)
	at org.apache.tools.ant.taskdefs.optional.junit.JUnitTestRunner.run(JUnitTestRunner.java:420)
	at org.apache.tools.ant.taskdefs.optional.junit.JUnitTestRunner.launch(JUnitTestRunner.java:911)
	at org.apache.tools.ant.taskdefs.optional.junit.JUnitTestRunner.main(JUnitTestRunner.java:743)


REGRESSION:  org.apache.lucene.search.TestNRTManager.testNRTManager

Error Message:
java.io.IOException: Too many open files in system

Stack Trace:
java.lang.RuntimeException: java.io.IOException: Too many open files in system
	at org.apache.lucene.util._TestUtil.getTempDir(_TestUtil.java:77)
	at org.apache.lucene.index.ThreadedIndexingAndSearchingTestCase.runTest(ThreadedIndexingAndSearchingTestCase.java:422)
	at org.apache.lucene.search.TestNRTManager.testNRTManager(TestNRTManager.java:53)
	at sun.reflect.NativeMethodAccessorImpl.invoke0(Native Method)
	at sun.reflect.NativeMethodAccessorImpl.invoke(NativeMethodAccessorImpl.java:57)
	at sun.reflect.DelegatingMethodAccessorImpl.invoke(DelegatingMethodAccessorImpl.java:43)
	at java.lang.reflect.Method.invoke(Method.java:616)
	at org.junit.runners.model.FrameworkMethod$1.runReflectiveCall(FrameworkMethod.java:45)
	at org.junit.internal.runners.model.ReflectiveCallable.run(ReflectiveCallable.java:15)
	at org.junit.runners.model.FrameworkMethod.invokeExplosively(FrameworkMethod.java:42)
	at org.junit.internal.runners.statements.InvokeMethod.evaluate(InvokeMethod.java:20)
	at org.junit.internal.runners.statements.RunBefores.evaluate(RunBefores.java:28)
	at org.junit.internal.runners.statements.RunAfters.evaluate(RunAfters.java:30)
	at org.apache.lucene.util.LuceneTestCase$SubclassSetupTeardownRule$1.evaluate(LuceneTestCase.java:754)
	at org.apache.lucene.util.LuceneTestCase$InternalSetupTeardownRule$1.evaluate(LuceneTestCase.java:670)
	at org.apache.lucene.util.SystemPropertiesInvariantRule$1.evaluate(SystemPropertiesInvariantRule.java:69)
	at org.apache.lucene.util.LuceneTestCase$TestResultInterceptorRule$1.evaluate(LuceneTestCase.java:591)
	at org.apache.lucene.util.UncaughtExceptionsRule$1.evaluate(UncaughtExceptionsRule.java:75)
	at org.apache.lucene.util.LuceneTestCase$SaveThreadAndTestNameRule$1.evaluate(LuceneTestCase.java:642)
	at org.junit.rules.RunRules.evaluate(RunRules.java:18)
	at org.junit.runners.ParentRunner.runLeaf(ParentRunner.java:263)
	at org.junit.runners.BlockJUnit4ClassRunner.runChild(BlockJUnit4ClassRunner.java:68)
	at org.apache.lucene.util.LuceneTestCaseRunner.runChild(LuceneTestCaseRunner.java:164)
	at org.apache.lucene.util.LuceneTestCaseRunner.runChild(LuceneTestCaseRunner.java:57)
	at org.junit.runners.ParentRunner$3.run(ParentRunner.java:231)
	at org.junit.runners.ParentRunner$1.schedule(ParentRunner.java:60)
	at org.junit.runners.ParentRunner.runChildren(ParentRunner.java:229)
	at org.junit.runners.ParentRunner.access$000(ParentRunner.java:50)
	at org.junit.runners.ParentRunner$2.evaluate(ParentRunner.java:222)
	at org.junit.internal.runners.statements.RunBefores.evaluate(RunBefores.java:28)
	at org.junit.internal.runners.statements.RunAfters.evaluate(RunAfters.java:30)
	at org.apache.lucene.util.UncaughtExceptionsRule$1.evaluate(UncaughtExceptionsRule.java:75)
	at org.apache.lucene.util.StoreClassNameRule$1.evaluate(StoreClassNameRule.java:38)
	at org.apache.lucene.util.SystemPropertiesInvariantRule$1.evaluate(SystemPropertiesInvariantRule.java:69)
	at org.junit.rules.RunRules.evaluate(RunRules.java:18)
	at org.junit.runners.ParentRunner.run(ParentRunner.java:300)
	at junit.framework.JUnit4TestAdapter.run(JUnit4TestAdapter.java:39)
	at org.apache.tools.ant.taskdefs.optional.junit.JUnitTestRunner.run(JUnitTestRunner.java:420)
	at org.apache.tools.ant.taskdefs.optional.junit.JUnitTestRunner.launch(JUnitTestRunner.java:911)
	at org.apache.tools.ant.taskdefs.optional.junit.JUnitTestRunner.main(JUnitTestRunner.java:743)
Caused by: java.io.IOException: Too many open files in system
	at java.io.UnixFileSystem.createFileExclusively(Native Method)
	at java.io.File.createNewFile(File.java:900)
	at org.apache.lucene.util._TestUtil.createTempFile(_TestUtil.java:673)
	at org.apache.lucene.util._TestUtil.getTempDir(_TestUtil.java:72)
	... 39 more


FAILED:  <init>.org.apache.lucene.search.TestNot

Error Message:
org.apache.lucene.search.TestNot

Stack Trace:
java.lang.ClassNotFoundException: org.apache.lucene.search.TestNot
	at java.net.URLClassLoader$1.run(URLClassLoader.java:214)
	at java.security.AccessController.doPrivileged(Native Method)
	at java.net.URLClassLoader.findClass(URLClassLoader.java:205)
	at java.lang.ClassLoader.loadClass(ClassLoader.java:321)
	at sun.misc.Launcher$AppClassLoader.loadClass(Launcher.java:294)
	at java.lang.ClassLoader.loadClass(ClassLoader.java:266)
	at java.lang.Class.forName0(Native Method)
	at java.lang.Class.forName(Class.java:186)
	at org.apache.tools.ant.taskdefs.optional.junit.JUnitTestRunner.run(JUnitTestRunner.java:335)
	at org.apache.tools.ant.taskdefs.optional.junit.JUnitTestRunner.launch(JUnitTestRunner.java:911)
	at org.apache.tools.ant.taskdefs.optional.junit.JUnitTestRunner.main(JUnitTestRunner.java:743)
Caused by: java.io.FileNotFoundException: /usr/home/hudson/hudson-slave/workspace/Lucene-Solr-tests-only-trunk/checkout/lucene/build/core/classes/test/org/apache/lucene/search/TestNot.class (Too many open files in system)
	at java.io.FileInputStream.open(Native Method)
	at java.io.FileInputStream.<init>(FileInputStream.java:137)
	at sun.misc.URLClassPath$FileLoader$1.getInputStream(URLClassPath.java:1005)
	at sun.misc.Resource.cachedInputStream(Resource.java:77)
	at sun.misc.Resource.getByteBuffer(Resource.java:160)
	at java.net.URLClassLoader.defineClass(URLClassLoader.java:266)
	at java.net.URLClassLoader.access$000(URLClassLoader.java:73)
	at java.net.URLClassLoader$1.run(URLClassLoader.java:212)
	... 10 more


FAILED:  <init>.org.apache.lucene.search.TestPhraseQuery

Error Message:
org.apache.lucene.search.TestPhraseQuery

Stack Trace:
java.lang.ClassNotFoundException: org.apache.lucene.search.TestPhraseQuery
	at java.net.URLClassLoader$1.run(URLClassLoader.java:214)
	at java.security.AccessController.doPrivileged(Native Method)
	at java.net.URLClassLoader.findClass(URLClassLoader.java:205)
	at java.lang.ClassLoader.loadClass(ClassLoader.java:321)
	at sun.misc.Launcher$AppClassLoader.loadClass(Launcher.java:294)
	at java.lang.ClassLoader.loadClass(ClassLoader.java:266)
	at java.lang.Class.forName0(Native Method)
	at java.lang.Class.forName(Class.java:186)
	at org.apache.tools.ant.taskdefs.optional.junit.JUnitTestRunner.run(JUnitTestRunner.java:335)
	at org.apache.tools.ant.taskdefs.optional.junit.JUnitTestRunner.launch(JUnitTestRunner.java:911)
	at org.apache.tools.ant.taskdefs.optional.junit.JUnitTestRunner.main(JUnitTestRunner.java:743)
Caused by: java.io.FileNotFoundException: /usr/home/hudson/hudson-slave/workspace/Lucene-Solr-tests-only-trunk/checkout/lucene/build/core/classes/test/org/apache/lucene/search/TestPhraseQuery.class (Too many open files in system)
	at java.io.FileInputStream.open(Native Method)
	at java.io.FileInputStream.<init>(FileInputStream.java:137)
	at sun.misc.URLClassPath$FileLoader$1.getInputStream(URLClassPath.java:1005)
	at sun.misc.Resource.cachedInputStream(Resource.java:77)
	at sun.misc.Resource.getByteBuffer(Resource.java:160)
	at java.net.URLClassLoader.defineClass(URLClassLoader.java:266)
	at java.net.URLClassLoader.access$000(URLClassLoader.java:73)
	at java.net.URLClassLoader$1.run(URLClassLoader.java:212)
	... 10 more


FAILED:  <init>.org.apache.lucene.search.TestScorerPerf

Error Message:
org.apache.lucene.search.TestScorerPerf

Stack Trace:
java.lang.ClassNotFoundException: org.apache.lucene.search.TestScorerPerf
	at java.net.URLClassLoader$1.run(URLClassLoader.java:214)
	at java.security.AccessController.doPrivileged(Native Method)
	at java.net.URLClassLoader.findClass(URLClassLoader.java:205)
	at java.lang.ClassLoader.loadClass(ClassLoader.java:321)
	at sun.misc.Launcher$AppClassLoader.loadClass(Launcher.java:294)
	at java.lang.ClassLoader.loadClass(ClassLoader.java:266)
	at java.lang.Class.forName0(Native Method)
	at java.lang.Class.forName(Class.java:186)
	at org.apache.tools.ant.taskdefs.optional.junit.JUnitTestRunner.run(JUnitTestRunner.java:335)
	at org.apache.tools.ant.taskdefs.optional.junit.JUnitTestRunner.launch(JUnitTestRunner.java:911)
	at org.apache.tools.ant.taskdefs.optional.junit.JUnitTestRunner.main(JUnitTestRunner.java:743)
Caused by: java.io.FileNotFoundException: /usr/home/hudson/hudson-slave/workspace/Lucene-Solr-tests-only-trunk/checkout/lucene/build/core/classes/test/org/apache/lucene/search/TestScorerPerf.class (Too many open files in system)
	at java.io.FileInputStream.open(Native Method)
	at java.io.FileInputStream.<init>(FileInputStream.java:137)
	at sun.misc.URLClassPath$FileLoader$1.getInputStream(URLClassPath.java:1005)
	at sun.misc.Resource.cachedInputStream(Resource.java:77)
	at sun.misc.Resource.getByteBuffer(Resource.java:160)
	at java.net.URLClassLoader.defineClass(URLClassLoader.java:266)
	at java.net.URLClassLoader.access$000(URLClassLoader.java:73)
	at java.net.URLClassLoader$1.run(URLClassLoader.java:212)
	... 10 more


REGRESSION:  org.apache.lucene.search.TestSearcherManager.testSearcherManager

Error Message:
/usr/home/hudson/hudson-slave/workspace/Lucene-Solr-tests-only-trunk/checkout/lucene/build/core/test/1/TestSearcherManager3457334592tmp/_6.fdx (Too many open files in system)

Stack Trace:
java.io.FileNotFoundException: /usr/home/hudson/hudson-slave/workspace/Lucene-Solr-tests-only-trunk/checkout/lucene/build/core/test/1/TestSearcherManager3457334592tmp/_6.fdx (Too many open files in system)
	at java.io.RandomAccessFile.open(Native Method)
	at java.io.RandomAccessFile.<init>(RandomAccessFile.java:233)
	at org.apache.lucene.store.SimpleFSDirectory$SimpleFSIndexInput$Descriptor.<init>(SimpleFSDirectory.java:98)
	at org.apache.lucene.store.SimpleFSDirectory$SimpleFSIndexInput.<init>(SimpleFSDirectory.java:121)
	at org.apache.lucene.store.NIOFSDirectory$NIOFSIndexInput.<init>(NIOFSDirectory.java:116)
	at org.apache.lucene.store.NIOFSDirectory.openInput(NIOFSDirectory.java:81)
	at org.apache.lucene.store.NRTCachingDirectory.openInput(NRTCachingDirectory.java:228)
	at org.apache.lucene.store.MockDirectoryWrapper.openInput(MockDirectoryWrapper.java:503)
	at org.apache.lucene.codecs.lucene40.Lucene40StoredFieldsReader.<init>(Lucene40StoredFieldsReader.java:82)
	at org.apache.lucene.codecs.lucene40.Lucene40StoredFieldsFormat.fieldsReader(Lucene40StoredFieldsFormat.java:37)
	at org.apache.lucene.index.SegmentCoreReaders.<init>(SegmentCoreReaders.java:116)
	at org.apache.lucene.index.SegmentReader.<init>(SegmentReader.java:55)
	at org.apache.lucene.index.ReadersAndLiveDocs.getReader(ReadersAndLiveDocs.java:120)
	at org.apache.lucene.index.BufferedDeletesStream.applyDeletes(BufferedDeletesStream.java:267)
	at org.apache.lucene.index.IndexWriter.applyAllDeletes(IndexWriter.java:2683)
	at org.apache.lucene.index.IndexWriter.maybeApplyDeletes(IndexWriter.java:2674)
	at org.apache.lucene.index.IndexWriter.prepareCommit(IndexWriter.java:2425)
	at org.apache.lucene.index.IndexWriter.commitInternal(IndexWriter.java:2548)
	at org.apache.lucene.index.IndexWriter.commit(IndexWriter.java:2530)
	at org.apache.lucene.index.IndexWriter.commit(IndexWriter.java:2514)
	at org.apache.lucene.search.TestSearcherManager.getFinalSearcher(TestSearcherManager.java:60)
	at org.apache.lucene.index.ThreadedIndexingAndSearchingTestCase.runTest(ThreadedIndexingAndSearchingTestCase.java:508)
	at org.apache.lucene.search.TestSearcherManager.testSearcherManager(TestSearcherManager.java:54)
	at sun.reflect.NativeMethodAccessorImpl.invoke0(Native Method)
	at sun.reflect.NativeMethodAccessorImpl.invoke(NativeMethodAccessorImpl.java:57)
	at sun.reflect.DelegatingMethodAccessorImpl.invoke(DelegatingMethodAccessorImpl.java:43)
	at java.lang.reflect.Method.invoke(Method.java:616)
	at org.junit.runners.model.FrameworkMethod$1.runReflectiveCall(FrameworkMethod.java:45)
	at org.junit.internal.runners.model.ReflectiveCallable.run(ReflectiveCallable.java:15)
	at org.junit.runners.model.FrameworkMethod.invokeExplosively(FrameworkMethod.java:42)
	at org.junit.internal.runners.statements.InvokeMethod.evaluate(InvokeMethod.java:20)
	at org.junit.internal.runners.statements.RunBefores.evaluate(RunBefores.java:28)
	at org.junit.internal.runners.statements.RunAfters.evaluate(RunAfters.java:30)
	at org.apache.lucene.util.LuceneTestCase$SubclassSetupTeardownRule$1.evaluate(LuceneTestCase.java:754)
	at org.apache.lucene.util.LuceneTestCase$InternalSetupTeardownRule$1.evaluate(LuceneTestCase.java:670)
	at org.apache.lucene.util.SystemPropertiesInvariantRule$1.evaluate(SystemPropertiesInvariantRule.java:69)
	at org.apache.lucene.util.LuceneTestCase$TestResultInterceptorRule$1.evaluate(LuceneTestCase.java:591)
	at org.apache.lucene.util.UncaughtExceptionsRule$1.evaluate(UncaughtExceptionsRule.java:75)
	at org.apache.lucene.util.LuceneTestCase$SaveThreadAndTestNameRule$1.evaluate(LuceneTestCase.java:642)
	at org.junit.rules.RunRules.evaluate(RunRules.java:18)
	at org.junit.runners.ParentRunner.runLeaf(ParentRunner.java:263)
	at org.junit.runners.BlockJUnit4ClassRunner.runChild(BlockJUnit4ClassRunner.java:68)
	at org.apache.lucene.util.LuceneTestCaseRunner.runChild(LuceneTestCaseRunner.java:164)
	at org.apache.lucene.util.LuceneTestCaseRunner.runChild(LuceneTestCaseRunner.java:57)
	at org.junit.runners.ParentRunner$3.run(ParentRunner.java:231)
	at org.junit.runners.ParentRunner$1.schedule(ParentRunner.java:60)
	at org.junit.runners.ParentRunner.runChildren(ParentRunner.java:229)
	at org.junit.runners.ParentRunner.access$000(ParentRunner.java:50)
	at org.junit.runners.ParentRunner$2.evaluate(ParentRunner.java:222)
	at org.junit.internal.runners.statements.RunBefores.evaluate(RunBefores.java:28)
	at org.junit.internal.runners.statements.RunAfters.evaluate(RunAfters.java:30)
	at org.apache.lucene.util.UncaughtExceptionsRule$1.evaluate(UncaughtExceptionsRule.java:75)
	at org.apache.lucene.util.StoreClassNameRule$1.evaluate(StoreClassNameRule.java:38)
	at org.apache.lucene.util.SystemPropertiesInvariantRule$1.evaluate(SystemPropertiesInvariantRule.java:69)
	at org.junit.rules.RunRules.evaluate(RunRules.java:18)
	at org.junit.runners.ParentRunner.run(ParentRunner.java:300)
	at junit.framework.JUnit4TestAdapter.run(JUnit4TestAdapter.java:39)
	at org.apache.tools.ant.taskdefs.optional.junit.JUnitTestRunner.run(JUnitTestRunner.java:420)
	at org.apache.tools.ant.taskdefs.optional.junit.JUnitTestRunner.launch(JUnitTestRunner.java:911)
	at org.apache.tools.ant.taskdefs.optional.junit.JUnitTestRunner.main(JUnitTestRunner.java:743)


FAILED:  <init>.org.apache.lucene.search.TestShardSearching

Error Message:
org.apache.lucene.search.TestShardSearching

Stack Trace:
java.lang.ClassNotFoundException: org.apache.lucene.search.TestShardSearching
	at java.net.URLClassLoader$1.run(URLClassLoader.java:214)
	at java.security.AccessController.doPrivileged(Native Method)
	at java.net.URLClassLoader.findClass(URLClassLoader.java:205)
	at java.lang.ClassLoader.loadClass(ClassLoader.java:321)
	at sun.misc.Launcher$AppClassLoader.loadClass(Launcher.java:294)
	at java.lang.ClassLoader.loadClass(ClassLoader.java:266)
	at java.lang.Class.forName0(Native Method)
	at java.lang.Class.forName(Class.java:186)
	at org.apache.tools.ant.taskdefs.optional.junit.JUnitTestRunner.run(JUnitTestRunner.java:335)
	at org.apache.tools.ant.taskdefs.optional.junit.JUnitTestRunner.launch(JUnitTestRunner.java:911)
	at org.apache.tools.ant.taskdefs.optional.junit.JUnitTestRunner.main(JUnitTestRunner.java:743)
Caused by: java.io.FileNotFoundException: /usr/home/hudson/hudson-slave/workspace/Lucene-Solr-tests-only-trunk/checkout/lucene/build/core/classes/test/org/apache/lucene/search/TestShardSearching.class (Too many open files in system)
	at java.io.FileInputStream.open(Native Method)
	at java.io.FileInputStream.<init>(FileInputStream.java:137)
	at sun.misc.URLClassPath$FileLoader$1.getInputStream(URLClassPath.java:1005)
	at sun.misc.Resource.cachedInputStream(Resource.java:77)
	at sun.misc.Resource.getByteBuffer(Resource.java:160)
	at java.net.URLClassLoader.defineClass(URLClassLoader.java:266)
	at java.net.URLClassLoader.access$000(URLClassLoader.java:73)
	at java.net.URLClassLoader$1.run(URLClassLoader.java:212)
	... 10 more


FAILED:  junit.framework.TestSuite.org.apache.lucene.search.TestTermRangeFilter

Error Message:
/usr/home/hudson/hudson-slave/workspace/Lucene-Solr-tests-only-trunk/checkout/lucene/build/core/test/1/index3457334610tmp/_3_0.tii (Too many open files in system)

Stack Trace:
java.io.FileNotFoundException: /usr/home/hudson/hudson-slave/workspace/Lucene-Solr-tests-only-trunk/checkout/lucene/build/core/test/1/index3457334610tmp/_3_0.tii (Too many open files in system)
	at java.io.RandomAccessFile.open(Native Method)
	at java.io.RandomAccessFile.<init>(RandomAccessFile.java:233)
	at org.apache.lucene.store.SimpleFSDirectory$SimpleFSIndexInput$Descriptor.<init>(SimpleFSDirectory.java:98)
	at org.apache.lucene.store.SimpleFSDirectory$SimpleFSIndexInput.<init>(SimpleFSDirectory.java:121)
	at org.apache.lucene.store.NIOFSDirectory$NIOFSIndexInput.<init>(NIOFSDirectory.java:116)
	at org.apache.lucene.store.NIOFSDirectory.openInput(NIOFSDirectory.java:81)
	at org.apache.lucene.store.MockDirectoryWrapper.openInput(MockDirectoryWrapper.java:503)
	at org.apache.lucene.codecs.FixedGapTermsIndexReader.<init>(FixedGapTermsIndexReader.java:78)
	at org.apache.lucene.codecs.mockintblock.MockFixedIntBlockPostingsFormat.fieldsProducer(MockFixedIntBlockPostingsFormat.java:167)
	at org.apache.lucene.codecs.perfield.PerFieldPostingsFormat$FieldsReader$1.visitOneFormat(PerFieldPostingsFormat.java:197)
	at org.apache.lucene.codecs.perfield.PerFieldPostingsFormat$VisitPerFieldFile.<init>(PerFieldPostingsFormat.java:288)
	at org.apache.lucene.codecs.perfield.PerFieldPostingsFormat$FieldsReader$1.<init>(PerFieldPostingsFormat.java:194)
	at org.apache.lucene.codecs.perfield.PerFieldPostingsFormat$FieldsReader.<init>(PerFieldPostingsFormat.java:194)
	at org.apache.lucene.codecs.perfield.PerFieldPostingsFormat.fieldsProducer(PerFieldPostingsFormat.java:264)
	at org.apache.lucene.index.SegmentCoreReaders.<init>(SegmentCoreReaders.java:108)
	at org.apache.lucene.index.SegmentReader.<init>(SegmentReader.java:55)
	at org.apache.lucene.index.ReadersAndLiveDocs.getReader(ReadersAndLiveDocs.java:120)
	at org.apache.lucene.index.ReadersAndLiveDocs.getReadOnlyClone(ReadersAndLiveDocs.java:205)
	at org.apache.lucene.index.StandardDirectoryReader.open(StandardDirectoryReader.java:96)
	at org.apache.lucene.index.IndexWriter.getReader(IndexWriter.java:365)
	at org.apache.lucene.index.RandomIndexWriter.getReader(RandomIndexWriter.java:395)
	at org.apache.lucene.index.RandomIndexWriter.getReader(RandomIndexWriter.java:342)
	at org.apache.lucene.search.BaseTestRangeFilter.build(BaseTestRangeFilter.java:164)
	at org.apache.lucene.search.BaseTestRangeFilter.beforeClassBaseTestRangeFilter(BaseTestRangeFilter.java:101)
	at sun.reflect.NativeMethodAccessorImpl.invoke0(Native Method)
	at sun.reflect.NativeMethodAccessorImpl.invoke(NativeMethodAccessorImpl.java:57)
	at sun.reflect.DelegatingMethodAccessorImpl.invoke(DelegatingMethodAccessorImpl.java:43)
	at java.lang.reflect.Method.invoke(Method.java:616)
	at org.junit.runners.model.FrameworkMethod$1.runReflectiveCall(FrameworkMethod.java:45)
	at org.junit.internal.runners.model.ReflectiveCallable.run(ReflectiveCallable.java:15)
	at org.junit.runners.model.FrameworkMethod.invokeExplosively(FrameworkMethod.java:42)
	at org.junit.internal.runners.statements.RunBefores.evaluate(RunBefores.java:27)
	at org.junit.internal.runners.statements.RunAfters.evaluate(RunAfters.java:30)
	at org.apache.lucene.util.UncaughtExceptionsRule$1.evaluate(UncaughtExceptionsRule.java:75)
	at org.apache.lucene.util.StoreClassNameRule$1.evaluate(StoreClassNameRule.java:38)
	at org.apache.lucene.util.SystemPropertiesInvariantRule$1.evaluate(SystemPropertiesInvariantRule.java:69)
	at org.junit.rules.RunRules.evaluate(RunRules.java:18)
	at org.junit.runners.ParentRunner.run(ParentRunner.java:300)
	at junit.framework.JUnit4TestAdapter.run(JUnit4TestAdapter.java:39)
	at org.apache.tools.ant.taskdefs.optional.junit.JUnitTestRunner.run(JUnitTestRunner.java:420)
	at org.apache.tools.ant.taskdefs.optional.junit.JUnitTestRunner.launch(JUnitTestRunner.java:911)
	at org.apache.tools.ant.taskdefs.optional.junit.JUnitTestRunner.main(JUnitTestRunner.java:743)


REGRESSION:  org.apache.lucene.search.TestTimeLimitingCollector.testTimeoutGreedy

Error Message:
/usr/home/hudson/hudson-slave/workspace/Lucene-Solr-tests-only-trunk/checkout/lucene/build/core/test/3/index1734117386tmp/_0_0.tii (Too many open files in system)

Stack Trace:
java.io.FileNotFoundException: /usr/home/hudson/hudson-slave/workspace/Lucene-Solr-tests-only-trunk/checkout/lucene/build/core/test/3/index1734117386tmp/_0_0.tii (Too many open files in system)
	at java.io.RandomAccessFile.open(Native Method)
	at java.io.RandomAccessFile.<init>(RandomAccessFile.java:233)
	at org.apache.lucene.store.FSDirectory$FSIndexOutput.<init>(FSDirectory.java:449)
	at org.apache.lucene.store.FSDirectory.createOutput(FSDirectory.java:288)
	at org.apache.lucene.store.MockDirectoryWrapper.createOutput(MockDirectoryWrapper.java:450)
	at org.apache.lucene.codecs.FixedGapTermsIndexWriter.<init>(FixedGapTermsIndexWriter.java:62)
	at org.apache.lucene.codecs.lucene40ords.Lucene40WithOrds.fieldsConsumer(Lucene40WithOrds.java:61)
	at org.apache.lucene.codecs.perfield.PerFieldPostingsFormat$FieldsWriter.addField(PerFieldPostingsFormat.java:126)
	at org.apache.lucene.index.FreqProxTermsWriterPerField.flush(FreqProxTermsWriterPerField.java:322)
	at org.apache.lucene.index.FreqProxTermsWriter.flush(FreqProxTermsWriter.java:92)
	at org.apache.lucene.index.TermsHash.flush(TermsHash.java:117)
	at org.apache.lucene.index.DocInverter.flush(DocInverter.java:53)
	at org.apache.lucene.index.DocFieldProcessor.flush(DocFieldProcessor.java:81)
	at org.apache.lucene.index.DocumentsWriterPerThread.flush(DocumentsWriterPerThread.java:475)
	at org.apache.lucene.index.DocumentsWriter.doFlush(DocumentsWriter.java:422)
	at org.apache.lucene.index.DocumentsWriter.postUpdate(DocumentsWriter.java:316)
	at org.apache.lucene.index.DocumentsWriter.updateDocument(DocumentsWriter.java:389)
	at org.apache.lucene.index.IndexWriter.updateDocument(IndexWriter.java:1276)
	at org.apache.lucene.index.IndexWriter.addDocument(IndexWriter.java:1034)
	at org.apache.lucene.index.RandomIndexWriter.addDocument(RandomIndexWriter.java:178)
	at org.apache.lucene.index.RandomIndexWriter.addDocument(RandomIndexWriter.java:137)
	at org.apache.lucene.search.TestTimeLimitingCollector.add(TestTimeLimitingCollector.java:120)
	at org.apache.lucene.search.TestTimeLimitingCollector.setUp(TestTimeLimitingCollector.java:86)
	at sun.reflect.GeneratedMethodAccessor1.invoke(Unknown Source)
	at sun.reflect.DelegatingMethodAccessorImpl.invoke(DelegatingMethodAccessorImpl.java:43)
	at java.lang.reflect.Method.invoke(Method.java:616)
	at org.junit.runners.model.FrameworkMethod$1.runReflectiveCall(FrameworkMethod.java:45)
	at org.junit.internal.runners.model.ReflectiveCallable.run(ReflectiveCallable.java:15)
	at org.junit.runners.model.FrameworkMethod.invokeExplosively(FrameworkMethod.java:42)
	at org.junit.internal.runners.statements.RunBefores.evaluate(RunBefores.java:27)
	at org.junit.internal.runners.statements.RunAfters.evaluate(RunAfters.java:30)
	at org.apache.lucene.util.LuceneTestCase$SubclassSetupTeardownRule$1.evaluate(LuceneTestCase.java:754)
	at org.apache.lucene.util.LuceneTestCase$InternalSetupTeardownRule$1.evaluate(LuceneTestCase.java:670)
	at org.apache.lucene.util.SystemPropertiesInvariantRule$1.evaluate(SystemPropertiesInvariantRule.java:69)
	at org.apache.lucene.util.LuceneTestCase$TestResultInterceptorRule$1.evaluate(LuceneTestCase.java:591)
	at org.apache.lucene.util.UncaughtExceptionsRule$1.evaluate(UncaughtExceptionsRule.java:75)
	at org.apache.lucene.util.LuceneTestCase$SaveThreadAndTestNameRule$1.evaluate(LuceneTestCase.java:642)
	at org.junit.rules.RunRules.evaluate(RunRules.java:18)
	at org.junit.runners.ParentRunner.runLeaf(ParentRunner.java:263)
	at org.junit.runners.BlockJUnit4ClassRunner.runChild(BlockJUnit4ClassRunner.java:68)
	at org.apache.lucene.util.LuceneTestCaseRunner.runChild(LuceneTestCaseRunner.java:164)
	at org.apache.lucene.util.LuceneTestCaseRunner.runChild(LuceneTestCaseRunner.java:57)
	at org.junit.runners.ParentRunner$3.run(ParentRunner.java:231)
	at org.junit.runners.ParentRunner$1.schedule(ParentRunner.java:60)
	at org.junit.runners.ParentRunner.runChildren(ParentRunner.java:229)
	at org.junit.runners.ParentRunner.access$000(ParentRunner.java:50)
	at org.junit.runners.ParentRunner$2.evaluate(ParentRunner.java:222)
	at org.junit.internal.runners.statements.RunBefores.evaluate(RunBefores.java:28)
	at org.junit.internal.runners.statements.RunAfters.evaluate(RunAfters.java:30)
	at org.apache.lucene.util.UncaughtExceptionsRule$1.evaluate(UncaughtExceptionsRule.java:75)
	at org.apache.lucene.util.StoreClassNameRule$1.evaluate(StoreClassNameRule.java:38)
	at org.apache.lucene.util.SystemPropertiesInvariantRule$1.evaluate(SystemPropertiesInvariantRule.java:69)
	at org.junit.rules.RunRules.evaluate(RunRules.java:18)
	at org.junit.runners.ParentRunner.run(ParentRunner.java:300)
	at junit.framework.JUnit4TestAdapter.run(JUnit4TestAdapter.java:39)
	at org.apache.tools.ant.taskdefs.optional.junit.JUnitTestRunner.run(JUnitTestRunner.java:420)
	at org.apache.tools.ant.taskdefs.optional.junit.JUnitTestRunner.launch(JUnitTestRunner.java:911)
	at org.apache.tools.ant.taskdefs.optional.junit.JUnitTestRunner.main(JUnitTestRunner.java:743)


FAILED:  <init>.org.apache.lucene.search.payloads.TestPayloadExplanations

Error Message:
org.apache.lucene.search.payloads.TestPayloadExplanations

Stack Trace:
java.lang.ClassNotFoundException: org.apache.lucene.search.payloads.TestPayloadExplanations
	at java.net.URLClassLoader$1.run(URLClassLoader.java:214)
	at java.security.AccessController.doPrivileged(Native Method)
	at java.net.URLClassLoader.findClass(URLClassLoader.java:205)
	at java.lang.ClassLoader.loadClass(ClassLoader.java:321)
	at sun.misc.Launcher$AppClassLoader.loadClass(Launcher.java:294)
	at java.lang.ClassLoader.loadClass(ClassLoader.java:266)
	at java.lang.Class.forName0(Native Method)
	at java.lang.Class.forName(Class.java:186)
	at org.apache.tools.ant.taskdefs.optional.junit.JUnitTestRunner.run(JUnitTestRunner.java:335)
	at org.apache.tools.ant.taskdefs.optional.junit.JUnitTestRunner.launch(JUnitTestRunner.java:911)
	at org.apache.tools.ant.taskdefs.optional.junit.JUnitTestRunner.main(JUnitTestRunner.java:743)
Caused by: java.io.FileNotFoundException: /usr/home/hudson/hudson-slave/workspace/Lucene-Solr-tests-only-trunk/checkout/lucene/build/core/classes/test/org/apache/lucene/search/payloads/TestPayloadExplanations.class (Too many open files in system)
	at java.io.FileInputStream.open(Native Method)
	at java.io.FileInputStream.<init>(FileInputStream.java:137)
	at sun.misc.URLClassPath$FileLoader$1.getInputStream(URLClassPath.java:1005)
	at sun.misc.Resource.cachedInputStream(Resource.java:77)
	at sun.misc.Resource.getByteBuffer(Resource.java:160)
	at java.net.URLClassLoader.defineClass(URLClassLoader.java:266)
	at java.net.URLClassLoader.access$000(URLClassLoader.java:73)
	at java.net.URLClassLoader$1.run(URLClassLoader.java:212)
	... 10 more


FAILED:  <init>.org.apache.lucene.search.similarities.TestSimilarity2

Error Message:
org.apache.lucene.search.similarities.TestSimilarity2

Stack Trace:
java.lang.ClassNotFoundException: org.apache.lucene.search.similarities.TestSimilarity2
	at java.net.URLClassLoader$1.run(URLClassLoader.java:214)
	at java.security.AccessController.doPrivileged(Native Method)
	at java.net.URLClassLoader.findClass(URLClassLoader.java:205)
	at java.lang.ClassLoader.loadClass(ClassLoader.java:321)
	at sun.misc.Launcher$AppClassLoader.loadClass(Launcher.java:294)
	at java.lang.ClassLoader.loadClass(ClassLoader.java:266)
	at java.lang.Class.forName0(Native Method)
	at java.lang.Class.forName(Class.java:186)
	at org.apache.tools.ant.taskdefs.optional.junit.JUnitTestRunner.run(JUnitTestRunner.java:335)
	at org.apache.tools.ant.taskdefs.optional.junit.JUnitTestRunner.launch(JUnitTestRunner.java:911)
	at org.apache.tools.ant.taskdefs.optional.junit.JUnitTestRunner.main(JUnitTestRunner.java:743)
Caused by: java.io.FileNotFoundException: /usr/home/hudson/hudson-slave/workspace/Lucene-Solr-tests-only-trunk/checkout/lucene/build/core/classes/test/org/apache/lucene/search/similarities/TestSimilarity2.class (Too many open files in system)
	at java.io.FileInputStream.open(Native Method)
	at java.io.FileInputStream.<init>(FileInputStream.java:137)
	at sun.misc.URLClassPath$FileLoader$1.getInputStream(URLClassPath.java:1005)
	at sun.misc.Resource.cachedInputStream(Resource.java:77)
	at sun.misc.Resource.getByteBuffer(Resource.java:160)
	at java.net.URLClassLoader.defineClass(URLClassLoader.java:266)
	at java.net.URLClassLoader.access$000(URLClassLoader.java:73)
	at java.net.URLClassLoader$1.run(URLClassLoader.java:212)
	... 10 more


FAILED:  <init>.org.apache.lucene.search.spans.TestSpanExplanationsOfNonMatches

Error Message:
org.apache.lucene.search.spans.TestSpanExplanationsOfNonMatches

Stack Trace:
java.lang.ClassNotFoundException: org.apache.lucene.search.spans.TestSpanExplanationsOfNonMatches
	at java.net.URLClassLoader$1.run(URLClassLoader.java:214)
	at java.security.AccessController.doPrivileged(Native Method)
	at java.net.URLClassLoader.findClass(URLClassLoader.java:205)
	at java.lang.ClassLoader.loadClass(ClassLoader.java:321)
	at sun.misc.Launcher$AppClassLoader.loadClass(Launcher.java:294)
	at java.lang.ClassLoader.loadClass(ClassLoader.java:266)
	at java.lang.Class.forName0(Native Method)
	at java.lang.Class.forName(Class.java:186)
	at org.apache.tools.ant.taskdefs.optional.junit.JUnitTestRunner.run(JUnitTestRunner.java:335)
	at org.apache.tools.ant.taskdefs.optional.junit.JUnitTestRunner.launch(JUnitTestRunner.java:911)
	at org.apache.tools.ant.taskdefs.optional.junit.JUnitTestRunner.main(JUnitTestRunner.java:743)
Caused by: java.io.FileNotFoundException: /usr/home/hudson/hudson-slave/workspace/Lucene-Solr-tests-only-trunk/checkout/lucene/build/core/classes/test/org/apache/lucene/search/spans/TestSpanExplanationsOfNonMatches.class (Too many open files in system)
	at java.io.FileInputStream.open(Native Method)
	at java.io.FileInputStream.<init>(FileInputStream.java:137)
	at sun.misc.URLClassPath$FileLoader$1.getInputStream(URLClassPath.java:1005)
	at sun.misc.Resource.cachedInputStream(Resource.java:77)
	at sun.misc.Resource.getByteBuffer(Resource.java:160)
	at java.net.URLClassLoader.defineClass(URLClassLoader.java:266)
	at java.net.URLClassLoader.access$000(URLClassLoader.java:73)
	at java.net.URLClassLoader$1.run(URLClassLoader.java:212)
	... 10 more


FAILED:  <init>.org.apache.lucene.search.spans.TestSpanSearchEquivalence

Error Message:
org.apache.lucene.search.spans.TestSpanSearchEquivalence

Stack Trace:
java.lang.ClassNotFoundException: org.apache.lucene.search.spans.TestSpanSearchEquivalence
	at java.net.URLClassLoader$1.run(URLClassLoader.java:214)
	at java.security.AccessController.doPrivileged(Native Method)
	at java.net.URLClassLoader.findClass(URLClassLoader.java:205)
	at java.lang.ClassLoader.loadClass(ClassLoader.java:321)
	at sun.misc.Launcher$AppClassLoader.loadClass(Launcher.java:294)
	at java.lang.ClassLoader.loadClass(ClassLoader.java:266)
	at java.lang.Class.forName0(Native Method)
	at java.lang.Class.forName(Class.java:186)
	at org.apache.tools.ant.taskdefs.optional.junit.JUnitTestRunner.run(JUnitTestRunner.java:335)
	at org.apache.tools.ant.taskdefs.optional.junit.JUnitTestRunner.launch(JUnitTestRunner.java:911)
	at org.apache.tools.ant.taskdefs.optional.junit.JUnitTestRunner.main(JUnitTestRunner.java:743)
Caused by: java.io.FileNotFoundException: /usr/home/hudson/hudson-slave/workspace/Lucene-Solr-tests-only-trunk/checkout/lucene/build/core/classes/test/org/apache/lucene/search/spans/TestSpanSearchEquivalence.class (Too many open files in system)
	at java.io.FileInputStream.open(Native Method)
	at java.io.FileInputStream.<init>(FileInputStream.java:137)
	at sun.misc.URLClassPath$FileLoader$1.getInputStream(URLClassPath.java:1005)
	at sun.misc.Resource.cachedInputStream(Resource.java:77)
	at sun.misc.Resource.getByteBuffer(Resource.java:160)
	at java.net.URLClassLoader.defineClass(URLClassLoader.java:266)
	at java.net.URLClassLoader.access$000(URLClassLoader.java:73)
	at java.net.URLClassLoader$1.run(URLClassLoader.java:212)
	... 10 more


FAILED:  <init>.org.apache.lucene.search.spans.TestSpans

Error Message:
org.apache.lucene.search.spans.TestSpans

Stack Trace:
java.lang.ClassNotFoundException: org.apache.lucene.search.spans.TestSpans
	at java.net.URLClassLoader$1.run(URLClassLoader.java:214)
	at java.security.AccessController.doPrivileged(Native Method)
	at java.net.URLClassLoader.findClass(URLClassLoader.java:205)
	at java.lang.ClassLoader.loadClass(ClassLoader.java:321)
	at sun.misc.Launcher$AppClassLoader.loadClass(Launcher.java:294)
	at java.lang.ClassLoader.loadClass(ClassLoader.java:266)
	at java.lang.Class.forName0(Native Method)
	at java.lang.Class.forName(Class.java:186)
	at org.apache.tools.ant.taskdefs.optional.junit.JUnitTestRunner.run(JUnitTestRunner.java:335)
	at org.apache.tools.ant.taskdefs.optional.junit.JUnitTestRunner.launch(JUnitTestRunner.java:911)
	at org.apache.tools.ant.taskdefs.optional.junit.JUnitTestRunner.main(JUnitTestRunner.java:743)
Caused by: java.io.FileNotFoundException: /usr/home/hudson/hudson-slave/workspace/Lucene-Solr-tests-only-trunk/checkout/lucene/build/core/classes/test/org/apache/lucene/search/spans/TestSpans.class (Too many open files in system)
	at java.io.FileInputStream.open(Native Method)
	at java.io.FileInputStream.<init>(FileInputStream.java:137)
	at sun.misc.URLClassPath$FileLoader$1.getInputStream(URLClassPath.java:1005)
	at sun.misc.Resource.cachedInputStream(Resource.java:77)
	at sun.misc.Resource.getByteBuffer(Resource.java:160)
	at java.net.URLClassLoader.defineClass(URLClassLoader.java:266)
	at java.net.URLClassLoader.access$000(URLClassLoader.java:73)
	at java.net.URLClassLoader$1.run(URLClassLoader.java:212)
	... 10 more


REGRESSION:  org.apache.lucene.store.TestBufferedIndexInput.testSetBufferSize

Error Message:
/usr/home/hudson/hudson-slave/workspace/Lucene-Solr-tests-only-trunk/checkout/lucene/build/core/test/1/testSetBufferSize3457334612tmp/_0_1.frq (Too many open files in system)

Stack Trace:
java.io.FileNotFoundException: /usr/home/hudson/hudson-slave/workspace/Lucene-Solr-tests-only-trunk/checkout/lucene/build/core/test/1/testSetBufferSize3457334612tmp/_0_1.frq (Too many open files in system)
	at java.io.RandomAccessFile.open(Native Method)
	at java.io.RandomAccessFile.<init>(RandomAccessFile.java:233)
	at org.apache.lucene.store.FSDirectory$FSIndexOutput.<init>(FSDirectory.java:449)
	at org.apache.lucene.store.FSDirectory.createOutput(FSDirectory.java:288)
	at org.apache.lucene.store.TestBufferedIndexInput$MockFSDirectory.createOutput(TestBufferedIndexInput.java:336)
	at org.apache.lucene.codecs.mocksep.MockSingleIntIndexOutput.<init>(MockSingleIntIndexOutput.java:41)
	at org.apache.lucene.codecs.mocksep.MockSingleIntFactory.createOutput(MockSingleIntFactory.java:36)
	at org.apache.lucene.codecs.sep.SepPostingsWriter.<init>(SepPostingsWriter.java:124)
	at org.apache.lucene.codecs.sep.SepPostingsWriter.<init>(SepPostingsWriter.java:105)
	at org.apache.lucene.codecs.mocksep.MockSepPostingsFormat.fieldsConsumer(MockSepPostingsFormat.java:57)
	at org.apache.lucene.codecs.perfield.PerFieldPostingsFormat$FieldsWriter.addField(PerFieldPostingsFormat.java:126)
	at org.apache.lucene.index.FreqProxTermsWriterPerField.flush(FreqProxTermsWriterPerField.java:322)
	at org.apache.lucene.index.FreqProxTermsWriter.flush(FreqProxTermsWriter.java:92)
	at org.apache.lucene.index.TermsHash.flush(TermsHash.java:117)
	at org.apache.lucene.index.DocInverter.flush(DocInverter.java:53)
	at org.apache.lucene.index.DocFieldProcessor.flush(DocFieldProcessor.java:81)
	at org.apache.lucene.index.DocumentsWriterPerThread.flush(DocumentsWriterPerThread.java:475)
	at org.apache.lucene.index.DocumentsWriter.doFlush(DocumentsWriter.java:422)
	at org.apache.lucene.index.DocumentsWriter.flushAllThreads(DocumentsWriter.java:553)
	at org.apache.lucene.index.IndexWriter.getReader(IndexWriter.java:353)
	at org.apache.lucene.index.DirectoryReader.open(DirectoryReader.java:107)
	at org.apache.lucene.index.IndexReader.open(IndexReader.java:337)
	at org.apache.lucene.store.TestBufferedIndexInput.testSetBufferSize(TestBufferedIndexInput.java:262)
	at sun.reflect.NativeMethodAccessorImpl.invoke0(Native Method)
	at sun.reflect.NativeMethodAccessorImpl.invoke(NativeMethodAccessorImpl.java:57)
	at sun.reflect.DelegatingMethodAccessorImpl.invoke(DelegatingMethodAccessorImpl.java:43)
	at java.lang.reflect.Method.invoke(Method.java:616)
	at org.junit.runners.model.FrameworkMethod$1.runReflectiveCall(FrameworkMethod.java:45)
	at org.junit.internal.runners.model.ReflectiveCallable.run(ReflectiveCallable.java:15)
	at org.junit.runners.model.FrameworkMethod.invokeExplosively(FrameworkMethod.java:42)
	at org.junit.internal.runners.statements.InvokeMethod.evaluate(InvokeMethod.java:20)
	at org.junit.internal.runners.statements.RunBefores.evaluate(RunBefores.java:28)
	at org.junit.internal.runners.statements.RunAfters.evaluate(RunAfters.java:30)
	at org.apache.lucene.util.LuceneTestCase$SubclassSetupTeardownRule$1.evaluate(LuceneTestCase.java:754)
	at org.apache.lucene.util.LuceneTestCase$InternalSetupTeardownRule$1.evaluate(LuceneTestCase.java:670)
	at org.apache.lucene.util.SystemPropertiesInvariantRule$1.evaluate(SystemPropertiesInvariantRule.java:69)
	at org.apache.lucene.util.LuceneTestCase$TestResultInterceptorRule$1.evaluate(LuceneTestCase.java:591)
	at org.apache.lucene.util.UncaughtExceptionsRule$1.evaluate(UncaughtExceptionsRule.java:75)
	at org.apache.lucene.util.LuceneTestCase$SaveThreadAndTestNameRule$1.evaluate(LuceneTestCase.java:642)
	at org.junit.rules.RunRules.evaluate(RunRules.java:18)
	at org.junit.runners.ParentRunner.runLeaf(ParentRunner.java:263)
	at org.junit.runners.BlockJUnit4ClassRunner.runChild(BlockJUnit4ClassRunner.java:68)
	at org.apache.lucene.util.LuceneTestCaseRunner.runChild(LuceneTestCaseRunner.java:164)
	at org.apache.lucene.util.LuceneTestCaseRunner.runChild(LuceneTestCaseRunner.java:57)
	at org.junit.runners.ParentRunner$3.run(ParentRunner.java:231)
	at org.junit.runners.ParentRunner$1.schedule(ParentRunner.java:60)
	at org.junit.runners.ParentRunner.runChildren(ParentRunner.java:229)
	at org.junit.runners.ParentRunner.access$000(ParentRunner.java:50)
	at org.junit.runners.ParentRunner$2.evaluate(ParentRunner.java:222)
	at org.junit.internal.runners.statements.RunBefores.evaluate(RunBefores.java:28)
	at org.junit.internal.runners.statements.RunAfters.evaluate(RunAfters.java:30)
	at org.apache.lucene.util.UncaughtExceptionsRule$1.evaluate(UncaughtExceptionsRule.java:75)
	at org.apache.lucene.util.StoreClassNameRule$1.evaluate(StoreClassNameRule.java:38)
	at org.apache.lucene.util.SystemPropertiesInvariantRule$1.evaluate(SystemPropertiesInvariantRule.java:69)
	at org.junit.rules.RunRules.evaluate(RunRules.java:18)
	at org.junit.runners.ParentRunner.run(ParentRunner.java:300)
	at junit.framework.JUnit4TestAdapter.run(JUnit4TestAdapter.java:39)
	at org.apache.tools.ant.taskdefs.optional.junit.JUnitTestRunner.run(JUnitTestRunner.java:420)
	at org.apache.tools.ant.taskdefs.optional.junit.JUnitTestRunner.launch(JUnitTestRunner.java:911)
	at org.apache.tools.ant.taskdefs.optional.junit.JUnitTestRunner.main(JUnitTestRunner.java:743)


FAILED:  <init>.org.apache.lucene.store.TestFileSwitchDirectory

Error Message:
org.apache.lucene.store.TestFileSwitchDirectory

Stack Trace:
java.lang.ClassNotFoundException: org.apache.lucene.store.TestFileSwitchDirectory
	at java.net.URLClassLoader$1.run(URLClassLoader.java:214)
	at java.security.AccessController.doPrivileged(Native Method)
	at java.net.URLClassLoader.findClass(URLClassLoader.java:205)
	at java.lang.ClassLoader.loadClass(ClassLoader.java:321)
	at sun.misc.Launcher$AppClassLoader.loadClass(Launcher.java:294)
	at java.lang.ClassLoader.loadClass(ClassLoader.java:266)
	at java.lang.Class.forName0(Native Method)
	at java.lang.Class.forName(Class.java:186)
	at org.apache.tools.ant.taskdefs.optional.junit.JUnitTestRunner.run(JUnitTestRunner.java:335)
	at org.apache.tools.ant.taskdefs.optional.junit.JUnitTestRunner.launch(JUnitTestRunner.java:911)
	at org.apache.tools.ant.taskdefs.optional.junit.JUnitTestRunner.main(JUnitTestRunner.java:743)
Caused by: java.io.FileNotFoundException: /usr/home/hudson/hudson-slave/workspace/Lucene-Solr-tests-only-trunk/checkout/lucene/build/core/classes/test/org/apache/lucene/store/TestFileSwitchDirectory.class (Too many open files in system)
	at java.io.FileInputStream.open(Native Method)
	at java.io.FileInputStream.<init>(FileInputStream.java:137)
	at sun.misc.URLClassPath$FileLoader$1.getInputStream(URLClassPath.java:1005)
	at sun.misc.Resource.cachedInputStream(Resource.java:77)
	at sun.misc.Resource.getByteBuffer(Resource.java:160)
	at java.net.URLClassLoader.defineClass(URLClassLoader.java:266)
	at java.net.URLClassLoader.access$000(URLClassLoader.java:73)
	at java.net.URLClassLoader$1.run(URLClassLoader.java:212)
	... 10 more


FAILED:  <init>.org.apache.lucene.store.TestHugeRamFile

Error Message:
org.apache.lucene.store.TestHugeRamFile

Stack Trace:
java.lang.ClassNotFoundException: org.apache.lucene.store.TestHugeRamFile
	at java.net.URLClassLoader$1.run(URLClassLoader.java:214)
	at java.security.AccessController.doPrivileged(Native Method)
	at java.net.URLClassLoader.findClass(URLClassLoader.java:205)
	at java.lang.ClassLoader.loadClass(ClassLoader.java:321)
	at sun.misc.Launcher$AppClassLoader.loadClass(Launcher.java:294)
	at java.lang.ClassLoader.loadClass(ClassLoader.java:266)
	at java.lang.Class.forName0(Native Method)
	at java.lang.Class.forName(Class.java:186)
	at org.apache.tools.ant.taskdefs.optional.junit.JUnitTestRunner.run(JUnitTestRunner.java:335)
	at org.apache.tools.ant.taskdefs.optional.junit.JUnitTestRunner.launch(JUnitTestRunner.java:911)
	at org.apache.tools.ant.taskdefs.optional.junit.JUnitTestRunner.main(JUnitTestRunner.java:743)
Caused by: java.io.FileNotFoundException: /usr/home/hudson/hudson-slave/workspace/Lucene-Solr-tests-only-trunk/checkout/lucene/build/core/classes/test/org/apache/lucene/store/TestHugeRamFile.class (Too many open files in system)
	at java.io.FileInputStream.open(Native Method)
	at java.io.FileInputStream.<init>(FileInputStream.java:137)
	at sun.misc.URLClassPath$FileLoader$1.getInputStream(URLClassPath.java:1005)
	at sun.misc.Resource.cachedInputStream(Resource.java:77)
	at sun.misc.Resource.getByteBuffer(Resource.java:160)
	at java.net.URLClassLoader.defineClass(URLClassLoader.java:266)
	at java.net.URLClassLoader.access$000(URLClassLoader.java:73)
	at java.net.URLClassLoader$1.run(URLClassLoader.java:212)
	... 10 more


FAILED:  <init>.org.apache.lucene.store.TestLock

Error Message:
org.apache.lucene.store.TestLock

Stack Trace:
java.lang.ClassNotFoundException: org.apache.lucene.store.TestLock
	at java.net.URLClassLoader$1.run(URLClassLoader.java:214)
	at java.security.AccessController.doPrivileged(Native Method)
	at java.net.URLClassLoader.findClass(URLClassLoader.java:205)
	at java.lang.ClassLoader.loadClass(ClassLoader.java:321)
	at sun.misc.Launcher$AppClassLoader.loadClass(Launcher.java:294)
	at java.lang.ClassLoader.loadClass(ClassLoader.java:266)
	at java.lang.Class.forName0(Native Method)
	at java.lang.Class.forName(Class.java:186)
	at org.apache.tools.ant.taskdefs.optional.junit.JUnitTestRunner.run(JUnitTestRunner.java:335)
	at org.apache.tools.ant.taskdefs.optional.junit.JUnitTestRunner.launch(JUnitTestRunner.java:911)
	at org.apache.tools.ant.taskdefs.optional.junit.JUnitTestRunner.main(JUnitTestRunner.java:743)
Caused by: java.io.FileNotFoundException: /usr/home/hudson/hudson-slave/workspace/Lucene-Solr-tests-only-trunk/checkout/lucene/build/core/classes/test/org/apache/lucene/store/TestLock.class (Too many open files in system)
	at java.io.FileInputStream.open(Native Method)
	at java.io.FileInputStream.<init>(FileInputStream.java:137)
	at sun.misc.URLClassPath$FileLoader$1.getInputStream(URLClassPath.java:1005)
	at sun.misc.Resource.cachedInputStream(Resource.java:77)
	at sun.misc.Resource.getByteBuffer(Resource.java:160)
	at java.net.URLClassLoader.defineClass(URLClassLoader.java:266)
	at java.net.URLClassLoader.access$000(URLClassLoader.java:73)
	at java.net.URLClassLoader$1.run(URLClassLoader.java:212)
	... 10 more


REGRESSION:  org.apache.lucene.store.TestMultiMMap.testRandomChunkSizes

Error Message:
/usr/home/hudson/hudson-slave/workspace/Lucene-Solr-tests-only-trunk/checkout/lucene/build/core/test/1/TestMultiMMap3457334647tmp/mmap853457334648tmp/_0_1.tib (Too many open files in system)

Stack Trace:
java.io.FileNotFoundException: /usr/home/hudson/hudson-slave/workspace/Lucene-Solr-tests-only-trunk/checkout/lucene/build/core/test/1/TestMultiMMap3457334647tmp/mmap853457334648tmp/_0_1.tib (Too many open files in system)
	at java.io.RandomAccessFile.open(Native Method)
	at java.io.RandomAccessFile.<init>(RandomAccessFile.java:233)
	at org.apache.lucene.store.FSDirectory$FSIndexOutput.<init>(FSDirectory.java:449)
	at org.apache.lucene.store.FSDirectory.createOutput(FSDirectory.java:288)
	at org.apache.lucene.store.MockDirectoryWrapper.createOutput(MockDirectoryWrapper.java:450)
	at org.apache.lucene.codecs.BlockTermsWriter.<init>(BlockTermsWriter.java:76)
	at org.apache.lucene.codecs.mockintblock.MockFixedIntBlockPostingsFormat.fieldsConsumer(MockFixedIntBlockPostingsFormat.java:143)
	at org.apache.lucene.codecs.perfield.PerFieldPostingsFormat$FieldsWriter.addField(PerFieldPostingsFormat.java:126)
	at org.apache.lucene.index.FreqProxTermsWriterPerField.flush(FreqProxTermsWriterPerField.java:322)
	at org.apache.lucene.index.FreqProxTermsWriter.flush(FreqProxTermsWriter.java:92)
	at org.apache.lucene.index.TermsHash.flush(TermsHash.java:117)
	at org.apache.lucene.index.DocInverter.flush(DocInverter.java:53)
	at org.apache.lucene.index.DocFieldProcessor.flush(DocFieldProcessor.java:81)
	at org.apache.lucene.index.DocumentsWriterPerThread.flush(DocumentsWriterPerThread.java:475)
	at org.apache.lucene.index.DocumentsWriter.doFlush(DocumentsWriter.java:422)
	at org.apache.lucene.index.DocumentsWriter.flushAllThreads(DocumentsWriter.java:553)
	at org.apache.lucene.index.IndexWriter.getReader(IndexWriter.java:353)
	at org.apache.lucene.index.RandomIndexWriter.getReader(RandomIndexWriter.java:395)
	at org.apache.lucene.index.RandomIndexWriter.getReader(RandomIndexWriter.java:342)
	at org.apache.lucene.store.TestMultiMMap.assertChunking(TestMultiMMap.java:168)
	at org.apache.lucene.store.TestMultiMMap.testRandomChunkSizes(TestMultiMMap.java:142)
	at sun.reflect.NativeMethodAccessorImpl.invoke0(Native Method)
	at sun.reflect.NativeMethodAccessorImpl.invoke(NativeMethodAccessorImpl.java:57)
	at sun.reflect.DelegatingMethodAccessorImpl.invoke(DelegatingMethodAccessorImpl.java:43)
	at java.lang.reflect.Method.invoke(Method.java:616)
	at org.junit.runners.model.FrameworkMethod$1.runReflectiveCall(FrameworkMethod.java:45)
	at org.junit.internal.runners.model.ReflectiveCallable.run(ReflectiveCallable.java:15)
	at org.junit.runners.model.FrameworkMethod.invokeExplosively(FrameworkMethod.java:42)
	at org.junit.internal.runners.statements.InvokeMethod.evaluate(InvokeMethod.java:20)
	at org.junit.internal.runners.statements.RunBefores.evaluate(RunBefores.java:28)
	at org.junit.internal.runners.statements.RunAfters.evaluate(RunAfters.java:30)
	at org.apache.lucene.util.LuceneTestCase$SubclassSetupTeardownRule$1.evaluate(LuceneTestCase.java:754)
	at org.apache.lucene.util.LuceneTestCase$InternalSetupTeardownRule$1.evaluate(LuceneTestCase.java:670)
	at org.apache.lucene.util.SystemPropertiesInvariantRule$1.evaluate(SystemPropertiesInvariantRule.java:69)
	at org.apache.lucene.util.LuceneTestCase$TestResultInterceptorRule$1.evaluate(LuceneTestCase.java:591)
	at org.apache.lucene.util.UncaughtExceptionsRule$1.evaluate(UncaughtExceptionsRule.java:75)
	at org.apache.lucene.util.LuceneTestCase$SaveThreadAndTestNameRule$1.evaluate(LuceneTestCase.java:642)
	at org.junit.rules.RunRules.evaluate(RunRules.java:18)
	at org.junit.runners.ParentRunner.runLeaf(ParentRunner.java:263)
	at org.junit.runners.BlockJUnit4ClassRunner.runChild(BlockJUnit4ClassRunner.java:68)
	at org.apache.lucene.util.LuceneTestCaseRunner.runChild(LuceneTestCaseRunner.java:164)
	at org.apache.lucene.util.LuceneTestCaseRunner.runChild(LuceneTestCaseRunner.java:57)
	at org.junit.runners.ParentRunner$3.run(ParentRunner.java:231)
	at org.junit.runners.ParentRunner$1.schedule(ParentRunner.java:60)
	at org.junit.runners.ParentRunner.runChildren(ParentRunner.java:229)
	at org.junit.runners.ParentRunner.access$000(ParentRunner.java:50)
	at org.junit.runners.ParentRunner$2.evaluate(ParentRunner.java:222)
	at org.junit.internal.runners.statements.RunBefores.evaluate(RunBefores.java:28)
	at org.junit.internal.runners.statements.RunAfters.evaluate(RunAfters.java:30)
	at org.apache.lucene.util.UncaughtExceptionsRule$1.evaluate(UncaughtExceptionsRule.java:75)
	at org.apache.lucene.util.StoreClassNameRule$1.evaluate(StoreClassNameRule.java:38)
	at org.apache.lucene.util.SystemPropertiesInvariantRule$1.evaluate(SystemPropertiesInvariantRule.java:69)
	at org.junit.rules.RunRules.evaluate(RunRules.java:18)
	at org.junit.runners.ParentRunner.run(ParentRunner.java:300)
	at junit.framework.JUnit4TestAdapter.run(JUnit4TestAdapter.java:39)
	at org.apache.tools.ant.taskdefs.optional.junit.JUnitTestRunner.run(JUnitTestRunner.java:420)
	at org.apache.tools.ant.taskdefs.optional.junit.JUnitTestRunner.launch(JUnitTestRunner.java:911)
	at org.apache.tools.ant.taskdefs.optional.junit.JUnitTestRunner.main(JUnitTestRunner.java:743)


FAILED:  <init>.org.apache.lucene.util.TestAttributeSource

Error Message:
org.apache.lucene.util.TestAttributeSource

Stack Trace:
java.lang.ClassNotFoundException: org.apache.lucene.util.TestAttributeSource
	at java.net.URLClassLoader$1.run(URLClassLoader.java:214)
	at java.security.AccessController.doPrivileged(Native Method)
	at java.net.URLClassLoader.findClass(URLClassLoader.java:205)
	at java.lang.ClassLoader.loadClass(ClassLoader.java:321)
	at sun.misc.Launcher$AppClassLoader.loadClass(Launcher.java:294)
	at java.lang.ClassLoader.loadClass(ClassLoader.java:266)
	at java.lang.Class.forName0(Native Method)
	at java.lang.Class.forName(Class.java:186)
	at org.apache.tools.ant.taskdefs.optional.junit.JUnitTestRunner.run(JUnitTestRunner.java:335)
	at org.apache.tools.ant.taskdefs.optional.junit.JUnitTestRunner.launch(JUnitTestRunner.java:911)
	at org.apache.tools.ant.taskdefs.optional.junit.JUnitTestRunner.main(JUnitTestRunner.java:743)
Caused by: java.io.FileNotFoundException: /usr/home/hudson/hudson-slave/workspace/Lucene-Solr-tests-only-trunk/checkout/lucene/build/core/classes/test/org/apache/lucene/util/TestAttributeSource.class (Too many open files in system)
	at java.io.FileInputStream.open(Native Method)
	at java.io.FileInputStream.<init>(FileInputStream.java:137)
	at sun.misc.URLClassPath$FileLoader$1.getInputStream(URLClassPath.java:1005)
	at sun.misc.Resource.cachedInputStream(Resource.java:77)
	at sun.misc.Resource.getByteBuffer(Resource.java:160)
	at java.net.URLClassLoader.defineClass(URLClassLoader.java:266)
	at java.net.URLClassLoader.access$000(URLClassLoader.java:73)
	at java.net.URLClassLoader$1.run(URLClassLoader.java:212)
	... 10 more


FAILED:  <init>.org.apache.lucene.util.TestBitUtil

Error Message:
org.apache.lucene.util.TestBitUtil

Stack Trace:
java.lang.ClassNotFoundException: org.apache.lucene.util.TestBitUtil
	at java.net.URLClassLoader$1.run(URLClassLoader.java:214)
	at java.security.AccessController.doPrivileged(Native Method)
	at java.net.URLClassLoader.findClass(URLClassLoader.java:205)
	at java.lang.ClassLoader.loadClass(ClassLoader.java:321)
	at sun.misc.Launcher$AppClassLoader.loadClass(Launcher.java:294)
	at java.lang.ClassLoader.loadClass(ClassLoader.java:266)
	at java.lang.Class.forName0(Native Method)
	at java.lang.Class.forName(Class.java:186)
	at org.apache.tools.ant.taskdefs.optional.junit.JUnitTestRunner.run(JUnitTestRunner.java:335)
	at org.apache.tools.ant.taskdefs.optional.junit.JUnitTestRunner.launch(JUnitTestRunner.java:911)
	at org.apache.tools.ant.taskdefs.optional.junit.JUnitTestRunner.main(JUnitTestRunner.java:743)
Caused by: java.io.FileNotFoundException: /usr/home/hudson/hudson-slave/workspace/Lucene-Solr-tests-only-trunk/checkout/lucene/build/core/classes/test/org/apache/lucene/util/TestBitUtil.class (Too many open files in system)
	at java.io.FileInputStream.open(Native Method)
	at java.io.FileInputStream.<init>(FileInputStream.java:137)
	at sun.misc.URLClassPath$FileLoader$1.getInputStream(URLClassPath.java:1005)
	at sun.misc.Resource.cachedInputStream(Resource.java:77)
	at sun.misc.Resource.getByteBuffer(Resource.java:160)
	at java.net.URLClassLoader.defineClass(URLClassLoader.java:266)
	at java.net.URLClassLoader.access$000(URLClassLoader.java:73)
	at java.net.URLClassLoader$1.run(URLClassLoader.java:212)
	... 10 more


FAILED:  <init>.org.apache.lucene.util.TestCloseableThreadLocal

Error Message:
org.apache.lucene.util.TestCloseableThreadLocal

Stack Trace:
java.lang.ClassNotFoundException: org.apache.lucene.util.TestCloseableThreadLocal
	at java.net.URLClassLoader$1.run(URLClassLoader.java:214)
	at java.security.AccessController.doPrivileged(Native Method)
	at java.net.URLClassLoader.findClass(URLClassLoader.java:205)
	at java.lang.ClassLoader.loadClass(ClassLoader.java:321)
	at sun.misc.Launcher$AppClassLoader.loadClass(Launcher.java:294)
	at java.lang.ClassLoader.loadClass(ClassLoader.java:266)
	at java.lang.Class.forName0(Native Method)
	at java.lang.Class.forName(Class.java:186)
	at org.apache.tools.ant.taskdefs.optional.junit.JUnitTestRunner.run(JUnitTestRunner.java:335)
	at org.apache.tools.ant.taskdefs.optional.junit.JUnitTestRunner.launch(JUnitTestRunner.java:911)
	at org.apache.tools.ant.taskdefs.optional.junit.JUnitTestRunner.main(JUnitTestRunner.java:743)
Caused by: java.io.FileNotFoundException: /usr/home/hudson/hudson-slave/workspace/Lucene-Solr-tests-only-trunk/checkout/lucene/build/core/classes/test/org/apache/lucene/util/TestCloseableThreadLocal.class (Too many open files in system)
	at java.io.FileInputStream.open(Native Method)
	at java.io.FileInputStream.<init>(FileInputStream.java:137)
	at sun.misc.URLClassPath$FileLoader$1.getInputStream(URLClassPath.java:1005)
	at sun.misc.Resource.cachedInputStream(Resource.java:77)
	at sun.misc.Resource.getByteBuffer(Resource.java:160)
	at java.net.URLClassLoader.defineClass(URLClassLoader.java:266)
	at java.net.URLClassLoader.access$000(URLClassLoader.java:73)
	at java.net.URLClassLoader$1.run(URLClassLoader.java:212)
	... 10 more


FAILED:  <init>.org.apache.lucene.util.TestCollectionUtil

Error Message:
org.apache.lucene.util.TestCollectionUtil

Stack Trace:
java.lang.ClassNotFoundException: org.apache.lucene.util.TestCollectionUtil
	at java.net.URLClassLoader$1.run(URLClassLoader.java:214)
	at java.security.AccessController.doPrivileged(Native Method)
	at java.net.URLClassLoader.findClass(URLClassLoader.java:205)
	at java.lang.ClassLoader.loadClass(ClassLoader.java:321)
	at sun.misc.Launcher$AppClassLoader.loadClass(Launcher.java:294)
	at java.lang.ClassLoader.loadClass(ClassLoader.java:266)
	at java.lang.Class.forName0(Native Method)
	at java.lang.Class.forName(Class.java:186)
	at org.apache.tools.ant.taskdefs.optional.junit.JUnitTestRunner.run(JUnitTestRunner.java:335)
	at org.apache.tools.ant.taskdefs.optional.junit.JUnitTestRunner.launch(JUnitTestRunner.java:911)
	at org.apache.tools.ant.taskdefs.optional.junit.JUnitTestRunner.main(JUnitTestRunner.java:743)
Caused by: java.io.FileNotFoundException: /usr/home/hudson/hudson-slave/workspace/Lucene-Solr-tests-only-trunk/checkout/lucene/build/core/classes/test/org/apache/lucene/util/TestCollectionUtil.class (Too many open files in system)
	at java.io.FileInputStream.open(Native Method)
	at java.io.FileInputStream.<init>(FileInputStream.java:137)
	at sun.misc.URLClassPath$FileLoader$1.getInputStream(URLClassPath.java:1005)
	at sun.misc.Resource.cachedInputStream(Resource.java:77)
	at sun.misc.Resource.getByteBuffer(Resource.java:160)
	at java.net.URLClassLoader.defineClass(URLClassLoader.java:266)
	at java.net.URLClassLoader.access$000(URLClassLoader.java:73)
	at java.net.URLClassLoader$1.run(URLClassLoader.java:212)
	... 10 more


FAILED:  <init>.org.apache.lucene.util.TestIndexableBinaryStringTools

Error Message:
org.apache.lucene.util.TestIndexableBinaryStringTools

Stack Trace:
java.lang.ClassNotFoundException: org.apache.lucene.util.TestIndexableBinaryStringTools
	at java.net.URLClassLoader$1.run(URLClassLoader.java:214)
	at java.security.AccessController.doPrivileged(Native Method)
	at java.net.URLClassLoader.findClass(URLClassLoader.java:205)
	at java.lang.ClassLoader.loadClass(ClassLoader.java:321)
	at sun.misc.Launcher$AppClassLoader.loadClass(Launcher.java:294)
	at java.lang.ClassLoader.loadClass(ClassLoader.java:266)
	at java.lang.Class.forName0(Native Method)
	at java.lang.Class.forName(Class.java:186)
	at org.apache.tools.ant.taskdefs.optional.junit.JUnitTestRunner.run(JUnitTestRunner.java:335)
	at org.apache.tools.ant.taskdefs.optional.junit.JUnitTestRunner.launch(JUnitTestRunner.java:911)
	at org.apache.tools.ant.taskdefs.optional.junit.JUnitTestRunner.main(JUnitTestRunner.java:743)
Caused by: java.io.FileNotFoundException: /usr/home/hudson/hudson-slave/workspace/Lucene-Solr-tests-only-trunk/checkout/lucene/build/core/classes/test/org/apache/lucene/util/TestIndexableBinaryStringTools.class (Too many open files in system)
	at java.io.FileInputStream.open(Native Method)
	at java.io.FileInputStream.<init>(FileInputStream.java:137)
	at sun.misc.URLClassPath$FileLoader$1.getInputStream(URLClassPath.java:1005)
	at sun.misc.Resource.cachedInputStream(Resource.java:77)
	at sun.misc.Resource.getByteBuffer(Resource.java:160)
	at java.net.URLClassLoader.defineClass(URLClassLoader.java:266)
	at java.net.URLClassLoader.access$000(URLClassLoader.java:73)
	at java.net.URLClassLoader$1.run(URLClassLoader.java:212)
	... 10 more


FAILED:  <init>.org.apache.lucene.util.TestPagedBytes

Error Message:
org.apache.lucene.util.TestPagedBytes

Stack Trace:
java.lang.ClassNotFoundException: org.apache.lucene.util.TestPagedBytes
	at java.net.URLClassLoader$1.run(URLClassLoader.java:214)
	at java.security.AccessController.doPrivileged(Native Method)
	at java.net.URLClassLoader.findClass(URLClassLoader.java:205)
	at java.lang.ClassLoader.loadClass(ClassLoader.java:321)
	at sun.misc.Launcher$AppClassLoader.loadClass(Launcher.java:294)
	at java.lang.ClassLoader.loadClass(ClassLoader.java:266)
	at java.lang.Class.forName0(Native Method)
	at java.lang.Class.forName(Class.java:186)
	at org.apache.tools.ant.taskdefs.optional.junit.JUnitTestRunner.run(JUnitTestRunner.java:335)
	at org.apache.tools.ant.taskdefs.optional.junit.JUnitTestRunner.launch(JUnitTestRunner.java:911)
	at org.apache.tools.ant.taskdefs.optional.junit.JUnitTestRunner.main(JUnitTestRunner.java:743)
Caused by: java.io.FileNotFoundException: /usr/home/hudson/hudson-slave/workspace/Lucene-Solr-tests-only-trunk/checkout/lucene/build/core/classes/test/org/apache/lucene/util/TestPagedBytes.class (Too many open files in system)
	at java.io.FileInputStream.open(Native Method)
	at java.io.FileInputStream.<init>(FileInputStream.java:137)
	at sun.misc.URLClassPath$FileLoader$1.getInputStream(URLClassPath.java:1005)
	at sun.misc.Resource.cachedInputStream(Resource.java:77)
	at sun.misc.Resource.getByteBuffer(Resource.java:160)
	at java.net.URLClassLoader.defineClass(URLClassLoader.java:266)
	at java.net.URLClassLoader.access$000(URLClassLoader.java:73)
	at java.net.URLClassLoader$1.run(URLClassLoader.java:212)
	... 10 more


FAILED:  <init>.org.apache.lucene.util.TestRecyclingByteBlockAllocator

Error Message:
org.apache.lucene.util.TestRecyclingByteBlockAllocator

Stack Trace:
java.lang.ClassNotFoundException: org.apache.lucene.util.TestRecyclingByteBlockAllocator
	at java.net.URLClassLoader$1.run(URLClassLoader.java:214)
	at java.security.AccessController.doPrivileged(Native Method)
	at java.net.URLClassLoader.findClass(URLClassLoader.java:205)
	at java.lang.ClassLoader.loadClass(ClassLoader.java:321)
	at sun.misc.Launcher$AppClassLoader.loadClass(Launcher.java:294)
	at java.lang.ClassLoader.loadClass(ClassLoader.java:266)
	at java.lang.Class.forName0(Native Method)
	at java.lang.Class.forName(Class.java:186)
	at org.apache.tools.ant.taskdefs.optional.junit.JUnitTestRunner.run(JUnitTestRunner.java:335)
	at org.apache.tools.ant.taskdefs.optional.junit.JUnitTestRunner.launch(JUnitTestRunner.java:911)
	at org.apache.tools.ant.taskdefs.optional.junit.JUnitTestRunner.main(JUnitTestRunner.java:743)
Caused by: java.io.FileNotFoundException: /usr/home/hudson/hudson-slave/workspace/Lucene-Solr-tests-only-trunk/checkout/lucene/build/core/classes/test/org/apache/lucene/util/TestRecyclingByteBlockAllocator.class (Too many open files in system)
	at java.io.FileInputStream.open(Native Method)
	at java.io.FileInputStream.<init>(FileInputStream.java:137)
	at sun.misc.URLClassPath$FileLoader$1.getInputStream(URLClassPath.java:1005)
	at sun.misc.Resource.cachedInputStream(Resource.java:77)
	at sun.misc.Resource.getByteBuffer(Resource.java:160)
	at java.net.URLClassLoader.defineClass(URLClassLoader.java:266)
	at java.net.URLClassLoader.access$000(URLClassLoader.java:73)
	at java.net.URLClassLoader$1.run(URLClassLoader.java:212)
	... 10 more


FAILED:  <init>.org.apache.lucene.util.TestSentinelIntSet

Error Message:
org.apache.lucene.util.TestSentinelIntSet

Stack Trace:
java.lang.ClassNotFoundException: org.apache.lucene.util.TestSentinelIntSet
	at java.net.URLClassLoader$1.run(URLClassLoader.java:214)
	at java.security.AccessController.doPrivileged(Native Method)
	at java.net.URLClassLoader.findClass(URLClassLoader.java:205)
	at java.lang.ClassLoader.loadClass(ClassLoader.java:321)
	at sun.misc.Launcher$AppClassLoader.loadClass(Launcher.java:294)
	at java.lang.ClassLoader.loadClass(ClassLoader.java:266)
	at java.lang.Class.forName0(Native Method)
	at java.lang.Class.forName(Class.java:186)
	at org.apache.tools.ant.taskdefs.optional.junit.JUnitTestRunner.run(JUnitTestRunner.java:335)
	at org.apache.tools.ant.taskdefs.optional.junit.JUnitTestRunner.launch(JUnitTestRunner.java:911)
	at org.apache.tools.ant.taskdefs.optional.junit.JUnitTestRunner.main(JUnitTestRunner.java:743)
Caused by: java.io.FileNotFoundException: /usr/home/hudson/hudson-slave/workspace/Lucene-Solr-tests-only-trunk/checkout/lucene/build/core/classes/test/org/apache/lucene/util/TestSentinelIntSet.class (Too many open files in system)
	at java.io.FileInputStream.open(Native Method)
	at java.io.FileInputStream.<init>(FileInputStream.java:137)
	at sun.misc.URLClassPath$FileLoader$1.getInputStream(URLClassPath.java:1005)
	at sun.misc.Resource.cachedInputStream(Resource.java:77)
	at sun.misc.Resource.getByteBuffer(Resource.java:160)
	at java.net.URLClassLoader.defineClass(URLClassLoader.java:266)
	at java.net.URLClassLoader.access$000(URLClassLoader.java:73)
	at java.net.URLClassLoader$1.run(URLClassLoader.java:212)
	... 10 more


FAILED:  <init>.org.apache.lucene.util.TestTwoPhaseCommitTool

Error Message:
org.apache.lucene.util.TestTwoPhaseCommitTool

Stack Trace:
java.lang.ClassNotFoundException: org.apache.lucene.util.TestTwoPhaseCommitTool
	at java.net.URLClassLoader$1.run(URLClassLoader.java:214)
	at java.security.AccessController.doPrivileged(Native Method)
	at java.net.URLClassLoader.findClass(URLClassLoader.java:205)
	at java.lang.ClassLoader.loadClass(ClassLoader.java:321)
	at sun.misc.Launcher$AppClassLoader.loadClass(Launcher.java:294)
	at java.lang.ClassLoader.loadClass(ClassLoader.java:266)
	at java.lang.Class.forName0(Native Method)
	at java.lang.Class.forName(Class.java:186)
	at org.apache.tools.ant.taskdefs.optional.junit.JUnitTestRunner.run(JUnitTestRunner.java:335)
	at org.apache.tools.ant.taskdefs.optional.junit.JUnitTestRunner.launch(JUnitTestRunner.java:911)
	at org.apache.tools.ant.taskdefs.optional.junit.JUnitTestRunner.main(JUnitTestRunner.java:743)
Caused by: java.io.FileNotFoundException: /usr/home/hudson/hudson-slave/workspace/Lucene-Solr-tests-only-trunk/checkout/lucene/build/core/classes/test/org/apache/lucene/util/TestTwoPhaseCommitTool.class (Too many open files in system)
	at java.io.FileInputStream.open(Native Method)
	at java.io.FileInputStream.<init>(FileInputStream.java:137)
	at sun.misc.URLClassPath$FileLoader$1.getInputStream(URLClassPath.java:1005)
	at sun.misc.Resource.cachedInputStream(Resource.java:77)
	at sun.misc.Resource.getByteBuffer(Resource.java:160)
	at java.net.URLClassLoader.defineClass(URLClassLoader.java:266)
	at java.net.URLClassLoader.access$000(URLClassLoader.java:73)
	at java.net.URLClassLoader$1.run(URLClassLoader.java:212)
	... 10 more


REGRESSION:  org.apache.lucene.util.fst.TestFSTs.testRealTerms

Error Message:
/usr/home/hudson/hudson-slave/workspace/Lucene-Solr-tests-only-trunk/checkout/lucene/build/core/test/1/fstlines3457334682tmp/_0_0.tim (Too many open files in system)

Stack Trace:
java.io.FileNotFoundException: /usr/home/hudson/hudson-slave/workspace/Lucene-Solr-tests-only-trunk/checkout/lucene/build/core/test/1/fstlines3457334682tmp/_0_0.tim (Too many open files in system)
	at java.io.RandomAccessFile.open(Native Method)
	at java.io.RandomAccessFile.<init>(RandomAccessFile.java:233)
	at org.apache.lucene.store.FSDirectory$FSIndexOutput.<init>(FSDirectory.java:449)
	at org.apache.lucene.store.FSDirectory.createOutput(FSDirectory.java:288)
	at org.apache.lucene.store.MockDirectoryWrapper.createOutput(MockDirectoryWrapper.java:450)
	at org.apache.lucene.codecs.BlockTreeTermsWriter.<init>(BlockTreeTermsWriter.java:149)
	at org.apache.lucene.codecs.nestedpulsing.NestedPulsingPostingsFormat.fieldsConsumer(NestedPulsingPostingsFormat.java:60)
	at org.apache.lucene.codecs.perfield.PerFieldPostingsFormat$FieldsWriter.addField(PerFieldPostingsFormat.java:126)
	at org.apache.lucene.index.FreqProxTermsWriterPerField.flush(FreqProxTermsWriterPerField.java:322)
	at org.apache.lucene.index.FreqProxTermsWriter.flush(FreqProxTermsWriter.java:92)
	at org.apache.lucene.index.TermsHash.flush(TermsHash.java:117)
	at org.apache.lucene.index.DocInverter.flush(DocInverter.java:53)
	at org.apache.lucene.index.DocFieldProcessor.flush(DocFieldProcessor.java:81)
	at org.apache.lucene.index.DocumentsWriterPerThread.flush(DocumentsWriterPerThread.java:475)
	at org.apache.lucene.index.DocumentsWriter.doFlush(DocumentsWriter.java:422)
	at org.apache.lucene.index.DocumentsWriter.flushAllThreads(DocumentsWriter.java:553)
	at org.apache.lucene.index.IndexWriter.getReader(IndexWriter.java:353)
	at org.apache.lucene.index.DirectoryReader.open(DirectoryReader.java:107)
	at org.apache.lucene.index.IndexReader.open(IndexReader.java:337)
	at org.apache.lucene.util.fst.TestFSTs.testRealTerms(TestFSTs.java:1112)
	at sun.reflect.NativeMethodAccessorImpl.invoke0(Native Method)
	at sun.reflect.NativeMethodAccessorImpl.invoke(NativeMethodAccessorImpl.java:57)
	at sun.reflect.DelegatingMethodAccessorImpl.invoke(DelegatingMethodAccessorImpl.java:43)
	at java.lang.reflect.Method.invoke(Method.java:616)
	at org.junit.runners.model.FrameworkMethod$1.runReflectiveCall(FrameworkMethod.java:45)
	at org.junit.internal.runners.model.ReflectiveCallable.run(ReflectiveCallable.java:15)
	at org.junit.runners.model.FrameworkMethod.invokeExplosively(FrameworkMethod.java:42)
	at org.junit.internal.runners.statements.InvokeMethod.evaluate(InvokeMethod.java:20)
	at org.junit.internal.runners.statements.RunBefores.evaluate(RunBefores.java:28)
	at org.junit.internal.runners.statements.RunAfters.evaluate(RunAfters.java:30)
	at org.apache.lucene.util.LuceneTestCase$SubclassSetupTeardownRule$1.evaluate(LuceneTestCase.java:754)
	at org.apache.lucene.util.LuceneTestCase$InternalSetupTeardownRule$1.evaluate(LuceneTestCase.java:670)
	at org.apache.lucene.util.SystemPropertiesInvariantRule$1.evaluate(SystemPropertiesInvariantRule.java:69)
	at org.apache.lucene.util.LuceneTestCase$TestResultInterceptorRule$1.evaluate(LuceneTestCase.java:591)
	at org.apache.lucene.util.UncaughtExceptionsRule$1.evaluate(UncaughtExceptionsRule.java:75)
	at org.apache.lucene.util.LuceneTestCase$SaveThreadAndTestNameRule$1.evaluate(LuceneTestCase.java:642)
	at org.junit.rules.RunRules.evaluate(RunRules.java:18)
	at org.junit.runners.ParentRunner.runLeaf(ParentRunner.java:263)
	at org.junit.runners.BlockJUnit4ClassRunner.runChild(BlockJUnit4ClassRunner.java:68)
	at org.apache.lucene.util.LuceneTestCaseRunner.runChild(LuceneTestCaseRunner.java:164)
	at org.apache.lucene.util.LuceneTestCaseRunner.runChild(LuceneTestCaseRunner.java:57)
	at org.junit.runners.ParentRunner$3.run(ParentRunner.java:231)
	at org.junit.runners.ParentRunner$1.schedule(ParentRunner.java:60)
	at org.junit.runners.ParentRunner.runChildren(ParentRunner.java:229)
	at org.junit.runners.ParentRunner.access$000(ParentRunner.java:50)
	at org.junit.runners.ParentRunner$2.evaluate(ParentRunner.java:222)
	at org.junit.internal.runners.statements.RunBefores.evaluate(RunBefores.java:28)
	at org.junit.internal.runners.statements.RunAfters.evaluate(RunAfters.java:30)
	at org.apache.lucene.util.UncaughtExceptionsRule$1.evaluate(UncaughtExceptionsRule.java:75)
	at org.apache.lucene.util.StoreClassNameRule$1.evaluate(StoreClassNameRule.java:38)
	at org.apache.lucene.util.SystemPropertiesInvariantRule$1.evaluate(SystemPropertiesInvariantRule.java:69)
	at org.junit.rules.RunRules.evaluate(RunRules.java:18)
	at org.junit.runners.ParentRunner.run(ParentRunner.java:300)
	at junit.framework.JUnit4TestAdapter.run(JUnit4TestAdapter.java:39)
	at org.apache.tools.ant.taskdefs.optional.junit.JUnitTestRunner.run(JUnitTestRunner.java:420)
	at org.apache.tools.ant.taskdefs.optional.junit.JUnitTestRunner.launch(JUnitTestRunner.java:911)
	at org.apache.tools.ant.taskdefs.optional.junit.JUnitTestRunner.main(JUnitTestRunner.java:743)




Build Log (for compile errors):
[...truncated 4757 lines...]



Mime
View raw message