lucene-dev mailing list archives

Site index · List index
Message view « Date » · « Thread »
Top « Date » · « Thread »
From Apache Jenkins Server <jenk...@builds.apache.org>
Subject [JENKINS] Lucene-Solr-tests-only-trunk - Build # 13203 - Still Failing
Date Mon, 16 Apr 2012 16:13:56 GMT
Build: https://builds.apache.org/job/Lucene-Solr-tests-only-trunk/13203/

23 tests failed.
REGRESSION:  org.apache.lucene.TestSearchForDuplicates.testRun

Error Message:
/usr/home/hudson/hudson-slave/workspace/Lucene-Solr-tests-only-trunk/checkout/lucene/build/core/test/S1/index2077220819tmp/_0_0.pyl (Too many open files in system)

Stack Trace:
java.io.FileNotFoundException: /usr/home/hudson/hudson-slave/workspace/Lucene-Solr-tests-only-trunk/checkout/lucene/build/core/test/S1/index2077220819tmp/_0_0.pyl (Too many open files in system)
	at __randomizedtesting.SeedInfo.seed([46D52DA72AB672EF:E4958614661E0843]:0)
	at java.io.RandomAccessFile.open(Native Method)
	at java.io.RandomAccessFile.<init>(RandomAccessFile.java:233)
	at org.apache.lucene.store.FSDirectory$FSIndexOutput.<init>(FSDirectory.java:449)
	at org.apache.lucene.store.FSDirectory.createOutput(FSDirectory.java:288)
	at org.apache.lucene.store.MockDirectoryWrapper.createOutput(MockDirectoryWrapper.java:450)
	at org.apache.lucene.codecs.sep.SepPostingsWriter.<init>(SepPostingsWriter.java:135)
	at org.apache.lucene.codecs.sep.SepPostingsWriter.<init>(SepPostingsWriter.java:105)
	at org.apache.lucene.codecs.mocksep.MockSepPostingsFormat.fieldsConsumer(MockSepPostingsFormat.java:57)
	at org.apache.lucene.codecs.perfield.PerFieldPostingsFormat$FieldsWriter.addField(PerFieldPostingsFormat.java:126)
	at org.apache.lucene.index.FreqProxTermsWriterPerField.flush(FreqProxTermsWriterPerField.java:322)
	at org.apache.lucene.index.FreqProxTermsWriter.flush(FreqProxTermsWriter.java:92)
	at org.apache.lucene.index.TermsHash.flush(TermsHash.java:117)
	at org.apache.lucene.index.DocInverter.flush(DocInverter.java:53)
	at org.apache.lucene.index.DocFieldProcessor.flush(DocFieldProcessor.java:81)
	at org.apache.lucene.index.DocumentsWriterPerThread.flush(DocumentsWriterPerThread.java:475)
	at org.apache.lucene.index.DocumentsWriter.doFlush(DocumentsWriter.java:422)
	at org.apache.lucene.index.DocumentsWriter.flushAllThreads(DocumentsWriter.java:553)
	at org.apache.lucene.index.IndexWriter.doFlush(IndexWriter.java:2640)
	at org.apache.lucene.index.IndexWriter.flush(IndexWriter.java:2616)
	at org.apache.lucene.index.IndexWriter.closeInternal(IndexWriter.java:851)
	at org.apache.lucene.index.IndexWriter.close(IndexWriter.java:810)
	at org.apache.lucene.index.IndexWriter.close(IndexWriter.java:774)
	at org.apache.lucene.TestSearchForDuplicates.doTest(TestSearchForDuplicates.java:89)
	at org.apache.lucene.TestSearchForDuplicates.testRun(TestSearchForDuplicates.java:53)
	at sun.reflect.NativeMethodAccessorImpl.invoke0(Native Method)
	at sun.reflect.NativeMethodAccessorImpl.invoke(NativeMethodAccessorImpl.java:57)
	at sun.reflect.DelegatingMethodAccessorImpl.invoke(DelegatingMethodAccessorImpl.java:43)
	at java.lang.reflect.Method.invoke(Method.java:616)
	at com.carrotsearch.randomizedtesting.RandomizedRunner.invoke(RandomizedRunner.java:1844)
	at com.carrotsearch.randomizedtesting.RandomizedRunner.access$1000(RandomizedRunner.java:142)
	at com.carrotsearch.randomizedtesting.RandomizedRunner$6.evaluate(RandomizedRunner.java:748)
	at com.carrotsearch.randomizedtesting.RandomizedRunner$7.evaluate(RandomizedRunner.java:809)
	at com.carrotsearch.randomizedtesting.RandomizedRunner$8.evaluate(RandomizedRunner.java:823)
	at org.apache.lucene.util.LuceneTestCase$SubclassSetupTeardownRule$1.evaluate(LuceneTestCase.java:758)
	at org.apache.lucene.util.LuceneTestCase$InternalSetupTeardownRule$1.evaluate(LuceneTestCase.java:680)
	at org.apache.lucene.util.SystemPropertiesInvariantRule$1.evaluate(SystemPropertiesInvariantRule.java:69)
	at org.apache.lucene.util.LuceneTestCase$TestResultInterceptorRule$1.evaluate(LuceneTestCase.java:613)
	at org.apache.lucene.util.UncaughtExceptionsRule$1.evaluate(UncaughtExceptionsRule.java:75)
	at org.apache.lucene.util.LuceneTestCase$SaveThreadAndTestNameRule$1.evaluate(LuceneTestCase.java:652)
	at com.carrotsearch.randomizedtesting.RandomizedRunner.runSingleTest(RandomizedRunner.java:755)
	at com.carrotsearch.randomizedtesting.RandomizedRunner.access$600(RandomizedRunner.java:142)
	at com.carrotsearch.randomizedtesting.RandomizedRunner$3$1.run(RandomizedRunner.java:606)
	at com.carrotsearch.randomizedtesting.RandomizedRunner$3.evaluate(RandomizedRunner.java:625)
	at com.carrotsearch.randomizedtesting.RandomizedRunner$4.evaluate(RandomizedRunner.java:661)
	at com.carrotsearch.randomizedtesting.RandomizedRunner$5.evaluate(RandomizedRunner.java:672)
	at org.apache.lucene.util.UncaughtExceptionsRule$1.evaluate(UncaughtExceptionsRule.java:75)
	at org.apache.lucene.util.StoreClassNameRule$1.evaluate(StoreClassNameRule.java:38)
	at org.apache.lucene.util.SystemPropertiesInvariantRule$1.evaluate(SystemPropertiesInvariantRule.java:69)
	at com.carrotsearch.randomizedtesting.RandomizedRunner.runSuite(RandomizedRunner.java:553)
	at com.carrotsearch.randomizedtesting.RandomizedRunner.access$400(RandomizedRunner.java:142)
	at com.carrotsearch.randomizedtesting.RandomizedRunner$2.run(RandomizedRunner.java:499)


REGRESSION:  org.apache.lucene.analysis.TestLookaheadTokenFilter.testNeverCallingPeek

Error Message:
some thread(s) failed

Stack Trace:
java.lang.RuntimeException: some thread(s) failed
	at __randomizedtesting.SeedInfo.seed([46D52DA72AB672EF:B5309AC0C8E52610]:0)
	at org.apache.lucene.analysis.BaseTokenStreamTestCase.checkRandomData(BaseTokenStreamTestCase.java:450)
	at org.apache.lucene.analysis.BaseTokenStreamTestCase.checkRandomData(BaseTokenStreamTestCase.java:372)
	at org.apache.lucene.analysis.TestLookaheadTokenFilter.testNeverCallingPeek(TestLookaheadTokenFilter.java:66)
	at sun.reflect.NativeMethodAccessorImpl.invoke0(Native Method)
	at sun.reflect.NativeMethodAccessorImpl.invoke(NativeMethodAccessorImpl.java:57)
	at sun.reflect.DelegatingMethodAccessorImpl.invoke(DelegatingMethodAccessorImpl.java:43)
	at java.lang.reflect.Method.invoke(Method.java:616)
	at com.carrotsearch.randomizedtesting.RandomizedRunner.invoke(RandomizedRunner.java:1844)
	at com.carrotsearch.randomizedtesting.RandomizedRunner.access$1000(RandomizedRunner.java:142)
	at com.carrotsearch.randomizedtesting.RandomizedRunner$6.evaluate(RandomizedRunner.java:748)
	at com.carrotsearch.randomizedtesting.RandomizedRunner$7.evaluate(RandomizedRunner.java:809)
	at com.carrotsearch.randomizedtesting.RandomizedRunner$8.evaluate(RandomizedRunner.java:823)
	at org.apache.lucene.util.LuceneTestCase$SubclassSetupTeardownRule$1.evaluate(LuceneTestCase.java:758)
	at org.apache.lucene.util.LuceneTestCase$InternalSetupTeardownRule$1.evaluate(LuceneTestCase.java:680)
	at org.apache.lucene.util.SystemPropertiesInvariantRule$1.evaluate(SystemPropertiesInvariantRule.java:69)
	at org.apache.lucene.util.LuceneTestCase$TestResultInterceptorRule$1.evaluate(LuceneTestCase.java:613)
	at org.apache.lucene.util.UncaughtExceptionsRule$1.evaluate(UncaughtExceptionsRule.java:75)
	at org.apache.lucene.util.LuceneTestCase$SaveThreadAndTestNameRule$1.evaluate(LuceneTestCase.java:652)
	at com.carrotsearch.randomizedtesting.RandomizedRunner.runSingleTest(RandomizedRunner.java:755)
	at com.carrotsearch.randomizedtesting.RandomizedRunner.access$600(RandomizedRunner.java:142)
	at com.carrotsearch.randomizedtesting.RandomizedRunner$3$1.run(RandomizedRunner.java:606)
	at com.carrotsearch.randomizedtesting.RandomizedRunner$3.evaluate(RandomizedRunner.java:625)
	at com.carrotsearch.randomizedtesting.RandomizedRunner$4.evaluate(RandomizedRunner.java:661)
	at com.carrotsearch.randomizedtesting.RandomizedRunner$5.evaluate(RandomizedRunner.java:672)
	at org.apache.lucene.util.UncaughtExceptionsRule$1.evaluate(UncaughtExceptionsRule.java:75)
	at org.apache.lucene.util.StoreClassNameRule$1.evaluate(StoreClassNameRule.java:38)
	at org.apache.lucene.util.SystemPropertiesInvariantRule$1.evaluate(SystemPropertiesInvariantRule.java:69)
	at com.carrotsearch.randomizedtesting.RandomizedRunner.runSuite(RandomizedRunner.java:553)
	at com.carrotsearch.randomizedtesting.RandomizedRunner.access$400(RandomizedRunner.java:142)
	at com.carrotsearch.randomizedtesting.RandomizedRunner$2.run(RandomizedRunner.java:499)


FAILED:  junit.framework.TestSuite.org.apache.lucene.analysis.TestMockCharFilter

Error Message:
org.apache.lucene.analysis.TestMockCharFilter

Stack Trace:
java.lang.ClassNotFoundException: org.apache.lucene.analysis.TestMockCharFilter
	at java.net.URLClassLoader$1.run(URLClassLoader.java:214)
	at java.security.AccessController.doPrivileged(Native Method)
	at java.net.URLClassLoader.findClass(URLClassLoader.java:205)
	at java.lang.ClassLoader.loadClass(ClassLoader.java:321)
	at sun.misc.Launcher$AppClassLoader.loadClass(Launcher.java:294)
	at java.lang.ClassLoader.loadClass(ClassLoader.java:266)
	at java.lang.Class.forName0(Native Method)
	at java.lang.Class.forName(Class.java:264)
	at com.carrotsearch.ant.tasks.junit4.slave.SlaveMain.instantiate(SlaveMain.java:143)
	at com.carrotsearch.ant.tasks.junit4.slave.SlaveMain.execute(SlaveMain.java:121)
	at com.carrotsearch.ant.tasks.junit4.slave.SlaveMain.main(SlaveMain.java:202)
	at com.carrotsearch.ant.tasks.junit4.slave.SlaveMainSafe.main(SlaveMainSafe.java:12)
Caused by: java.io.FileNotFoundException: /usr/home/hudson/hudson-slave/workspace/Lucene-Solr-tests-only-trunk/checkout/lucene/build/core/classes/test/org/apache/lucene/analysis/TestMockCharFilter.class (Too many open files in system)
	at java.io.FileInputStream.open(Native Method)
	at java.io.FileInputStream.<init>(FileInputStream.java:137)
	at sun.misc.URLClassPath$FileLoader$1.getInputStream(URLClassPath.java:1005)
	at sun.misc.Resource.cachedInputStream(Resource.java:77)
	at sun.misc.Resource.getByteBuffer(Resource.java:160)
	at java.net.URLClassLoader.defineClass(URLClassLoader.java:266)
	at java.net.URLClassLoader.access$000(URLClassLoader.java:73)
	at java.net.URLClassLoader$1.run(URLClassLoader.java:212)
	... 11 more


REGRESSION:  org.apache.lucene.index.TestAddIndexes.testMoreMerges

Error Message:
/usr/home/hudson/hudson-slave/workspace/Lucene-Solr-tests-only-trunk/checkout/lucene/build/core/test/S3/index7495874965tmp/_1_0.pyl (Too many open files in system)

Stack Trace:
java.io.FileNotFoundException: /usr/home/hudson/hudson-slave/workspace/Lucene-Solr-tests-only-trunk/checkout/lucene/build/core/test/S3/index7495874965tmp/_1_0.pyl (Too many open files in system)
	at __randomizedtesting.SeedInfo.seed([46D52DA72AB672EF:4092476C7FC3DF2]:0)
	at java.io.RandomAccessFile.open(Native Method)
	at java.io.RandomAccessFile.<init>(RandomAccessFile.java:233)
	at org.apache.lucene.store.SimpleFSDirectory$SimpleFSIndexInput$Descriptor.<init>(SimpleFSDirectory.java:98)
	at org.apache.lucene.store.SimpleFSDirectory$SimpleFSIndexInput.<init>(SimpleFSDirectory.java:121)
	at org.apache.lucene.store.NIOFSDirectory$NIOFSIndexInput.<init>(NIOFSDirectory.java:116)
	at org.apache.lucene.store.NIOFSDirectory.openInput(NIOFSDirectory.java:81)
	at org.apache.lucene.store.MockDirectoryWrapper.openInput(MockDirectoryWrapper.java:503)
	at org.apache.lucene.codecs.sep.SepPostingsReader.<init>(SepPostingsReader.java:79)
	at org.apache.lucene.codecs.mockintblock.MockFixedIntBlockPostingsFormat.fieldsProducer(MockFixedIntBlockPostingsFormat.java:159)
	at org.apache.lucene.codecs.perfield.PerFieldPostingsFormat$FieldsReader$1.visitOneFormat(PerFieldPostingsFormat.java:197)
	at org.apache.lucene.codecs.perfield.PerFieldPostingsFormat$VisitPerFieldFile.<init>(PerFieldPostingsFormat.java:288)
	at org.apache.lucene.codecs.perfield.PerFieldPostingsFormat$FieldsReader$1.<init>(PerFieldPostingsFormat.java:194)
	at org.apache.lucene.codecs.perfield.PerFieldPostingsFormat$FieldsReader.<init>(PerFieldPostingsFormat.java:194)
	at org.apache.lucene.codecs.perfield.PerFieldPostingsFormat.fieldsProducer(PerFieldPostingsFormat.java:264)
	at org.apache.lucene.index.SegmentCoreReaders.<init>(SegmentCoreReaders.java:108)
	at org.apache.lucene.index.SegmentReader.<init>(SegmentReader.java:55)
	at org.apache.lucene.index.StandardDirectoryReader$1.doBody(StandardDirectoryReader.java:62)
	at org.apache.lucene.index.SegmentInfos$FindSegmentsFile.run(SegmentInfos.java:629)
	at org.apache.lucene.index.StandardDirectoryReader.open(StandardDirectoryReader.java:52)
	at org.apache.lucene.index.DirectoryReader.open(DirectoryReader.java:64)
	at org.apache.lucene.index.IndexReader.open(IndexReader.java:290)
	at org.apache.lucene.index.TestAddIndexes.testMoreMerges(TestAddIndexes.java:499)
	at sun.reflect.NativeMethodAccessorImpl.invoke0(Native Method)
	at sun.reflect.NativeMethodAccessorImpl.invoke(NativeMethodAccessorImpl.java:57)
	at sun.reflect.DelegatingMethodAccessorImpl.invoke(DelegatingMethodAccessorImpl.java:43)
	at java.lang.reflect.Method.invoke(Method.java:616)
	at com.carrotsearch.randomizedtesting.RandomizedRunner.invoke(RandomizedRunner.java:1844)
	at com.carrotsearch.randomizedtesting.RandomizedRunner.access$1000(RandomizedRunner.java:142)
	at com.carrotsearch.randomizedtesting.RandomizedRunner$6.evaluate(RandomizedRunner.java:748)
	at com.carrotsearch.randomizedtesting.RandomizedRunner$7.evaluate(RandomizedRunner.java:809)
	at com.carrotsearch.randomizedtesting.RandomizedRunner$8.evaluate(RandomizedRunner.java:823)
	at org.apache.lucene.util.LuceneTestCase$SubclassSetupTeardownRule$1.evaluate(LuceneTestCase.java:758)
	at org.apache.lucene.util.LuceneTestCase$InternalSetupTeardownRule$1.evaluate(LuceneTestCase.java:680)
	at org.apache.lucene.util.SystemPropertiesInvariantRule$1.evaluate(SystemPropertiesInvariantRule.java:69)
	at org.apache.lucene.util.LuceneTestCase$TestResultInterceptorRule$1.evaluate(LuceneTestCase.java:613)
	at org.apache.lucene.util.UncaughtExceptionsRule$1.evaluate(UncaughtExceptionsRule.java:75)
	at org.apache.lucene.util.LuceneTestCase$SaveThreadAndTestNameRule$1.evaluate(LuceneTestCase.java:652)
	at com.carrotsearch.randomizedtesting.RandomizedRunner.runSingleTest(RandomizedRunner.java:755)
	at com.carrotsearch.randomizedtesting.RandomizedRunner.access$600(RandomizedRunner.java:142)
	at com.carrotsearch.randomizedtesting.RandomizedRunner$3$1.run(RandomizedRunner.java:606)
	at com.carrotsearch.randomizedtesting.RandomizedRunner$3.evaluate(RandomizedRunner.java:625)
	at com.carrotsearch.randomizedtesting.RandomizedRunner$4.evaluate(RandomizedRunner.java:661)
	at com.carrotsearch.randomizedtesting.RandomizedRunner$5.evaluate(RandomizedRunner.java:672)
	at org.apache.lucene.util.UncaughtExceptionsRule$1.evaluate(UncaughtExceptionsRule.java:75)
	at org.apache.lucene.util.StoreClassNameRule$1.evaluate(StoreClassNameRule.java:38)
	at org.apache.lucene.util.SystemPropertiesInvariantRule$1.evaluate(SystemPropertiesInvariantRule.java:69)
	at com.carrotsearch.randomizedtesting.RandomizedRunner.runSuite(RandomizedRunner.java:553)
	at com.carrotsearch.randomizedtesting.RandomizedRunner.access$400(RandomizedRunner.java:142)
	at com.carrotsearch.randomizedtesting.RandomizedRunner$2.run(RandomizedRunner.java:499)


REGRESSION:  org.apache.lucene.index.TestAddIndexes.testMergeAfterCopy

Error Message:
/usr/home/hudson/hudson-slave/workspace/Lucene-Solr-tests-only-trunk/checkout/lucene/build/core/test/S3/index7495874966tmp/_0_1.pyl (Too many open files in system)

Stack Trace:
java.io.FileNotFoundException: /usr/home/hudson/hudson-slave/workspace/Lucene-Solr-tests-only-trunk/checkout/lucene/build/core/test/S3/index7495874966tmp/_0_1.pyl (Too many open files in system)
	at __randomizedtesting.SeedInfo.seed([46D52DA72AB672EF:E832A8A234EBA6B]:0)
	at java.io.RandomAccessFile.open(Native Method)
	at java.io.RandomAccessFile.<init>(RandomAccessFile.java:233)
	at org.apache.lucene.store.FSDirectory$FSIndexOutput.<init>(FSDirectory.java:449)
	at org.apache.lucene.store.FSDirectory.createOutput(FSDirectory.java:288)
	at org.apache.lucene.store.MockDirectoryWrapper.createOutput(MockDirectoryWrapper.java:450)
	at org.apache.lucene.codecs.sep.SepPostingsWriter.<init>(SepPostingsWriter.java:135)
	at org.apache.lucene.codecs.sep.SepPostingsWriter.<init>(SepPostingsWriter.java:105)
	at org.apache.lucene.codecs.mocksep.MockSepPostingsFormat.fieldsConsumer(MockSepPostingsFormat.java:57)
	at org.apache.lucene.codecs.perfield.PerFieldPostingsFormat$FieldsWriter.addField(PerFieldPostingsFormat.java:126)
	at org.apache.lucene.index.FreqProxTermsWriterPerField.flush(FreqProxTermsWriterPerField.java:322)
	at org.apache.lucene.index.FreqProxTermsWriter.flush(FreqProxTermsWriter.java:92)
	at org.apache.lucene.index.TermsHash.flush(TermsHash.java:117)
	at org.apache.lucene.index.DocInverter.flush(DocInverter.java:53)
	at org.apache.lucene.index.DocFieldProcessor.flush(DocFieldProcessor.java:81)
	at org.apache.lucene.index.DocumentsWriterPerThread.flush(DocumentsWriterPerThread.java:475)
	at org.apache.lucene.index.DocumentsWriter.doFlush(DocumentsWriter.java:422)
	at org.apache.lucene.index.DocumentsWriter.flushAllThreads(DocumentsWriter.java:553)
	at org.apache.lucene.index.IndexWriter.doFlush(IndexWriter.java:2640)
	at org.apache.lucene.index.IndexWriter.flush(IndexWriter.java:2616)
	at org.apache.lucene.index.IndexWriter.closeInternal(IndexWriter.java:851)
	at org.apache.lucene.index.IndexWriter.close(IndexWriter.java:810)
	at org.apache.lucene.index.IndexWriter.close(IndexWriter.java:774)
	at org.apache.lucene.index.TestAddIndexes.setUpDirs(TestAddIndexes.java:593)
	at org.apache.lucene.index.TestAddIndexes.testMergeAfterCopy(TestAddIndexes.java:427)
	at sun.reflect.NativeMethodAccessorImpl.invoke0(Native Method)
	at sun.reflect.NativeMethodAccessorImpl.invoke(NativeMethodAccessorImpl.java:57)
	at sun.reflect.DelegatingMethodAccessorImpl.invoke(DelegatingMethodAccessorImpl.java:43)
	at java.lang.reflect.Method.invoke(Method.java:616)
	at com.carrotsearch.randomizedtesting.RandomizedRunner.invoke(RandomizedRunner.java:1844)
	at com.carrotsearch.randomizedtesting.RandomizedRunner.access$1000(RandomizedRunner.java:142)
	at com.carrotsearch.randomizedtesting.RandomizedRunner$6.evaluate(RandomizedRunner.java:748)
	at com.carrotsearch.randomizedtesting.RandomizedRunner$7.evaluate(RandomizedRunner.java:809)
	at com.carrotsearch.randomizedtesting.RandomizedRunner$8.evaluate(RandomizedRunner.java:823)
	at org.apache.lucene.util.LuceneTestCase$SubclassSetupTeardownRule$1.evaluate(LuceneTestCase.java:758)
	at org.apache.lucene.util.LuceneTestCase$InternalSetupTeardownRule$1.evaluate(LuceneTestCase.java:680)
	at org.apache.lucene.util.SystemPropertiesInvariantRule$1.evaluate(SystemPropertiesInvariantRule.java:69)
	at org.apache.lucene.util.LuceneTestCase$TestResultInterceptorRule$1.evaluate(LuceneTestCase.java:613)
	at org.apache.lucene.util.UncaughtExceptionsRule$1.evaluate(UncaughtExceptionsRule.java:75)
	at org.apache.lucene.util.LuceneTestCase$SaveThreadAndTestNameRule$1.evaluate(LuceneTestCase.java:652)
	at com.carrotsearch.randomizedtesting.RandomizedRunner.runSingleTest(RandomizedRunner.java:755)
	at com.carrotsearch.randomizedtesting.RandomizedRunner.access$600(RandomizedRunner.java:142)
	at com.carrotsearch.randomizedtesting.RandomizedRunner$3$1.run(RandomizedRunner.java:606)
	at com.carrotsearch.randomizedtesting.RandomizedRunner$3.evaluate(RandomizedRunner.java:625)
	at com.carrotsearch.randomizedtesting.RandomizedRunner$4.evaluate(RandomizedRunner.java:661)
	at com.carrotsearch.randomizedtesting.RandomizedRunner$5.evaluate(RandomizedRunner.java:672)
	at org.apache.lucene.util.UncaughtExceptionsRule$1.evaluate(UncaughtExceptionsRule.java:75)
	at org.apache.lucene.util.StoreClassNameRule$1.evaluate(StoreClassNameRule.java:38)
	at org.apache.lucene.util.SystemPropertiesInvariantRule$1.evaluate(SystemPropertiesInvariantRule.java:69)
	at com.carrotsearch.randomizedtesting.RandomizedRunner.runSuite(RandomizedRunner.java:553)
	at com.carrotsearch.randomizedtesting.RandomizedRunner.access$400(RandomizedRunner.java:142)
	at com.carrotsearch.randomizedtesting.RandomizedRunner$2.run(RandomizedRunner.java:499)


FAILED:  junit.framework.TestSuite.org.apache.lucene.index.TestBackwardsCompatibility

Error Message:
java.io.IOException: Too many open files in system

Stack Trace:
java.lang.RuntimeException: java.io.IOException: Too many open files in system
	at __randomizedtesting.SeedInfo.seed([46D52DA72AB672EF]:0)
	at __randomizedtesting.SeedInfo.seed([46D52DA72AB672EF]:0)
	at org.apache.lucene.util._TestUtil.getTempDir(_TestUtil.java:77)
	at org.apache.lucene.index.TestBackwardsCompatibility.beforeClass(TestBackwardsCompatibility.java:138)
	at sun.reflect.NativeMethodAccessorImpl.invoke0(Native Method)
	at sun.reflect.NativeMethodAccessorImpl.invoke(NativeMethodAccessorImpl.java:57)
	at sun.reflect.DelegatingMethodAccessorImpl.invoke(DelegatingMethodAccessorImpl.java:43)
	at java.lang.reflect.Method.invoke(Method.java:616)
	at com.carrotsearch.randomizedtesting.RandomizedRunner.invoke(RandomizedRunner.java:1844)
	at com.carrotsearch.randomizedtesting.RandomizedRunner.access$1000(RandomizedRunner.java:142)
	at com.carrotsearch.randomizedtesting.RandomizedRunner$4.evaluate(RandomizedRunner.java:656)
	at com.carrotsearch.randomizedtesting.RandomizedRunner$5.evaluate(RandomizedRunner.java:672)
	at org.apache.lucene.util.UncaughtExceptionsRule$1.evaluate(UncaughtExceptionsRule.java:75)
	at org.apache.lucene.util.StoreClassNameRule$1.evaluate(StoreClassNameRule.java:38)
	at org.apache.lucene.util.SystemPropertiesInvariantRule$1.evaluate(SystemPropertiesInvariantRule.java:69)
	at com.carrotsearch.randomizedtesting.RandomizedRunner.runSuite(RandomizedRunner.java:553)
	at com.carrotsearch.randomizedtesting.RandomizedRunner.access$400(RandomizedRunner.java:142)
	at com.carrotsearch.randomizedtesting.RandomizedRunner$2.run(RandomizedRunner.java:499)
Caused by: java.io.IOException: Too many open files in system
	at java.io.UnixFileSystem.createFileExclusively(Native Method)
	at java.io.File.createNewFile(File.java:900)
	at org.apache.lucene.util._TestUtil.createTempFile(_TestUtil.java:673)
	at org.apache.lucene.util._TestUtil.getTempDir(_TestUtil.java:72)
	... 15 more


REGRESSION:  org.apache.lucene.index.TestCompoundFile.testManySubFiles

Error Message:
/usr/home/hudson/hudson-slave/workspace/Lucene-Solr-tests-only-trunk/checkout/lucene/build/core/test/S1/CFSManySubFiles2077220839tmp/file.683 (Too many open files in system)

Stack Trace:
java.io.FileNotFoundException: /usr/home/hudson/hudson-slave/workspace/Lucene-Solr-tests-only-trunk/checkout/lucene/build/core/test/S1/CFSManySubFiles2077220839tmp/file.683 (Too many open files in system)
	at __randomizedtesting.SeedInfo.seed([46D52DA72AB672EF:C1D41C984E2CB1FC]:0)
	at java.io.RandomAccessFile.open(Native Method)
	at java.io.RandomAccessFile.<init>(RandomAccessFile.java:233)
	at org.apache.lucene.store.MMapDirectory.openInput(MMapDirectory.java:219)
	at org.apache.lucene.store.Directory.copy(Directory.java:199)
	at org.apache.lucene.store.MockDirectoryWrapper.copy(MockDirectoryWrapper.java:765)
	at org.apache.lucene.index.TestCompoundFile.testManySubFiles(TestCompoundFile.java:787)
	at sun.reflect.NativeMethodAccessorImpl.invoke0(Native Method)
	at sun.reflect.NativeMethodAccessorImpl.invoke(NativeMethodAccessorImpl.java:57)
	at sun.reflect.DelegatingMethodAccessorImpl.invoke(DelegatingMethodAccessorImpl.java:43)
	at java.lang.reflect.Method.invoke(Method.java:616)
	at com.carrotsearch.randomizedtesting.RandomizedRunner.invoke(RandomizedRunner.java:1844)
	at com.carrotsearch.randomizedtesting.RandomizedRunner.access$1000(RandomizedRunner.java:142)
	at com.carrotsearch.randomizedtesting.RandomizedRunner$6.evaluate(RandomizedRunner.java:748)
	at com.carrotsearch.randomizedtesting.RandomizedRunner$7.evaluate(RandomizedRunner.java:809)
	at com.carrotsearch.randomizedtesting.RandomizedRunner$8.evaluate(RandomizedRunner.java:823)
	at org.apache.lucene.util.LuceneTestCase$SubclassSetupTeardownRule$1.evaluate(LuceneTestCase.java:758)
	at org.apache.lucene.util.LuceneTestCase$InternalSetupTeardownRule$1.evaluate(LuceneTestCase.java:680)
	at org.apache.lucene.util.SystemPropertiesInvariantRule$1.evaluate(SystemPropertiesInvariantRule.java:69)
	at org.apache.lucene.util.LuceneTestCase$TestResultInterceptorRule$1.evaluate(LuceneTestCase.java:613)
	at org.apache.lucene.util.UncaughtExceptionsRule$1.evaluate(UncaughtExceptionsRule.java:75)
	at org.apache.lucene.util.LuceneTestCase$SaveThreadAndTestNameRule$1.evaluate(LuceneTestCase.java:652)
	at com.carrotsearch.randomizedtesting.RandomizedRunner.runSingleTest(RandomizedRunner.java:755)
	at com.carrotsearch.randomizedtesting.RandomizedRunner.access$600(RandomizedRunner.java:142)
	at com.carrotsearch.randomizedtesting.RandomizedRunner$3$1.run(RandomizedRunner.java:606)
	at com.carrotsearch.randomizedtesting.RandomizedRunner$3.evaluate(RandomizedRunner.java:625)
	at com.carrotsearch.randomizedtesting.RandomizedRunner$4.evaluate(RandomizedRunner.java:661)
	at com.carrotsearch.randomizedtesting.RandomizedRunner$5.evaluate(RandomizedRunner.java:672)
	at org.apache.lucene.util.UncaughtExceptionsRule$1.evaluate(UncaughtExceptionsRule.java:75)
	at org.apache.lucene.util.StoreClassNameRule$1.evaluate(StoreClassNameRule.java:38)
	at org.apache.lucene.util.SystemPropertiesInvariantRule$1.evaluate(SystemPropertiesInvariantRule.java:69)
	at com.carrotsearch.randomizedtesting.RandomizedRunner.runSuite(RandomizedRunner.java:553)
	at com.carrotsearch.randomizedtesting.RandomizedRunner.access$400(RandomizedRunner.java:142)
	at com.carrotsearch.randomizedtesting.RandomizedRunner$2.run(RandomizedRunner.java:499)


REGRESSION:  org.apache.lucene.index.TestConsistentFieldNumbers.testFieldNumberGaps

Error Message:
/usr/home/hudson/hudson-slave/workspace/Lucene-Solr-tests-only-trunk/checkout/lucene/build/core/test/S3/index7495874970tmp/_0_1.frq (Too many open files in system)

Stack Trace:
java.io.FileNotFoundException: /usr/home/hudson/hudson-slave/workspace/Lucene-Solr-tests-only-trunk/checkout/lucene/build/core/test/S3/index7495874970tmp/_0_1.frq (Too many open files in system)
	at __randomizedtesting.SeedInfo.seed([46D52DA72AB672EF:1246948D56EF2E01]:0)
	at java.io.RandomAccessFile.open(Native Method)
	at java.io.RandomAccessFile.<init>(RandomAccessFile.java:233)
	at org.apache.lucene.store.FSDirectory$FSIndexOutput.<init>(FSDirectory.java:449)
	at org.apache.lucene.store.FSDirectory.createOutput(FSDirectory.java:288)
	at org.apache.lucene.store.MockDirectoryWrapper.createOutput(MockDirectoryWrapper.java:450)
	at org.apache.lucene.codecs.lucene40.Lucene40PostingsWriter.<init>(Lucene40PostingsWriter.java:98)
	at org.apache.lucene.codecs.lucene40.Lucene40PostingsWriter.<init>(Lucene40PostingsWriter.java:89)
	at org.apache.lucene.codecs.lucene40.Lucene40PostingsBaseFormat.postingsWriterBase(Lucene40PostingsBaseFormat.java:50)
	at org.apache.lucene.codecs.pulsing.PulsingPostingsFormat.fieldsConsumer(PulsingPostingsFormat.java:70)
	at org.apache.lucene.codecs.perfield.PerFieldPostingsFormat$FieldsWriter.addField(PerFieldPostingsFormat.java:126)
	at org.apache.lucene.index.FreqProxTermsWriterPerField.flush(FreqProxTermsWriterPerField.java:322)
	at org.apache.lucene.index.FreqProxTermsWriter.flush(FreqProxTermsWriter.java:92)
	at org.apache.lucene.index.TermsHash.flush(TermsHash.java:117)
	at org.apache.lucene.index.DocInverter.flush(DocInverter.java:53)
	at org.apache.lucene.index.DocFieldProcessor.flush(DocFieldProcessor.java:81)
	at org.apache.lucene.index.DocumentsWriterPerThread.flush(DocumentsWriterPerThread.java:475)
	at org.apache.lucene.index.DocumentsWriter.doFlush(DocumentsWriter.java:422)
	at org.apache.lucene.index.DocumentsWriter.flushAllThreads(DocumentsWriter.java:553)
	at org.apache.lucene.index.IndexWriter.doFlush(IndexWriter.java:2640)
	at org.apache.lucene.index.IndexWriter.flush(IndexWriter.java:2616)
	at org.apache.lucene.index.IndexWriter.closeInternal(IndexWriter.java:851)
	at org.apache.lucene.index.IndexWriter.close(IndexWriter.java:810)
	at org.apache.lucene.index.IndexWriter.close(IndexWriter.java:774)
	at org.apache.lucene.index.TestConsistentFieldNumbers.testFieldNumberGaps(TestConsistentFieldNumbers.java:175)
	at sun.reflect.NativeMethodAccessorImpl.invoke0(Native Method)
	at sun.reflect.NativeMethodAccessorImpl.invoke(NativeMethodAccessorImpl.java:57)
	at sun.reflect.DelegatingMethodAccessorImpl.invoke(DelegatingMethodAccessorImpl.java:43)
	at java.lang.reflect.Method.invoke(Method.java:616)
	at com.carrotsearch.randomizedtesting.RandomizedRunner.invoke(RandomizedRunner.java:1844)
	at com.carrotsearch.randomizedtesting.RandomizedRunner.access$1000(RandomizedRunner.java:142)
	at com.carrotsearch.randomizedtesting.RandomizedRunner$6.evaluate(RandomizedRunner.java:748)
	at com.carrotsearch.randomizedtesting.RandomizedRunner$7.evaluate(RandomizedRunner.java:809)
	at com.carrotsearch.randomizedtesting.RandomizedRunner$8.evaluate(RandomizedRunner.java:823)
	at org.apache.lucene.util.LuceneTestCase$SubclassSetupTeardownRule$1.evaluate(LuceneTestCase.java:758)
	at org.apache.lucene.util.LuceneTestCase$InternalSetupTeardownRule$1.evaluate(LuceneTestCase.java:680)
	at org.apache.lucene.util.SystemPropertiesInvariantRule$1.evaluate(SystemPropertiesInvariantRule.java:69)
	at org.apache.lucene.util.LuceneTestCase$TestResultInterceptorRule$1.evaluate(LuceneTestCase.java:613)
	at org.apache.lucene.util.UncaughtExceptionsRule$1.evaluate(UncaughtExceptionsRule.java:75)
	at org.apache.lucene.util.LuceneTestCase$SaveThreadAndTestNameRule$1.evaluate(LuceneTestCase.java:652)
	at com.carrotsearch.randomizedtesting.RandomizedRunner.runSingleTest(RandomizedRunner.java:755)
	at com.carrotsearch.randomizedtesting.RandomizedRunner.access$600(RandomizedRunner.java:142)
	at com.carrotsearch.randomizedtesting.RandomizedRunner$3$1.run(RandomizedRunner.java:606)
	at com.carrotsearch.randomizedtesting.RandomizedRunner$3.evaluate(RandomizedRunner.java:625)
	at com.carrotsearch.randomizedtesting.RandomizedRunner$4.evaluate(RandomizedRunner.java:661)
	at com.carrotsearch.randomizedtesting.RandomizedRunner$5.evaluate(RandomizedRunner.java:672)
	at org.apache.lucene.util.UncaughtExceptionsRule$1.evaluate(UncaughtExceptionsRule.java:75)
	at org.apache.lucene.util.StoreClassNameRule$1.evaluate(StoreClassNameRule.java:38)
	at org.apache.lucene.util.SystemPropertiesInvariantRule$1.evaluate(SystemPropertiesInvariantRule.java:69)
	at com.carrotsearch.randomizedtesting.RandomizedRunner.runSuite(RandomizedRunner.java:553)
	at com.carrotsearch.randomizedtesting.RandomizedRunner.access$400(RandomizedRunner.java:142)
	at com.carrotsearch.randomizedtesting.RandomizedRunner$2.run(RandomizedRunner.java:499)


REGRESSION:  org.apache.lucene.index.TestConsistentFieldNumbers.testAddIndexes

Error Message:
/usr/home/hudson/hudson-slave/workspace/Lucene-Solr-tests-only-trunk/checkout/lucene/build/core/test/S3/index7495874971tmp/_0_0.skp (Too many open files in system)

Stack Trace:
java.io.FileNotFoundException: /usr/home/hudson/hudson-slave/workspace/Lucene-Solr-tests-only-trunk/checkout/lucene/build/core/test/S3/index7495874971tmp/_0_0.skp (Too many open files in system)
	at __randomizedtesting.SeedInfo.seed([46D52DA72AB672EF:2FC5F39B5FB837AD]:0)
	at java.io.RandomAccessFile.open(Native Method)
	at java.io.RandomAccessFile.<init>(RandomAccessFile.java:233)
	at org.apache.lucene.store.FSDirectory$FSIndexOutput.<init>(FSDirectory.java:449)
	at org.apache.lucene.store.FSDirectory.createOutput(FSDirectory.java:288)
	at org.apache.lucene.store.MockDirectoryWrapper.createOutput(MockDirectoryWrapper.java:450)
	at org.apache.lucene.codecs.sep.SepPostingsWriter.<init>(SepPostingsWriter.java:139)
	at org.apache.lucene.codecs.sep.SepPostingsWriter.<init>(SepPostingsWriter.java:105)
	at org.apache.lucene.codecs.mockintblock.MockVariableIntBlockPostingsFormat.fieldsConsumer(MockVariableIntBlockPostingsFormat.java:151)
	at org.apache.lucene.codecs.perfield.PerFieldPostingsFormat$FieldsWriter.addField(PerFieldPostingsFormat.java:126)
	at org.apache.lucene.index.FreqProxTermsWriterPerField.flush(FreqProxTermsWriterPerField.java:322)
	at org.apache.lucene.index.FreqProxTermsWriter.flush(FreqProxTermsWriter.java:92)
	at org.apache.lucene.index.TermsHash.flush(TermsHash.java:117)
	at org.apache.lucene.index.DocInverter.flush(DocInverter.java:53)
	at org.apache.lucene.index.DocFieldProcessor.flush(DocFieldProcessor.java:81)
	at org.apache.lucene.index.DocumentsWriterPerThread.flush(DocumentsWriterPerThread.java:475)
	at org.apache.lucene.index.DocumentsWriter.doFlush(DocumentsWriter.java:422)
	at org.apache.lucene.index.DocumentsWriter.flushAllThreads(DocumentsWriter.java:553)
	at org.apache.lucene.index.IndexWriter.doFlush(IndexWriter.java:2640)
	at org.apache.lucene.index.IndexWriter.flush(IndexWriter.java:2616)
	at org.apache.lucene.index.IndexWriter.closeInternal(IndexWriter.java:851)
	at org.apache.lucene.index.IndexWriter.close(IndexWriter.java:810)
	at org.apache.lucene.index.IndexWriter.close(IndexWriter.java:774)
	at org.apache.lucene.index.TestConsistentFieldNumbers.testAddIndexes(TestConsistentFieldNumbers.java:110)
	at sun.reflect.NativeMethodAccessorImpl.invoke0(Native Method)
	at sun.reflect.NativeMethodAccessorImpl.invoke(NativeMethodAccessorImpl.java:57)
	at sun.reflect.DelegatingMethodAccessorImpl.invoke(DelegatingMethodAccessorImpl.java:43)
	at java.lang.reflect.Method.invoke(Method.java:616)
	at com.carrotsearch.randomizedtesting.RandomizedRunner.invoke(RandomizedRunner.java:1844)
	at com.carrotsearch.randomizedtesting.RandomizedRunner.access$1000(RandomizedRunner.java:142)
	at com.carrotsearch.randomizedtesting.RandomizedRunner$6.evaluate(RandomizedRunner.java:748)
	at com.carrotsearch.randomizedtesting.RandomizedRunner$7.evaluate(RandomizedRunner.java:809)
	at com.carrotsearch.randomizedtesting.RandomizedRunner$8.evaluate(RandomizedRunner.java:823)
	at org.apache.lucene.util.LuceneTestCase$SubclassSetupTeardownRule$1.evaluate(LuceneTestCase.java:758)
	at org.apache.lucene.util.LuceneTestCase$InternalSetupTeardownRule$1.evaluate(LuceneTestCase.java:680)
	at org.apache.lucene.util.SystemPropertiesInvariantRule$1.evaluate(SystemPropertiesInvariantRule.java:69)
	at org.apache.lucene.util.LuceneTestCase$TestResultInterceptorRule$1.evaluate(LuceneTestCase.java:613)
	at org.apache.lucene.util.UncaughtExceptionsRule$1.evaluate(UncaughtExceptionsRule.java:75)
	at org.apache.lucene.util.LuceneTestCase$SaveThreadAndTestNameRule$1.evaluate(LuceneTestCase.java:652)
	at com.carrotsearch.randomizedtesting.RandomizedRunner.runSingleTest(RandomizedRunner.java:755)
	at com.carrotsearch.randomizedtesting.RandomizedRunner.access$600(RandomizedRunner.java:142)
	at com.carrotsearch.randomizedtesting.RandomizedRunner$3$1.run(RandomizedRunner.java:606)
	at com.carrotsearch.randomizedtesting.RandomizedRunner$3.evaluate(RandomizedRunner.java:625)
	at com.carrotsearch.randomizedtesting.RandomizedRunner$4.evaluate(RandomizedRunner.java:661)
	at com.carrotsearch.randomizedtesting.RandomizedRunner$5.evaluate(RandomizedRunner.java:672)
	at org.apache.lucene.util.UncaughtExceptionsRule$1.evaluate(UncaughtExceptionsRule.java:75)
	at org.apache.lucene.util.StoreClassNameRule$1.evaluate(StoreClassNameRule.java:38)
	at org.apache.lucene.util.SystemPropertiesInvariantRule$1.evaluate(SystemPropertiesInvariantRule.java:69)
	at com.carrotsearch.randomizedtesting.RandomizedRunner.runSuite(RandomizedRunner.java:553)
	at com.carrotsearch.randomizedtesting.RandomizedRunner.access$400(RandomizedRunner.java:142)
	at com.carrotsearch.randomizedtesting.RandomizedRunner$2.run(RandomizedRunner.java:499)


REGRESSION:  org.apache.lucene.index.TestFieldsReader.testExceptions

Error Message:
/usr/home/hudson/hudson-slave/workspace/Lucene-Solr-tests-only-trunk/checkout/lucene/build/core/test/S3/testfieldswriterexceptions7495874968tmp/_0_1.tii (Too many open files in system)

Stack Trace:
java.io.FileNotFoundException: /usr/home/hudson/hudson-slave/workspace/Lucene-Solr-tests-only-trunk/checkout/lucene/build/core/test/S3/testfieldswriterexceptions7495874968tmp/_0_1.tii (Too many open files in system)
	at __randomizedtesting.SeedInfo.seed([46D52DA72AB672EF:30D47F0F82CB0C59]:0)
	at java.io.RandomAccessFile.open(Native Method)
	at java.io.RandomAccessFile.<init>(RandomAccessFile.java:233)
	at org.apache.lucene.store.FSDirectory$FSIndexOutput.<init>(FSDirectory.java:449)
	at org.apache.lucene.store.FSDirectory.createOutput(FSDirectory.java:288)
	at org.apache.lucene.store.MockDirectoryWrapper.createOutput(MockDirectoryWrapper.java:450)
	at org.apache.lucene.index.TestFieldsReader$FaultyFSDirectory.createOutput(TestFieldsReader.java:142)
	at org.apache.lucene.codecs.FixedGapTermsIndexWriter.<init>(FixedGapTermsIndexWriter.java:62)
	at org.apache.lucene.codecs.mockintblock.MockFixedIntBlockPostingsFormat.fieldsConsumer(MockFixedIntBlockPostingsFormat.java:133)
	at org.apache.lucene.codecs.perfield.PerFieldPostingsFormat$FieldsWriter.addField(PerFieldPostingsFormat.java:126)
	at org.apache.lucene.index.FreqProxTermsWriterPerField.flush(FreqProxTermsWriterPerField.java:322)
	at org.apache.lucene.index.FreqProxTermsWriter.flush(FreqProxTermsWriter.java:92)
	at org.apache.lucene.index.TermsHash.flush(TermsHash.java:117)
	at org.apache.lucene.index.DocInverter.flush(DocInverter.java:53)
	at org.apache.lucene.index.DocFieldProcessor.flush(DocFieldProcessor.java:81)
	at org.apache.lucene.index.DocumentsWriterPerThread.flush(DocumentsWriterPerThread.java:475)
	at org.apache.lucene.index.DocumentsWriter.doFlush(DocumentsWriter.java:422)
	at org.apache.lucene.index.DocumentsWriter.flushAllThreads(DocumentsWriter.java:553)
	at org.apache.lucene.index.IndexWriter.doFlush(IndexWriter.java:2640)
	at org.apache.lucene.index.IndexWriter.flush(IndexWriter.java:2616)
	at org.apache.lucene.index.IndexWriter.forceMerge(IndexWriter.java:1436)
	at org.apache.lucene.index.IndexWriter.forceMerge(IndexWriter.java:1412)
	at org.apache.lucene.index.TestFieldsReader.testExceptions(TestFieldsReader.java:201)
	at sun.reflect.NativeMethodAccessorImpl.invoke0(Native Method)
	at sun.reflect.NativeMethodAccessorImpl.invoke(NativeMethodAccessorImpl.java:57)
	at sun.reflect.DelegatingMethodAccessorImpl.invoke(DelegatingMethodAccessorImpl.java:43)
	at java.lang.reflect.Method.invoke(Method.java:616)
	at com.carrotsearch.randomizedtesting.RandomizedRunner.invoke(RandomizedRunner.java:1844)
	at com.carrotsearch.randomizedtesting.RandomizedRunner.access$1000(RandomizedRunner.java:142)
	at com.carrotsearch.randomizedtesting.RandomizedRunner$6.evaluate(RandomizedRunner.java:748)
	at com.carrotsearch.randomizedtesting.RandomizedRunner$7.evaluate(RandomizedRunner.java:809)
	at com.carrotsearch.randomizedtesting.RandomizedRunner$8.evaluate(RandomizedRunner.java:823)
	at org.apache.lucene.util.LuceneTestCase$SubclassSetupTeardownRule$1.evaluate(LuceneTestCase.java:758)
	at org.apache.lucene.util.LuceneTestCase$InternalSetupTeardownRule$1.evaluate(LuceneTestCase.java:680)
	at org.apache.lucene.util.SystemPropertiesInvariantRule$1.evaluate(SystemPropertiesInvariantRule.java:69)
	at org.apache.lucene.util.LuceneTestCase$TestResultInterceptorRule$1.evaluate(LuceneTestCase.java:613)
	at org.apache.lucene.util.UncaughtExceptionsRule$1.evaluate(UncaughtExceptionsRule.java:75)
	at org.apache.lucene.util.LuceneTestCase$SaveThreadAndTestNameRule$1.evaluate(LuceneTestCase.java:652)
	at com.carrotsearch.randomizedtesting.RandomizedRunner.runSingleTest(RandomizedRunner.java:755)
	at com.carrotsearch.randomizedtesting.RandomizedRunner.access$600(RandomizedRunner.java:142)
	at com.carrotsearch.randomizedtesting.RandomizedRunner$3$1.run(RandomizedRunner.java:606)
	at com.carrotsearch.randomizedtesting.RandomizedRunner$3.evaluate(RandomizedRunner.java:625)
	at com.carrotsearch.randomizedtesting.RandomizedRunner$4.evaluate(RandomizedRunner.java:661)
	at com.carrotsearch.randomizedtesting.RandomizedRunner$5.evaluate(RandomizedRunner.java:672)
	at org.apache.lucene.util.UncaughtExceptionsRule$1.evaluate(UncaughtExceptionsRule.java:75)
	at org.apache.lucene.util.StoreClassNameRule$1.evaluate(StoreClassNameRule.java:38)
	at org.apache.lucene.util.SystemPropertiesInvariantRule$1.evaluate(SystemPropertiesInvariantRule.java:69)
	at com.carrotsearch.randomizedtesting.RandomizedRunner.runSuite(RandomizedRunner.java:553)
	at com.carrotsearch.randomizedtesting.RandomizedRunner.access$400(RandomizedRunner.java:142)
	at com.carrotsearch.randomizedtesting.RandomizedRunner$2.run(RandomizedRunner.java:499)


REGRESSION:  org.apache.lucene.index.TestMultiFields.testRandom

Error Message:
/usr/home/hudson/hudson-slave/workspace/Lucene-Solr-tests-only-trunk/checkout/lucene/build/core/test/S3/index7495874969tmp/_0_1.tib (Too many open files in system)

Stack Trace:
java.io.FileNotFoundException: /usr/home/hudson/hudson-slave/workspace/Lucene-Solr-tests-only-trunk/checkout/lucene/build/core/test/S3/index7495874969tmp/_0_1.tib (Too many open files in system)
	at __randomizedtesting.SeedInfo.seed([46D52DA72AB672EF:349908A89BD6C49C]:0)
	at java.io.RandomAccessFile.open(Native Method)
	at java.io.RandomAccessFile.<init>(RandomAccessFile.java:233)
	at org.apache.lucene.store.FSDirectory$FSIndexOutput.<init>(FSDirectory.java:449)
	at org.apache.lucene.store.FSDirectory.createOutput(FSDirectory.java:288)
	at org.apache.lucene.store.MockDirectoryWrapper.createOutput(MockDirectoryWrapper.java:450)
	at org.apache.lucene.codecs.BlockTermsWriter.<init>(BlockTermsWriter.java:76)
	at org.apache.lucene.codecs.mocksep.MockSepPostingsFormat.fieldsConsumer(MockSepPostingsFormat.java:72)
	at org.apache.lucene.codecs.perfield.PerFieldPostingsFormat$FieldsWriter.addField(PerFieldPostingsFormat.java:126)
	at org.apache.lucene.index.FreqProxTermsWriterPerField.flush(FreqProxTermsWriterPerField.java:322)
	at org.apache.lucene.index.FreqProxTermsWriter.flush(FreqProxTermsWriter.java:92)
	at org.apache.lucene.index.TermsHash.flush(TermsHash.java:117)
	at org.apache.lucene.index.DocInverter.flush(DocInverter.java:53)
	at org.apache.lucene.index.DocFieldProcessor.flush(DocFieldProcessor.java:81)
	at org.apache.lucene.index.DocumentsWriterPerThread.flush(DocumentsWriterPerThread.java:475)
	at org.apache.lucene.index.DocumentsWriter.doFlush(DocumentsWriter.java:422)
	at org.apache.lucene.index.DocumentsWriter.flushAllThreads(DocumentsWriter.java:553)
	at org.apache.lucene.index.IndexWriter.prepareCommit(IndexWriter.java:2416)
	at org.apache.lucene.index.IndexWriter.commitInternal(IndexWriter.java:2548)
	at org.apache.lucene.index.IndexWriter.commit(IndexWriter.java:2530)
	at org.apache.lucene.index.IndexWriter.commit(IndexWriter.java:2514)
	at org.apache.lucene.index.TestMultiFields.testRandom(TestMultiFields.java:79)
	at sun.reflect.NativeMethodAccessorImpl.invoke0(Native Method)
	at sun.reflect.NativeMethodAccessorImpl.invoke(NativeMethodAccessorImpl.java:57)
	at sun.reflect.DelegatingMethodAccessorImpl.invoke(DelegatingMethodAccessorImpl.java:43)
	at java.lang.reflect.Method.invoke(Method.java:616)
	at com.carrotsearch.randomizedtesting.RandomizedRunner.invoke(RandomizedRunner.java:1844)
	at com.carrotsearch.randomizedtesting.RandomizedRunner.access$1000(RandomizedRunner.java:142)
	at com.carrotsearch.randomizedtesting.RandomizedRunner$6.evaluate(RandomizedRunner.java:748)
	at com.carrotsearch.randomizedtesting.RandomizedRunner$7.evaluate(RandomizedRunner.java:809)
	at com.carrotsearch.randomizedtesting.RandomizedRunner$8.evaluate(RandomizedRunner.java:823)
	at org.apache.lucene.util.LuceneTestCase$SubclassSetupTeardownRule$1.evaluate(LuceneTestCase.java:758)
	at org.apache.lucene.util.LuceneTestCase$InternalSetupTeardownRule$1.evaluate(LuceneTestCase.java:680)
	at org.apache.lucene.util.SystemPropertiesInvariantRule$1.evaluate(SystemPropertiesInvariantRule.java:69)
	at org.apache.lucene.util.LuceneTestCase$TestResultInterceptorRule$1.evaluate(LuceneTestCase.java:613)
	at org.apache.lucene.util.UncaughtExceptionsRule$1.evaluate(UncaughtExceptionsRule.java:75)
	at org.apache.lucene.util.LuceneTestCase$SaveThreadAndTestNameRule$1.evaluate(LuceneTestCase.java:652)
	at com.carrotsearch.randomizedtesting.RandomizedRunner.runSingleTest(RandomizedRunner.java:755)
	at com.carrotsearch.randomizedtesting.RandomizedRunner.access$600(RandomizedRunner.java:142)
	at com.carrotsearch.randomizedtesting.RandomizedRunner$3$1.run(RandomizedRunner.java:606)
	at com.carrotsearch.randomizedtesting.RandomizedRunner$3.evaluate(RandomizedRunner.java:625)
	at com.carrotsearch.randomizedtesting.RandomizedRunner$4.evaluate(RandomizedRunner.java:661)
	at com.carrotsearch.randomizedtesting.RandomizedRunner$5.evaluate(RandomizedRunner.java:672)
	at org.apache.lucene.util.UncaughtExceptionsRule$1.evaluate(UncaughtExceptionsRule.java:75)
	at org.apache.lucene.util.StoreClassNameRule$1.evaluate(StoreClassNameRule.java:38)
	at org.apache.lucene.util.SystemPropertiesInvariantRule$1.evaluate(SystemPropertiesInvariantRule.java:69)
	at com.carrotsearch.randomizedtesting.RandomizedRunner.runSuite(RandomizedRunner.java:553)
	at com.carrotsearch.randomizedtesting.RandomizedRunner.access$400(RandomizedRunner.java:142)
	at com.carrotsearch.randomizedtesting.RandomizedRunner$2.run(RandomizedRunner.java:499)


REGRESSION:  org.apache.lucene.index.TestNRTThreads.testNRTThreads

Error Message:
/usr/home/hudson/hudson-slave/workspace/Lucene-Solr-tests-only-trunk/checkout/lucene/build/core/test/S3/TestNRTThreads7495874976tmp/_2_4.tip (Too many open files in system)

Stack Trace:
java.io.FileNotFoundException: /usr/home/hudson/hudson-slave/workspace/Lucene-Solr-tests-only-trunk/checkout/lucene/build/core/test/S3/TestNRTThreads7495874976tmp/_2_4.tip (Too many open files in system)
	at __randomizedtesting.SeedInfo.seed([46D52DA72AB672EF:DD0C39BC6B4D6484]:0)
	at java.io.RandomAccessFile.open(Native Method)
	at java.io.RandomAccessFile.<init>(RandomAccessFile.java:233)
	at org.apache.lucene.store.FSDirectory$FSIndexOutput.<init>(FSDirectory.java:449)
	at org.apache.lucene.store.FSDirectory.createOutput(FSDirectory.java:288)
	at org.apache.lucene.store.NRTCachingDirectory.createOutput(NRTCachingDirectory.java:202)
	at org.apache.lucene.store.MockDirectoryWrapper.createOutput(MockDirectoryWrapper.java:450)
	at org.apache.lucene.codecs.BlockTreeTermsWriter.<init>(BlockTreeTermsWriter.java:161)
	at org.apache.lucene.codecs.mockrandom.MockRandomPostingsFormat.fieldsConsumer(MockRandomPostingsFormat.java:190)
	at org.apache.lucene.codecs.perfield.PerFieldPostingsFormat$FieldsWriter.addField(PerFieldPostingsFormat.java:126)
	at org.apache.lucene.index.FreqProxTermsWriterPerField.flush(FreqProxTermsWriterPerField.java:322)
	at org.apache.lucene.index.FreqProxTermsWriter.flush(FreqProxTermsWriter.java:92)
	at org.apache.lucene.index.TermsHash.flush(TermsHash.java:117)
	at org.apache.lucene.index.DocInverter.flush(DocInverter.java:53)
	at org.apache.lucene.index.DocFieldProcessor.flush(DocFieldProcessor.java:81)
	at org.apache.lucene.index.DocumentsWriterPerThread.flush(DocumentsWriterPerThread.java:475)
	at org.apache.lucene.index.DocumentsWriter.doFlush(DocumentsWriter.java:422)
	at org.apache.lucene.index.DocumentsWriter.flushAllThreads(DocumentsWriter.java:553)
	at org.apache.lucene.index.IndexWriter.prepareCommit(IndexWriter.java:2416)
	at org.apache.lucene.index.IndexWriter.commitInternal(IndexWriter.java:2548)
	at org.apache.lucene.index.IndexWriter.commit(IndexWriter.java:2530)
	at org.apache.lucene.index.IndexWriter.commit(IndexWriter.java:2514)
	at org.apache.lucene.index.TestNRTThreads.doSearching(TestNRTThreads.java:56)
	at org.apache.lucene.index.ThreadedIndexingAndSearchingTestCase.runTest(ThreadedIndexingAndSearchingTestCase.java:491)
	at org.apache.lucene.index.TestNRTThreads.testNRTThreads(TestNRTThreads.java:119)
	at sun.reflect.NativeMethodAccessorImpl.invoke0(Native Method)
	at sun.reflect.NativeMethodAccessorImpl.invoke(NativeMethodAccessorImpl.java:57)
	at sun.reflect.DelegatingMethodAccessorImpl.invoke(DelegatingMethodAccessorImpl.java:43)
	at java.lang.reflect.Method.invoke(Method.java:616)
	at com.carrotsearch.randomizedtesting.RandomizedRunner.invoke(RandomizedRunner.java:1844)
	at com.carrotsearch.randomizedtesting.RandomizedRunner.access$1000(RandomizedRunner.java:142)
	at com.carrotsearch.randomizedtesting.RandomizedRunner$6.evaluate(RandomizedRunner.java:748)
	at com.carrotsearch.randomizedtesting.RandomizedRunner$7.evaluate(RandomizedRunner.java:809)
	at com.carrotsearch.randomizedtesting.RandomizedRunner$8.evaluate(RandomizedRunner.java:823)
	at org.apache.lucene.util.LuceneTestCase$SubclassSetupTeardownRule$1.evaluate(LuceneTestCase.java:758)
	at org.apache.lucene.util.LuceneTestCase$InternalSetupTeardownRule$1.evaluate(LuceneTestCase.java:680)
	at org.apache.lucene.util.SystemPropertiesInvariantRule$1.evaluate(SystemPropertiesInvariantRule.java:69)
	at org.apache.lucene.util.LuceneTestCase$TestResultInterceptorRule$1.evaluate(LuceneTestCase.java:613)
	at org.apache.lucene.util.UncaughtExceptionsRule$1.evaluate(UncaughtExceptionsRule.java:75)
	at org.apache.lucene.util.LuceneTestCase$SaveThreadAndTestNameRule$1.evaluate(LuceneTestCase.java:652)
	at com.carrotsearch.randomizedtesting.RandomizedRunner.runSingleTest(RandomizedRunner.java:755)
	at com.carrotsearch.randomizedtesting.RandomizedRunner.access$600(RandomizedRunner.java:142)
	at com.carrotsearch.randomizedtesting.RandomizedRunner$3$1.run(RandomizedRunner.java:606)
	at com.carrotsearch.randomizedtesting.RandomizedRunner$3.evaluate(RandomizedRunner.java:625)
	at com.carrotsearch.randomizedtesting.RandomizedRunner$4.evaluate(RandomizedRunner.java:661)
	at com.carrotsearch.randomizedtesting.RandomizedRunner$5.evaluate(RandomizedRunner.java:672)
	at org.apache.lucene.util.UncaughtExceptionsRule$1.evaluate(UncaughtExceptionsRule.java:75)
	at org.apache.lucene.util.StoreClassNameRule$1.evaluate(StoreClassNameRule.java:38)
	at org.apache.lucene.util.SystemPropertiesInvariantRule$1.evaluate(SystemPropertiesInvariantRule.java:69)
	at com.carrotsearch.randomizedtesting.RandomizedRunner.runSuite(RandomizedRunner.java:553)
	at com.carrotsearch.randomizedtesting.RandomizedRunner.access$400(RandomizedRunner.java:142)
	at com.carrotsearch.randomizedtesting.RandomizedRunner$2.run(RandomizedRunner.java:499)


FAILED:  org.apache.lucene.index.TestSameTokenSamePosition.testMoreDocs

Error Message:
/usr/home/hudson/hudson-slave/workspace/Lucene-Solr-tests-only-trunk/checkout/lucene/build/core/test/S0/index5658756680tmp/_0.fnm (Too many open files in system)

Stack Trace:
java.io.FileNotFoundException: /usr/home/hudson/hudson-slave/workspace/Lucene-Solr-tests-only-trunk/checkout/lucene/build/core/test/S0/index5658756680tmp/_0.fnm (Too many open files in system)
	at __randomizedtesting.SeedInfo.seed([46D52DA72AB672EF:FF9FC5943B0813A0]:0)
	at java.io.RandomAccessFile.open(Native Method)
	at java.io.RandomAccessFile.<init>(RandomAccessFile.java:233)
	at org.apache.lucene.store.SimpleFSDirectory$SimpleFSIndexInput$Descriptor.<init>(SimpleFSDirectory.java:98)
	at org.apache.lucene.store.SimpleFSDirectory$SimpleFSIndexInput.<init>(SimpleFSDirectory.java:121)
	at org.apache.lucene.store.SimpleFSDirectory.openInput(SimpleFSDirectory.java:60)
	at org.apache.lucene.store.MockDirectoryWrapper.openInput(MockDirectoryWrapper.java:503)
	at org.apache.lucene.codecs.lucene40.Lucene40FieldInfosReader.read(Lucene40FieldInfosReader.java:47)
	at org.apache.lucene.index.SegmentInfo.loadFieldInfos(SegmentInfo.java:201)
	at org.apache.lucene.index.SegmentCoreReaders.<init>(SegmentCoreReaders.java:101)
	at org.apache.lucene.index.SegmentReader.<init>(SegmentReader.java:55)
	at org.apache.lucene.index.StandardDirectoryReader$1.doBody(StandardDirectoryReader.java:62)
	at org.apache.lucene.index.SegmentInfos$FindSegmentsFile.run(SegmentInfos.java:629)
	at org.apache.lucene.index.StandardDirectoryReader.open(StandardDirectoryReader.java:52)
	at org.apache.lucene.index.DirectoryReader.open(DirectoryReader.java:64)
	at org.apache.lucene.store.MockDirectoryWrapper.close(MockDirectoryWrapper.java:585)
	at org.apache.lucene.index.TestSameTokenSamePosition.testMoreDocs(TestSameTokenSamePosition.java:59)
	at sun.reflect.NativeMethodAccessorImpl.invoke0(Native Method)
	at sun.reflect.NativeMethodAccessorImpl.invoke(NativeMethodAccessorImpl.java:57)
	at sun.reflect.DelegatingMethodAccessorImpl.invoke(DelegatingMethodAccessorImpl.java:43)
	at java.lang.reflect.Method.invoke(Method.java:616)
	at com.carrotsearch.randomizedtesting.RandomizedRunner.invoke(RandomizedRunner.java:1844)
	at com.carrotsearch.randomizedtesting.RandomizedRunner.access$1000(RandomizedRunner.java:142)
	at com.carrotsearch.randomizedtesting.RandomizedRunner$6.evaluate(RandomizedRunner.java:748)
	at com.carrotsearch.randomizedtesting.RandomizedRunner$7.evaluate(RandomizedRunner.java:809)
	at com.carrotsearch.randomizedtesting.RandomizedRunner$8.evaluate(RandomizedRunner.java:823)
	at org.apache.lucene.util.LuceneTestCase$SubclassSetupTeardownRule$1.evaluate(LuceneTestCase.java:758)
	at org.apache.lucene.util.LuceneTestCase$InternalSetupTeardownRule$1.evaluate(LuceneTestCase.java:680)
	at org.apache.lucene.util.SystemPropertiesInvariantRule$1.evaluate(SystemPropertiesInvariantRule.java:69)
	at org.apache.lucene.util.LuceneTestCase$TestResultInterceptorRule$1.evaluate(LuceneTestCase.java:613)
	at org.apache.lucene.util.UncaughtExceptionsRule$1.evaluate(UncaughtExceptionsRule.java:75)
	at org.apache.lucene.util.LuceneTestCase$SaveThreadAndTestNameRule$1.evaluate(LuceneTestCase.java:652)
	at com.carrotsearch.randomizedtesting.RandomizedRunner.runSingleTest(RandomizedRunner.java:755)
	at com.carrotsearch.randomizedtesting.RandomizedRunner.access$600(RandomizedRunner.java:142)
	at com.carrotsearch.randomizedtesting.RandomizedRunner$3$1.run(RandomizedRunner.java:606)
	at com.carrotsearch.randomizedtesting.RandomizedRunner$3.evaluate(RandomizedRunner.java:625)
	at com.carrotsearch.randomizedtesting.RandomizedRunner$4.evaluate(RandomizedRunner.java:661)
	at com.carrotsearch.randomizedtesting.RandomizedRunner$5.evaluate(RandomizedRunner.java:672)
	at org.apache.lucene.util.UncaughtExceptionsRule$1.evaluate(UncaughtExceptionsRule.java:75)
	at org.apache.lucene.util.StoreClassNameRule$1.evaluate(StoreClassNameRule.java:38)
	at org.apache.lucene.util.SystemPropertiesInvariantRule$1.evaluate(SystemPropertiesInvariantRule.java:69)
	at com.carrotsearch.randomizedtesting.RandomizedRunner.runSuite(RandomizedRunner.java:553)
	at com.carrotsearch.randomizedtesting.RandomizedRunner.access$400(RandomizedRunner.java:142)
	at com.carrotsearch.randomizedtesting.RandomizedRunner$2.run(RandomizedRunner.java:499)


REGRESSION:  org.apache.lucene.index.TestSegmentReader.testNorms

Error Message:
/usr/home/hudson/hudson-slave/workspace/Lucene-Solr-tests-only-trunk/checkout/lucene/build/core/test/S1/index2077220840tmp/_0_1.pos (Too many open files in system)

Stack Trace:
java.io.FileNotFoundException: /usr/home/hudson/hudson-slave/workspace/Lucene-Solr-tests-only-trunk/checkout/lucene/build/core/test/S1/index2077220840tmp/_0_1.pos (Too many open files in system)
	at java.io.RandomAccessFile.open(Native Method)
	at java.io.RandomAccessFile.<init>(RandomAccessFile.java:233)
	at org.apache.lucene.store.FSDirectory$FSIndexOutput.<init>(FSDirectory.java:449)
	at org.apache.lucene.store.FSDirectory.createOutput(FSDirectory.java:288)
	at org.apache.lucene.store.MockDirectoryWrapper.createOutput(MockDirectoryWrapper.java:450)
	at org.apache.lucene.codecs.mockintblock.MockFixedIntBlockPostingsFormat$MockIntFactory.createOutput(MockFixedIntBlockPostingsFormat.java:105)
	at org.apache.lucene.codecs.sep.SepPostingsWriter.<init>(SepPostingsWriter.java:130)
	at org.apache.lucene.codecs.sep.SepPostingsWriter.<init>(SepPostingsWriter.java:105)
	at org.apache.lucene.codecs.mockintblock.MockFixedIntBlockPostingsFormat.fieldsConsumer(MockFixedIntBlockPostingsFormat.java:128)
	at org.apache.lucene.codecs.perfield.PerFieldPostingsFormat$FieldsWriter.addField(PerFieldPostingsFormat.java:126)
	at org.apache.lucene.index.FreqProxTermsWriterPerField.flush(FreqProxTermsWriterPerField.java:322)
	at org.apache.lucene.index.FreqProxTermsWriter.flush(FreqProxTermsWriter.java:92)
	at org.apache.lucene.index.TermsHash.flush(TermsHash.java:117)
	at org.apache.lucene.index.DocInverter.flush(DocInverter.java:53)
	at org.apache.lucene.index.DocFieldProcessor.flush(DocFieldProcessor.java:81)
	at org.apache.lucene.index.DocumentsWriterPerThread.flush(DocumentsWriterPerThread.java:475)
	at org.apache.lucene.index.DocumentsWriter.doFlush(DocumentsWriter.java:422)
	at org.apache.lucene.index.DocumentsWriter.flushAllThreads(DocumentsWriter.java:553)
	at org.apache.lucene.index.IndexWriter.prepareCommit(IndexWriter.java:2416)
	at org.apache.lucene.index.IndexWriter.commitInternal(IndexWriter.java:2548)
	at org.apache.lucene.index.IndexWriter.commit(IndexWriter.java:2530)
	at org.apache.lucene.index.IndexWriter.commit(IndexWriter.java:2514)
	at org.apache.lucene.index.DocHelper.writeDoc(DocHelper.java:284)
	at org.apache.lucene.index.DocHelper.writeDoc(DocHelper.java:266)
	at org.apache.lucene.index.TestSegmentReader.setUp(TestSegmentReader.java:44)
	at sun.reflect.GeneratedMethodAccessor1.invoke(Unknown Source)
	at sun.reflect.DelegatingMethodAccessorImpl.invoke(DelegatingMethodAccessorImpl.java:43)
	at java.lang.reflect.Method.invoke(Method.java:616)
	at com.carrotsearch.randomizedtesting.RandomizedRunner.invoke(RandomizedRunner.java:1844)
	at com.carrotsearch.randomizedtesting.RandomizedRunner.access$1000(RandomizedRunner.java:142)
	at com.carrotsearch.randomizedtesting.RandomizedRunner$7.evaluate(RandomizedRunner.java:807)
	at com.carrotsearch.randomizedtesting.RandomizedRunner$8.evaluate(RandomizedRunner.java:823)
	at org.apache.lucene.util.LuceneTestCase$SubclassSetupTeardownRule$1.evaluate(LuceneTestCase.java:758)
	at org.apache.lucene.util.LuceneTestCase$InternalSetupTeardownRule$1.evaluate(LuceneTestCase.java:680)
	at org.apache.lucene.util.SystemPropertiesInvariantRule$1.evaluate(SystemPropertiesInvariantRule.java:69)
	at org.apache.lucene.util.LuceneTestCase$TestResultInterceptorRule$1.evaluate(LuceneTestCase.java:613)
	at org.apache.lucene.util.UncaughtExceptionsRule$1.evaluate(UncaughtExceptionsRule.java:75)
	at org.apache.lucene.util.LuceneTestCase$SaveThreadAndTestNameRule$1.evaluate(LuceneTestCase.java:652)
	at com.carrotsearch.randomizedtesting.RandomizedRunner.runSingleTest(RandomizedRunner.java:755)
	at com.carrotsearch.randomizedtesting.RandomizedRunner.access$600(RandomizedRunner.java:142)
	at com.carrotsearch.randomizedtesting.RandomizedRunner$3$1.run(RandomizedRunner.java:606)
	at com.carrotsearch.randomizedtesting.RandomizedRunner$3.evaluate(RandomizedRunner.java:625)
	at com.carrotsearch.randomizedtesting.RandomizedRunner$4.evaluate(RandomizedRunner.java:661)
	at com.carrotsearch.randomizedtesting.RandomizedRunner$5.evaluate(RandomizedRunner.java:672)
	at org.apache.lucene.util.UncaughtExceptionsRule$1.evaluate(UncaughtExceptionsRule.java:75)
	at org.apache.lucene.util.StoreClassNameRule$1.evaluate(StoreClassNameRule.java:38)
	at org.apache.lucene.util.SystemPropertiesInvariantRule$1.evaluate(SystemPropertiesInvariantRule.java:69)
	at com.carrotsearch.randomizedtesting.RandomizedRunner.runSuite(RandomizedRunner.java:553)
	at com.carrotsearch.randomizedtesting.RandomizedRunner.access$400(RandomizedRunner.java:142)
	at com.carrotsearch.randomizedtesting.RandomizedRunner$2.run(RandomizedRunner.java:499)


REGRESSION:  org.apache.lucene.index.TestTieredMergePolicy.testPartialMerge

Error Message:
/usr/home/hudson/hudson-slave/workspace/Lucene-Solr-tests-only-trunk/checkout/lucene/build/core/test/S1/index2077220844tmp/_f_0.pyl (Too many open files in system)

Stack Trace:
java.io.FileNotFoundException: /usr/home/hudson/hudson-slave/workspace/Lucene-Solr-tests-only-trunk/checkout/lucene/build/core/test/S1/index2077220844tmp/_f_0.pyl (Too many open files in system)
	at __randomizedtesting.SeedInfo.seed([46D52DA72AB672EF:6DCE20122520830E]:0)
	at java.io.RandomAccessFile.open(Native Method)
	at java.io.RandomAccessFile.<init>(RandomAccessFile.java:233)
	at org.apache.lucene.store.FSDirectory$FSIndexOutput.<init>(FSDirectory.java:449)
	at org.apache.lucene.store.FSDirectory.createOutput(FSDirectory.java:288)
	at org.apache.lucene.store.MockDirectoryWrapper.createOutput(MockDirectoryWrapper.java:450)
	at org.apache.lucene.codecs.sep.SepPostingsWriter.<init>(SepPostingsWriter.java:135)
	at org.apache.lucene.codecs.sep.SepPostingsWriter.<init>(SepPostingsWriter.java:105)
	at org.apache.lucene.codecs.mockintblock.MockFixedIntBlockPostingsFormat.fieldsConsumer(MockFixedIntBlockPostingsFormat.java:128)
	at org.apache.lucene.codecs.perfield.PerFieldPostingsFormat$FieldsWriter.addField(PerFieldPostingsFormat.java:126)
	at org.apache.lucene.codecs.FieldsConsumer.merge(FieldsConsumer.java:53)
	at org.apache.lucene.index.SegmentMerger.mergeTerms(SegmentMerger.java:356)
	at org.apache.lucene.index.SegmentMerger.merge(SegmentMerger.java:115)
	at org.apache.lucene.index.IndexWriter.mergeMiddle(IndexWriter.java:3382)
	at org.apache.lucene.index.IndexWriter.merge(IndexWriter.java:3004)
	at org.apache.lucene.index.SerialMergeScheduler.merge(SerialMergeScheduler.java:37)
	at org.apache.lucene.index.IndexWriter.maybeMerge(IndexWriter.java:1644)
	at org.apache.lucene.index.IndexWriter.maybeMerge(IndexWriter.java:1638)
	at org.apache.lucene.index.IndexWriter.updateDocument(IndexWriter.java:1287)
	at org.apache.lucene.index.IndexWriter.addDocument(IndexWriter.java:1034)
	at org.apache.lucene.index.IndexWriter.addDocument(IndexWriter.java:1015)
	at org.apache.lucene.index.TestTieredMergePolicy.testPartialMerge(TestTieredMergePolicy.java:89)
	at sun.reflect.NativeMethodAccessorImpl.invoke0(Native Method)
	at sun.reflect.NativeMethodAccessorImpl.invoke(NativeMethodAccessorImpl.java:57)
	at sun.reflect.DelegatingMethodAccessorImpl.invoke(DelegatingMethodAccessorImpl.java:43)
	at java.lang.reflect.Method.invoke(Method.java:616)
	at com.carrotsearch.randomizedtesting.RandomizedRunner.invoke(RandomizedRunner.java:1844)
	at com.carrotsearch.randomizedtesting.RandomizedRunner.access$1000(RandomizedRunner.java:142)
	at com.carrotsearch.randomizedtesting.RandomizedRunner$6.evaluate(RandomizedRunner.java:748)
	at com.carrotsearch.randomizedtesting.RandomizedRunner$7.evaluate(RandomizedRunner.java:809)
	at com.carrotsearch.randomizedtesting.RandomizedRunner$8.evaluate(RandomizedRunner.java:823)
	at org.apache.lucene.util.LuceneTestCase$SubclassSetupTeardownRule$1.evaluate(LuceneTestCase.java:758)
	at org.apache.lucene.util.LuceneTestCase$InternalSetupTeardownRule$1.evaluate(LuceneTestCase.java:680)
	at org.apache.lucene.util.SystemPropertiesInvariantRule$1.evaluate(SystemPropertiesInvariantRule.java:69)
	at org.apache.lucene.util.LuceneTestCase$TestResultInterceptorRule$1.evaluate(LuceneTestCase.java:613)
	at org.apache.lucene.util.UncaughtExceptionsRule$1.evaluate(UncaughtExceptionsRule.java:75)
	at org.apache.lucene.util.LuceneTestCase$SaveThreadAndTestNameRule$1.evaluate(LuceneTestCase.java:652)
	at com.carrotsearch.randomizedtesting.RandomizedRunner.runSingleTest(RandomizedRunner.java:755)
	at com.carrotsearch.randomizedtesting.RandomizedRunner.access$600(RandomizedRunner.java:142)
	at com.carrotsearch.randomizedtesting.RandomizedRunner$3$1.run(RandomizedRunner.java:606)
	at com.carrotsearch.randomizedtesting.RandomizedRunner$3.evaluate(RandomizedRunner.java:625)
	at com.carrotsearch.randomizedtesting.RandomizedRunner$4.evaluate(RandomizedRunner.java:661)
	at com.carrotsearch.randomizedtesting.RandomizedRunner$5.evaluate(RandomizedRunner.java:672)
	at org.apache.lucene.util.UncaughtExceptionsRule$1.evaluate(UncaughtExceptionsRule.java:75)
	at org.apache.lucene.util.StoreClassNameRule$1.evaluate(StoreClassNameRule.java:38)
	at org.apache.lucene.util.SystemPropertiesInvariantRule$1.evaluate(SystemPropertiesInvariantRule.java:69)
	at com.carrotsearch.randomizedtesting.RandomizedRunner.runSuite(RandomizedRunner.java:553)
	at com.carrotsearch.randomizedtesting.RandomizedRunner.access$400(RandomizedRunner.java:142)
	at com.carrotsearch.randomizedtesting.RandomizedRunner$2.run(RandomizedRunner.java:499)


FAILED:  org.apache.lucene.search.TestFilteredQuery.initializationError

Error Message:
org/apache/lucene/search/TestFilteredQuery$2

Stack Trace:
java.lang.NoClassDefFoundError: org/apache/lucene/search/TestFilteredQuery$2
	at java.lang.Class.getDeclaredMethods0(Native Method)
	at java.lang.Class.privateGetDeclaredMethods(Class.java:2444)
	at java.lang.Class.getDeclaredMethods(Class.java:1808)
	at com.carrotsearch.randomizedtesting.MethodCollector.allDeclaredMethods(MethodCollector.java:127)
	at com.carrotsearch.randomizedtesting.RandomizedRunner.<init>(RandomizedRunner.java:376)
	at sun.reflect.GeneratedConstructorAccessor18.newInstance(Unknown Source)
	at sun.reflect.DelegatingConstructorAccessorImpl.newInstance(DelegatingConstructorAccessorImpl.java:45)
	at java.lang.reflect.Constructor.newInstance(Constructor.java:532)
	at org.junit.internal.builders.AnnotatedBuilder.buildRunner(AnnotatedBuilder.java:31)
	at org.junit.internal.builders.AnnotatedBuilder.runnerForClass(AnnotatedBuilder.java:24)
	at org.junit.runners.model.RunnerBuilder.safeRunnerForClass(RunnerBuilder.java:57)
	at org.junit.internal.builders.AllDefaultPossibilitiesBuilder.runnerForClass(AllDefaultPossibilitiesBuilder.java:29)
	at org.junit.runners.model.RunnerBuilder.safeRunnerForClass(RunnerBuilder.java:57)
	at org.junit.internal.requests.ClassRequest.getRunner(ClassRequest.java:24)
	at com.carrotsearch.ant.tasks.junit4.slave.SlaveMain.execute(SlaveMain.java:127)
	at com.carrotsearch.ant.tasks.junit4.slave.SlaveMain.main(SlaveMain.java:202)
	at com.carrotsearch.ant.tasks.junit4.slave.SlaveMainSafe.main(SlaveMainSafe.java:12)
Caused by: java.lang.ClassNotFoundException: org.apache.lucene.search.TestFilteredQuery$2
	at java.net.URLClassLoader$1.run(URLClassLoader.java:214)
	at java.security.AccessController.doPrivileged(Native Method)
	at java.net.URLClassLoader.findClass(URLClassLoader.java:205)
	at java.lang.ClassLoader.loadClass(ClassLoader.java:321)
	at sun.misc.Launcher$AppClassLoader.loadClass(Launcher.java:294)
	at java.lang.ClassLoader.loadClass(ClassLoader.java:266)
	... 17 more
Caused by: java.io.FileNotFoundException: /usr/home/hudson/hudson-slave/workspace/Lucene-Solr-tests-only-trunk/checkout/lucene/build/core/classes/test/org/apache/lucene/search/TestFilteredQuery$2.class (Too many open files in system)
	at java.io.FileInputStream.open(Native Method)
	at java.io.FileInputStream.<init>(FileInputStream.java:137)
	at sun.misc.URLClassPath$FileLoader$1.getInputStream(URLClassPath.java:1005)
	at sun.misc.Resource.cachedInputStream(Resource.java:77)
	at sun.misc.Resource.getByteBuffer(Resource.java:160)
	at java.net.URLClassLoader.defineClass(URLClassLoader.java:266)
	at java.net.URLClassLoader.access$000(URLClassLoader.java:73)
	at java.net.URLClassLoader$1.run(URLClassLoader.java:212)
	... 22 more


REGRESSION:  org.apache.lucene.search.TestNRTManager.testNRTManager

Error Message:
CheckIndex failed

Stack Trace:
java.lang.RuntimeException: CheckIndex failed
	at __randomizedtesting.SeedInfo.seed([46D52DA72AB672EF:45BAD1BCE47C7931]:0)
	at org.apache.lucene.util._TestUtil.checkIndex(_TestUtil.java:173)
	at org.apache.lucene.util._TestUtil.checkIndex(_TestUtil.java:161)
	at org.apache.lucene.index.ThreadedIndexingAndSearchingTestCase.runTest(ThreadedIndexingAndSearchingTestCase.java:611)
	at org.apache.lucene.search.TestNRTManager.testNRTManager(TestNRTManager.java:53)
	at sun.reflect.NativeMethodAccessorImpl.invoke0(Native Method)
	at sun.reflect.NativeMethodAccessorImpl.invoke(NativeMethodAccessorImpl.java:57)
	at sun.reflect.DelegatingMethodAccessorImpl.invoke(DelegatingMethodAccessorImpl.java:43)
	at java.lang.reflect.Method.invoke(Method.java:616)
	at com.carrotsearch.randomizedtesting.RandomizedRunner.invoke(RandomizedRunner.java:1844)
	at com.carrotsearch.randomizedtesting.RandomizedRunner.access$1000(RandomizedRunner.java:142)
	at com.carrotsearch.randomizedtesting.RandomizedRunner$6.evaluate(RandomizedRunner.java:748)
	at com.carrotsearch.randomizedtesting.RandomizedRunner$7.evaluate(RandomizedRunner.java:809)
	at com.carrotsearch.randomizedtesting.RandomizedRunner$8.evaluate(RandomizedRunner.java:823)
	at org.apache.lucene.util.LuceneTestCase$SubclassSetupTeardownRule$1.evaluate(LuceneTestCase.java:758)
	at org.apache.lucene.util.LuceneTestCase$InternalSetupTeardownRule$1.evaluate(LuceneTestCase.java:680)
	at org.apache.lucene.util.SystemPropertiesInvariantRule$1.evaluate(SystemPropertiesInvariantRule.java:69)
	at org.apache.lucene.util.LuceneTestCase$TestResultInterceptorRule$1.evaluate(LuceneTestCase.java:613)
	at org.apache.lucene.util.UncaughtExceptionsRule$1.evaluate(UncaughtExceptionsRule.java:75)
	at org.apache.lucene.util.LuceneTestCase$SaveThreadAndTestNameRule$1.evaluate(LuceneTestCase.java:652)
	at com.carrotsearch.randomizedtesting.RandomizedRunner.runSingleTest(RandomizedRunner.java:755)
	at com.carrotsearch.randomizedtesting.RandomizedRunner.access$600(RandomizedRunner.java:142)
	at com.carrotsearch.randomizedtesting.RandomizedRunner$3$1.run(RandomizedRunner.java:606)
	at com.carrotsearch.randomizedtesting.RandomizedRunner$3.evaluate(RandomizedRunner.java:625)
	at com.carrotsearch.randomizedtesting.RandomizedRunner$4.evaluate(RandomizedRunner.java:661)
	at com.carrotsearch.randomizedtesting.RandomizedRunner$5.evaluate(RandomizedRunner.java:672)
	at org.apache.lucene.util.UncaughtExceptionsRule$1.evaluate(UncaughtExceptionsRule.java:75)
	at org.apache.lucene.util.StoreClassNameRule$1.evaluate(StoreClassNameRule.java:38)
	at org.apache.lucene.util.SystemPropertiesInvariantRule$1.evaluate(SystemPropertiesInvariantRule.java:69)
	at com.carrotsearch.randomizedtesting.RandomizedRunner.runSuite(RandomizedRunner.java:553)
	at com.carrotsearch.randomizedtesting.RandomizedRunner.access$400(RandomizedRunner.java:142)
	at com.carrotsearch.randomizedtesting.RandomizedRunner$2.run(RandomizedRunner.java:499)


REGRESSION:  org.apache.lucene.search.TestSearcherManager.testSearcherManager

Error Message:
Thread threw an uncaught exception, thread: Thread[Thread-99,5,]

Stack Trace:
java.lang.RuntimeException: Thread threw an uncaught exception, thread: Thread[Thread-99,5,]
	at com.carrotsearch.randomizedtesting.RunnerThreadGroup.processUncaught(RunnerThreadGroup.java:96)
	at com.carrotsearch.randomizedtesting.RandomizedRunner.runSingleTest(RandomizedRunner.java:791)
	at com.carrotsearch.randomizedtesting.RandomizedRunner.access$600(RandomizedRunner.java:142)
	at com.carrotsearch.randomizedtesting.RandomizedRunner$3$1.run(RandomizedRunner.java:606)
	at com.carrotsearch.randomizedtesting.RandomizedRunner$3.evaluate(RandomizedRunner.java:625)
	at com.carrotsearch.randomizedtesting.RandomizedRunner$4.evaluate(RandomizedRunner.java:661)
	at com.carrotsearch.randomizedtesting.RandomizedRunner$5.evaluate(RandomizedRunner.java:672)
	at org.apache.lucene.util.UncaughtExceptionsRule$1.evaluate(UncaughtExceptionsRule.java:75)
	at org.apache.lucene.util.StoreClassNameRule$1.evaluate(StoreClassNameRule.java:38)
	at org.apache.lucene.util.SystemPropertiesInvariantRule$1.evaluate(SystemPropertiesInvariantRule.java:69)
	at com.carrotsearch.randomizedtesting.RandomizedRunner.runSuite(RandomizedRunner.java:553)
	at com.carrotsearch.randomizedtesting.RandomizedRunner.access$400(RandomizedRunner.java:142)
	at com.carrotsearch.randomizedtesting.RandomizedRunner$2.run(RandomizedRunner.java:499)
Caused by: java.lang.RuntimeException: java.io.FileNotFoundException: /usr/home/hudson/hudson-slave/workspace/Lucene-Solr-tests-only-trunk/checkout/lucene/build/core/test/S3/TestSearcherManager7495874972tmp/_1.tvf (Too many open files in system)
	at __randomizedtesting.SeedInfo.seed([46D52DA72AB672EF]:0)
	at org.apache.lucene.index.ThreadedIndexingAndSearchingTestCase$1.run(ThreadedIndexingAndSearchingTestCase.java:303)
Caused by: java.io.FileNotFoundException: /usr/home/hudson/hudson-slave/workspace/Lucene-Solr-tests-only-trunk/checkout/lucene/build/core/test/S3/TestSearcherManager7495874972tmp/_1.tvf (Too many open files in system)
	at java.io.RandomAccessFile.open(Native Method)
	at java.io.RandomAccessFile.<init>(RandomAccessFile.java:233)
	at org.apache.lucene.store.FSDirectory$FSIndexOutput.<init>(FSDirectory.java:449)
	at org.apache.lucene.store.FSDirectory.createOutput(FSDirectory.java:288)
	at org.apache.lucene.store.MockDirectoryWrapper.createOutput(MockDirectoryWrapper.java:450)
	at org.apache.lucene.codecs.lucene40.Lucene40TermVectorsWriter.<init>(Lucene40TermVectorsWriter.java:65)
	at org.apache.lucene.codecs.lucene40.Lucene40TermVectorsFormat.vectorsWriter(Lucene40TermVectorsFormat.java:40)
	at org.apache.lucene.index.TermVectorsConsumer.initTermVectorsWriter(TermVectorsConsumer.java:87)
	at org.apache.lucene.index.TermVectorsConsumer.finishDocument(TermVectorsConsumer.java:101)
	at org.apache.lucene.index.TermsHash.finishDocument(TermsHash.java:138)
	at org.apache.lucene.index.DocInverter.finishDocument(DocInverter.java:68)
	at org.apache.lucene.index.DocFieldProcessor.finishDocument(DocFieldProcessor.java:307)
	at org.apache.lucene.index.DocumentsWriterPerThread.updateDocument(DocumentsWriterPerThread.java:259)
	at org.apache.lucene.index.DocumentsWriter.updateDocument(DocumentsWriter.java:376)
	at org.apache.lucene.index.IndexWriter.updateDocument(IndexWriter.java:1276)
	at org.apache.lucene.index.IndexWriter.updateDocument(IndexWriter.java:1248)
	at org.apache.lucene.index.ThreadedIndexingAndSearchingTestCase.updateDocument(ThreadedIndexingAndSearchingTestCase.java:107)
	at org.apache.lucene.index.ThreadedIndexingAndSearchingTestCase$1.run(ThreadedIndexingAndSearchingTestCase.java:255)


FAILED:  org.apache.lucene.search.TestShardSearching.testSimple

Error Message:
/usr/home/hudson/hudson-slave/workspace/Lucene-Solr-tests-only-trunk/checkout/lucene/build/core/test/S0/TestShardSearching5658756678tmp.0/_9_1.frq (Too many open files in system)

Stack Trace:
java.io.FileNotFoundException: /usr/home/hudson/hudson-slave/workspace/Lucene-Solr-tests-only-trunk/checkout/lucene/build/core/test/S0/TestShardSearching5658756678tmp.0/_9_1.frq (Too many open files in system)
	at __randomizedtesting.SeedInfo.seed([46D52DA72AB672EF:7E6609590D45A63E]:0)
	at java.io.RandomAccessFile.open(Native Method)
	at java.io.RandomAccessFile.<init>(RandomAccessFile.java:233)
	at org.apache.lucene.store.FSDirectory$FSIndexOutput.<init>(FSDirectory.java:449)
	at org.apache.lucene.store.FSDirectory.createOutput(FSDirectory.java:288)
	at org.apache.lucene.store.MockDirectoryWrapper.createOutput(MockDirectoryWrapper.java:450)
	at org.apache.lucene.codecs.lucene40.Lucene40PostingsWriter.<init>(Lucene40PostingsWriter.java:98)
	at org.apache.lucene.codecs.lucene40.Lucene40PostingsWriter.<init>(Lucene40PostingsWriter.java:89)
	at org.apache.lucene.codecs.lucene40ords.Lucene40WithOrds.fieldsConsumer(Lucene40WithOrds.java:52)
	at org.apache.lucene.codecs.perfield.PerFieldPostingsFormat$FieldsWriter.addField(PerFieldPostingsFormat.java:126)
	at org.apache.lucene.index.FreqProxTermsWriterPerField.flush(FreqProxTermsWriterPerField.java:322)
	at org.apache.lucene.index.FreqProxTermsWriter.flush(FreqProxTermsWriter.java:92)
	at org.apache.lucene.index.TermsHash.flush(TermsHash.java:117)
	at org.apache.lucene.index.DocInverter.flush(DocInverter.java:53)
	at org.apache.lucene.index.DocFieldProcessor.flush(DocFieldProcessor.java:81)
	at org.apache.lucene.index.DocumentsWriterPerThread.flush(DocumentsWriterPerThread.java:475)
	at org.apache.lucene.index.DocumentsWriter.doFlush(DocumentsWriter.java:422)
	at org.apache.lucene.index.DocumentsWriter.flushAllThreads(DocumentsWriter.java:553)
	at org.apache.lucene.index.IndexWriter.doFlush(IndexWriter.java:2640)
	at org.apache.lucene.index.IndexWriter.flush(IndexWriter.java:2616)
	at org.apache.lucene.index.IndexWriter.closeInternal(IndexWriter.java:851)
	at org.apache.lucene.index.IndexWriter.close(IndexWriter.java:810)
	at org.apache.lucene.index.IndexWriter.close(IndexWriter.java:774)
	at org.apache.lucene.search.ShardSearchingTestBase$NodeState.close(ShardSearchingTestBase.java:509)
	at org.apache.lucene.search.ShardSearchingTestBase.finish(ShardSearchingTestBase.java:597)
	at org.apache.lucene.search.TestShardSearching.testSimple(TestShardSearching.java:270)
	at sun.reflect.NativeMethodAccessorImpl.invoke0(Native Method)
	at sun.reflect.NativeMethodAccessorImpl.invoke(NativeMethodAccessorImpl.java:57)
	at sun.reflect.DelegatingMethodAccessorImpl.invoke(DelegatingMethodAccessorImpl.java:43)
	at java.lang.reflect.Method.invoke(Method.java:616)
	at com.carrotsearch.randomizedtesting.RandomizedRunner.invoke(RandomizedRunner.java:1844)
	at com.carrotsearch.randomizedtesting.RandomizedRunner.access$1000(RandomizedRunner.java:142)
	at com.carrotsearch.randomizedtesting.RandomizedRunner$6.evaluate(RandomizedRunner.java:748)
	at com.carrotsearch.randomizedtesting.RandomizedRunner$7.evaluate(RandomizedRunner.java:809)
	at com.carrotsearch.randomizedtesting.RandomizedRunner$8.evaluate(RandomizedRunner.java:823)
	at org.apache.lucene.util.LuceneTestCase$SubclassSetupTeardownRule$1.evaluate(LuceneTestCase.java:758)
	at org.apache.lucene.util.LuceneTestCase$InternalSetupTeardownRule$1.evaluate(LuceneTestCase.java:680)
	at org.apache.lucene.util.SystemPropertiesInvariantRule$1.evaluate(SystemPropertiesInvariantRule.java:69)
	at org.apache.lucene.util.LuceneTestCase$TestResultInterceptorRule$1.evaluate(LuceneTestCase.java:613)
	at org.apache.lucene.util.UncaughtExceptionsRule$1.evaluate(UncaughtExceptionsRule.java:75)
	at org.apache.lucene.util.LuceneTestCase$SaveThreadAndTestNameRule$1.evaluate(LuceneTestCase.java:652)
	at com.carrotsearch.randomizedtesting.RandomizedRunner.runSingleTest(RandomizedRunner.java:755)
	at com.carrotsearch.randomizedtesting.RandomizedRunner.access$600(RandomizedRunner.java:142)
	at com.carrotsearch.randomizedtesting.RandomizedRunner$3$1.run(RandomizedRunner.java:606)
	at com.carrotsearch.randomizedtesting.RandomizedRunner$3.evaluate(RandomizedRunner.java:625)
	at com.carrotsearch.randomizedtesting.RandomizedRunner$4.evaluate(RandomizedRunner.java:661)
	at com.carrotsearch.randomizedtesting.RandomizedRunner$5.evaluate(RandomizedRunner.java:672)
	at org.apache.lucene.util.UncaughtExceptionsRule$1.evaluate(UncaughtExceptionsRule.java:75)
	at org.apache.lucene.util.StoreClassNameRule$1.evaluate(StoreClassNameRule.java:38)
	at org.apache.lucene.util.SystemPropertiesInvariantRule$1.evaluate(SystemPropertiesInvariantRule.java:69)
	at com.carrotsearch.randomizedtesting.RandomizedRunner.runSuite(RandomizedRunner.java:553)
	at com.carrotsearch.randomizedtesting.RandomizedRunner.access$400(RandomizedRunner.java:142)
	at com.carrotsearch.randomizedtesting.RandomizedRunner$2.run(RandomizedRunner.java:499)


FAILED:  junit.framework.TestSuite.org.apache.lucene.store.TestRAMDirectory

Error Message:
org.apache.lucene.store.TestRAMDirectory

Stack Trace:
java.lang.ClassNotFoundException: org.apache.lucene.store.TestRAMDirectory
	at java.net.URLClassLoader$1.run(URLClassLoader.java:214)
	at java.security.AccessController.doPrivileged(Native Method)
	at java.net.URLClassLoader.findClass(URLClassLoader.java:205)
	at java.lang.ClassLoader.loadClass(ClassLoader.java:321)
	at sun.misc.Launcher$AppClassLoader.loadClass(Launcher.java:294)
	at java.lang.ClassLoader.loadClass(ClassLoader.java:266)
	at java.lang.Class.forName0(Native Method)
	at java.lang.Class.forName(Class.java:264)
	at com.carrotsearch.ant.tasks.junit4.slave.SlaveMain.instantiate(SlaveMain.java:143)
	at com.carrotsearch.ant.tasks.junit4.slave.SlaveMain.execute(SlaveMain.java:121)
	at com.carrotsearch.ant.tasks.junit4.slave.SlaveMain.main(SlaveMain.java:202)
	at com.carrotsearch.ant.tasks.junit4.slave.SlaveMainSafe.main(SlaveMainSafe.java:12)
Caused by: java.io.FileNotFoundException: /usr/home/hudson/hudson-slave/workspace/Lucene-Solr-tests-only-trunk/checkout/lucene/build/core/classes/test/org/apache/lucene/store/TestRAMDirectory.class (Too many open files in system)
	at java.io.FileInputStream.open(Native Method)
	at java.io.FileInputStream.<init>(FileInputStream.java:137)
	at sun.misc.URLClassPath$FileLoader$1.getInputStream(URLClassPath.java:1005)
	at sun.misc.Resource.cachedInputStream(Resource.java:77)
	at sun.misc.Resource.getByteBuffer(Resource.java:160)
	at java.net.URLClassLoader.defineClass(URLClassLoader.java:266)
	at java.net.URLClassLoader.access$000(URLClassLoader.java:73)
	at java.net.URLClassLoader$1.run(URLClassLoader.java:212)
	... 11 more


FAILED:  junit.framework.TestSuite.org.apache.lucene.util.TestCharsRef

Error Message:
org.apache.lucene.util.TestCharsRef

Stack Trace:
java.lang.ClassNotFoundException: org.apache.lucene.util.TestCharsRef
	at java.net.URLClassLoader$1.run(URLClassLoader.java:214)
	at java.security.AccessController.doPrivileged(Native Method)
	at java.net.URLClassLoader.findClass(URLClassLoader.java:205)
	at java.lang.ClassLoader.loadClass(ClassLoader.java:321)
	at sun.misc.Launcher$AppClassLoader.loadClass(Launcher.java:294)
	at java.lang.ClassLoader.loadClass(ClassLoader.java:266)
	at java.lang.Class.forName0(Native Method)
	at java.lang.Class.forName(Class.java:264)
	at com.carrotsearch.ant.tasks.junit4.slave.SlaveMain.instantiate(SlaveMain.java:143)
	at com.carrotsearch.ant.tasks.junit4.slave.SlaveMain.execute(SlaveMain.java:121)
	at com.carrotsearch.ant.tasks.junit4.slave.SlaveMain.main(SlaveMain.java:202)
	at com.carrotsearch.ant.tasks.junit4.slave.SlaveMainSafe.main(SlaveMainSafe.java:12)
Caused by: java.io.FileNotFoundException: /usr/home/hudson/hudson-slave/workspace/Lucene-Solr-tests-only-trunk/checkout/lucene/build/core/classes/test/org/apache/lucene/util/TestCharsRef.class (Too many open files in system)
	at java.io.FileInputStream.open(Native Method)
	at java.io.FileInputStream.<init>(FileInputStream.java:137)
	at sun.misc.URLClassPath$FileLoader$1.getInputStream(URLClassPath.java:1005)
	at sun.misc.Resource.cachedInputStream(Resource.java:77)
	at sun.misc.Resource.getByteBuffer(Resource.java:160)
	at java.net.URLClassLoader.defineClass(URLClassLoader.java:266)
	at java.net.URLClassLoader.access$000(URLClassLoader.java:73)
	at java.net.URLClassLoader$1.run(URLClassLoader.java:212)
	... 11 more


FAILED:  org.apache.lucene.index.TestBinaryTerms.testBinary

Error Message:
/usr/home/hudson/hudson-slave/workspace/Lucene-Solr-tests-only-trunk/checkout/lucene/build/core/test/S1/index2077220820tmp/_0_0.tii (Too many open files in system)

Stack Trace:
java.io.FileNotFoundException: /usr/home/hudson/hudson-slave/workspace/Lucene-Solr-tests-only-trunk/checkout/lucene/build/core/test/S1/index2077220820tmp/_0_0.tii (Too many open files in system)
	at __randomizedtesting.SeedInfo.seed([46D52DA72AB672EF:6561C0A076750C00]:0)
	at java.io.RandomAccessFile.open(Native Method)
	at java.io.RandomAccessFile.<init>(RandomAccessFile.java:233)
	at org.apache.lucene.store.FSDirectory$FSIndexOutput.<init>(FSDirectory.java:449)
	at org.apache.lucene.store.FSDirectory.createOutput(FSDirectory.java:288)
	at org.apache.lucene.store.MockDirectoryWrapper.createOutput(MockDirectoryWrapper.java:450)
	at org.apache.lucene.codecs.FixedGapTermsIndexWriter.<init>(FixedGapTermsIndexWriter.java:62)
	at org.apache.lucene.codecs.mockintblock.MockVariableIntBlockPostingsFormat.fieldsConsumer(MockVariableIntBlockPostingsFormat.java:156)
	at org.apache.lucene.codecs.perfield.PerFieldPostingsFormat$FieldsWriter.addField(PerFieldPostingsFormat.java:126)
	at org.apache.lucene.index.FreqProxTermsWriterPerField.flush(FreqProxTermsWriterPerField.java:322)
	at org.apache.lucene.index.FreqProxTermsWriter.flush(FreqProxTermsWriter.java:92)
	at org.apache.lucene.index.TermsHash.flush(TermsHash.java:117)
	at org.apache.lucene.index.DocInverter.flush(DocInverter.java:53)
	at org.apache.lucene.index.DocFieldProcessor.flush(DocFieldProcessor.java:81)
	at org.apache.lucene.index.DocumentsWriterPerThread.flush(DocumentsWriterPerThread.java:475)
	at org.apache.lucene.index.DocumentsWriter.doFlush(DocumentsWriter.java:422)
	at org.apache.lucene.index.DocumentsWriter.flushAllThreads(DocumentsWriter.java:553)
	at org.apache.lucene.index.IndexWriter.prepareCommit(IndexWriter.java:2416)
	at org.apache.lucene.index.IndexWriter.commitInternal(IndexWriter.java:2548)
	at org.apache.lucene.index.IndexWriter.commit(IndexWriter.java:2530)
	at org.apache.lucene.index.IndexWriter.commit(IndexWriter.java:2514)
	at org.apache.lucene.index.RandomIndexWriter.getReader(RandomIndexWriter.java:392)
	at org.apache.lucene.index.RandomIndexWriter.getReader(RandomIndexWriter.java:341)
	at org.apache.lucene.index.TestBinaryTerms.testBinary(TestBinaryTerms.java:59)
	at sun.reflect.NativeMethodAccessorImpl.invoke0(Native Method)
	at sun.reflect.NativeMethodAccessorImpl.invoke(NativeMethodAccessorImpl.java:57)
	at sun.reflect.DelegatingMethodAccessorImpl.invoke(DelegatingMethodAccessorImpl.java:43)
	at java.lang.reflect.Method.invoke(Method.java:616)
	at com.carrotsearch.randomizedtesting.RandomizedRunner.invoke(RandomizedRunner.java:1844)
	at com.carrotsearch.randomizedtesting.RandomizedRunner.access$1000(RandomizedRunner.java:142)
	at com.carrotsearch.randomizedtesting.RandomizedRunner$6.evaluate(RandomizedRunner.java:748)
	at com.carrotsearch.randomizedtesting.RandomizedRunner$7.evaluate(RandomizedRunner.java:809)
	at com.carrotsearch.randomizedtesting.RandomizedRunner$8.evaluate(RandomizedRunner.java:823)
	at org.apache.lucene.util.LuceneTestCase$SubclassSetupTeardownRule$1.evaluate(LuceneTestCase.java:758)
	at org.apache.lucene.util.LuceneTestCase$InternalSetupTeardownRule$1.evaluate(LuceneTestCase.java:680)
	at org.apache.lucene.util.SystemPropertiesInvariantRule$1.evaluate(SystemPropertiesInvariantRule.java:69)
	at org.apache.lucene.util.LuceneTestCase$TestResultInterceptorRule$1.evaluate(LuceneTestCase.java:613)
	at org.apache.lucene.util.UncaughtExceptionsRule$1.evaluate(UncaughtExceptionsRule.java:75)
	at org.apache.lucene.util.LuceneTestCase$SaveThreadAndTestNameRule$1.evaluate(LuceneTestCase.java:652)
	at com.carrotsearch.randomizedtesting.RandomizedRunner.runSingleTest(RandomizedRunner.java:755)
	at com.carrotsearch.randomizedtesting.RandomizedRunner.access$600(RandomizedRunner.java:142)
	at com.carrotsearch.randomizedtesting.RandomizedRunner$3$1.run(RandomizedRunner.java:606)
	at com.carrotsearch.randomizedtesting.RandomizedRunner$3.evaluate(RandomizedRunner.java:625)
	at com.carrotsearch.randomizedtesting.RandomizedRunner$4.evaluate(RandomizedRunner.java:661)
	at com.carrotsearch.randomizedtesting.RandomizedRunner$5.evaluate(RandomizedRunner.java:672)
	at org.apache.lucene.util.UncaughtExceptionsRule$1.evaluate(UncaughtExceptionsRule.java:75)
	at org.apache.lucene.util.StoreClassNameRule$1.evaluate(StoreClassNameRule.java:38)
	at org.apache.lucene.util.SystemPropertiesInvariantRule$1.evaluate(SystemPropertiesInvariantRule.java:69)
	at com.carrotsearch.randomizedtesting.RandomizedRunner.runSuite(RandomizedRunner.java:553)
	at com.carrotsearch.randomizedtesting.RandomizedRunner.access$400(RandomizedRunner.java:142)
	at com.carrotsearch.randomizedtesting.RandomizedRunner$2.run(RandomizedRunner.java:499)


FAILED:  org.apache.lucene.index.TestNeverDelete.testIndexing

Error Message:
Thread threw an uncaught exception, thread: Thread[Lucene Merge Thread #0,6,]

Stack Trace:
java.lang.RuntimeException: Thread threw an uncaught exception, thread: Thread[Lucene Merge Thread #0,6,]
	at com.carrotsearch.randomizedtesting.RunnerThreadGroup.processUncaught(RunnerThreadGroup.java:96)
	at com.carrotsearch.randomizedtesting.RandomizedRunner.runSingleTest(RandomizedRunner.java:791)
	at com.carrotsearch.randomizedtesting.RandomizedRunner.access$600(RandomizedRunner.java:142)
	at com.carrotsearch.randomizedtesting.RandomizedRunner$3$1.run(RandomizedRunner.java:606)
	at com.carrotsearch.randomizedtesting.RandomizedRunner$3.evaluate(RandomizedRunner.java:625)
	at com.carrotsearch.randomizedtesting.RandomizedRunner$4.evaluate(RandomizedRunner.java:661)
	at com.carrotsearch.randomizedtesting.RandomizedRunner$5.evaluate(RandomizedRunner.java:672)
	at org.apache.lucene.util.UncaughtExceptionsRule$1.evaluate(UncaughtExceptionsRule.java:75)
	at org.apache.lucene.util.StoreClassNameRule$1.evaluate(StoreClassNameRule.java:38)
	at org.apache.lucene.util.SystemPropertiesInvariantRule$1.evaluate(SystemPropertiesInvariantRule.java:69)
	at com.carrotsearch.randomizedtesting.RandomizedRunner.runSuite(RandomizedRunner.java:553)
	at com.carrotsearch.randomizedtesting.RandomizedRunner.access$400(RandomizedRunner.java:142)
	at com.carrotsearch.randomizedtesting.RandomizedRunner$2.run(RandomizedRunner.java:499)
Caused by: org.apache.lucene.index.MergePolicy$MergeException: java.io.FileNotFoundException: /usr/home/hudson/hudson-slave/workspace/Lucene-Solr-tests-only-trunk/checkout/lucene/build/core/test/S0/TestNeverDelete5658756677tmp/_d_0.pos (Too many open files in system)
	at __randomizedtesting.SeedInfo.seed([46D52DA72AB672EF]:0)
	at org.apache.lucene.index.ConcurrentMergeScheduler.handleMergeException(ConcurrentMergeScheduler.java:507)
	at org.apache.lucene.index.ConcurrentMergeScheduler$MergeThread.run(ConcurrentMergeScheduler.java:480)
Caused by: java.io.FileNotFoundException: /usr/home/hudson/hudson-slave/workspace/Lucene-Solr-tests-only-trunk/checkout/lucene/build/core/test/S0/TestNeverDelete5658756677tmp/_d_0.pos (Too many open files in system)
	at java.io.RandomAccessFile.open(Native Method)
	at java.io.RandomAccessFile.<init>(RandomAccessFile.java:233)
	at org.apache.lucene.store.SimpleFSDirectory$SimpleFSIndexInput$Descriptor.<init>(SimpleFSDirectory.java:98)
	at org.apache.lucene.store.SimpleFSDirectory$SimpleFSIndexInput.<init>(SimpleFSDirectory.java:121)
	at org.apache.lucene.store.SimpleFSDirectory.openInput(SimpleFSDirectory.java:60)
	at org.apache.lucene.store.MockDirectoryWrapper.openInput(MockDirectoryWrapper.java:503)
	at org.apache.lucene.codecs.mockintblock.MockFixedIntBlockPostingsFormat$MockIntFactory.openInput(MockFixedIntBlockPostingsFormat.java:87)
	at org.apache.lucene.codecs.sep.SepPostingsReader.<init>(SepPostingsReader.java:78)
	at org.apache.lucene.codecs.mockintblock.MockFixedIntBlockPostingsFormat.fieldsProducer(MockFixedIntBlockPostingsFormat.java:159)
	at org.apache.lucene.codecs.perfield.PerFieldPostingsFormat$FieldsReader$1.visitOneFormat(PerFieldPostingsFormat.java:197)
	at org.apache.lucene.codecs.perfield.PerFieldPostingsFormat$VisitPerFieldFile.<init>(PerFieldPostingsFormat.java:288)
	at org.apache.lucene.codecs.perfield.PerFieldPostingsFormat$FieldsReader$1.<init>(PerFieldPostingsFormat.java:194)
	at org.apache.lucene.codecs.perfield.PerFieldPostingsFormat$FieldsReader.<init>(PerFieldPostingsFormat.java:194)
	at org.apache.lucene.codecs.perfield.PerFieldPostingsFormat.fieldsProducer(PerFieldPostingsFormat.java:264)
	at org.apache.lucene.index.SegmentCoreReaders.<init>(SegmentCoreReaders.java:108)
	at org.apache.lucene.index.SegmentReader.<init>(SegmentReader.java:55)
	at org.apache.lucene.index.ReadersAndLiveDocs.getMergeReader(ReadersAndLiveDocs.java:152)
	at org.apache.lucene.index.IndexWriter.mergeMiddle(IndexWriter.java:3344)
	at org.apache.lucene.index.IndexWriter.merge(IndexWriter.java:3004)
	at org.apache.lucene.index.ConcurrentMergeScheduler.doMerge(ConcurrentMergeScheduler.java:382)
	at org.apache.lucene.index.ConcurrentMergeScheduler$MergeThread.run(ConcurrentMergeScheduler.java:451)




Build Log (for compile errors):
[...truncated 6756 lines...]



Mime
View raw message