lucene-dev mailing list archives

Site index · List index
Message view « Date » · « Thread »
Top « Date » · « Thread »
From Apache Jenkins Server <jenk...@builds.apache.org>
Subject [JENKINS] Lucene-Solr-tests-only-trunk - Build # 13139 - Failure
Date Sun, 15 Apr 2012 02:07:40 GMT
Build: https://builds.apache.org/job/Lucene-Solr-tests-only-trunk/13139/

1 tests failed.
REGRESSION:  org.apache.lucene.search.TestShardSearching.testSimple

Error Message:
Uncaught exception by thread: Thread[Thread-1073,5,]

Stack Trace:
org.apache.lucene.util.UncaughtExceptionsRule$UncaughtExceptionsInBackgroundThread: Uncaught
exception by thread: Thread[Thread-1073,5,]
	at org.apache.lucene.util.UncaughtExceptionsRule$1.evaluate(UncaughtExceptionsRule.java:84)
	at org.apache.lucene.util.LuceneTestCase$SaveThreadAndTestNameRule$1.evaluate(LuceneTestCase.java:642)
	at org.junit.rules.RunRules.evaluate(RunRules.java:18)
	at org.junit.runners.ParentRunner.runLeaf(ParentRunner.java:263)
	at org.junit.runners.BlockJUnit4ClassRunner.runChild(BlockJUnit4ClassRunner.java:68)
	at org.apache.lucene.util.LuceneTestCaseRunner.runChild(LuceneTestCaseRunner.java:164)
	at org.apache.lucene.util.LuceneTestCaseRunner.runChild(LuceneTestCaseRunner.java:57)
	at org.junit.runners.ParentRunner$3.run(ParentRunner.java:231)
	at org.junit.runners.ParentRunner$1.schedule(ParentRunner.java:60)
	at org.junit.runners.ParentRunner.runChildren(ParentRunner.java:229)
	at org.junit.runners.ParentRunner.access$000(ParentRunner.java:50)
	at org.junit.runners.ParentRunner$2.evaluate(ParentRunner.java:222)
	at org.junit.internal.runners.statements.RunBefores.evaluate(RunBefores.java:28)
	at org.junit.internal.runners.statements.RunAfters.evaluate(RunAfters.java:30)
	at org.apache.lucene.util.UncaughtExceptionsRule$1.evaluate(UncaughtExceptionsRule.java:75)
	at org.apache.lucene.util.StoreClassNameRule$1.evaluate(StoreClassNameRule.java:38)
	at org.apache.lucene.util.SystemPropertiesInvariantRule$1.evaluate(SystemPropertiesInvariantRule.java:69)
	at org.junit.rules.RunRules.evaluate(RunRules.java:18)
	at org.junit.runners.ParentRunner.run(ParentRunner.java:300)
	at junit.framework.JUnit4TestAdapter.run(JUnit4TestAdapter.java:39)
	at org.apache.tools.ant.taskdefs.optional.junit.JUnitTestRunner.run(JUnitTestRunner.java:420)
	at org.apache.tools.ant.taskdefs.optional.junit.JUnitTestRunner.launch(JUnitTestRunner.java:911)
	at org.apache.tools.ant.taskdefs.optional.junit.JUnitTestRunner.main(JUnitTestRunner.java:743)
Caused by: java.lang.RuntimeException: java.io.FileNotFoundException: /usr/home/hudson/hudson-slave/workspace/Lucene-Solr-tests-only-trunk/checkout/lucene/build/core/test/4/TestShardSearching2223122258tmp.6/_i_1.pos
(Too many open files in system)
	at org.apache.lucene.search.ShardSearchingTestBase$ChangeIndices.run(ShardSearchingTestBase.java:549)
Caused by: java.io.FileNotFoundException: /usr/home/hudson/hudson-slave/workspace/Lucene-Solr-tests-only-trunk/checkout/lucene/build/core/test/4/TestShardSearching2223122258tmp.6/_i_1.pos
(Too many open files in system)
	at java.io.RandomAccessFile.open(Native Method)
	at java.io.RandomAccessFile.<init>(RandomAccessFile.java:233)
	at org.apache.lucene.store.FSDirectory$FSIndexOutput.<init>(FSDirectory.java:449)
	at org.apache.lucene.store.FSDirectory.createOutput(FSDirectory.java:288)
	at org.apache.lucene.store.MockDirectoryWrapper.createOutput(MockDirectoryWrapper.java:450)
	at org.apache.lucene.codecs.mockintblock.MockFixedIntBlockPostingsFormat$MockIntFactory.createOutput(MockFixedIntBlockPostingsFormat.java:105)
	at org.apache.lucene.codecs.sep.SepPostingsWriter.<init>(SepPostingsWriter.java:130)
	at org.apache.lucene.codecs.sep.SepPostingsWriter.<init>(SepPostingsWriter.java:105)
	at org.apache.lucene.codecs.mockintblock.MockFixedIntBlockPostingsFormat.fieldsConsumer(MockFixedIntBlockPostingsFormat.java:128)
	at org.apache.lucene.codecs.perfield.PerFieldPostingsFormat$FieldsWriter.addField(PerFieldPostingsFormat.java:126)
	at org.apache.lucene.index.FreqProxTermsWriterPerField.flush(FreqProxTermsWriterPerField.java:322)
	at org.apache.lucene.index.FreqProxTermsWriter.flush(FreqProxTermsWriter.java:92)
	at org.apache.lucene.index.TermsHash.flush(TermsHash.java:117)
	at org.apache.lucene.index.DocInverter.flush(DocInverter.java:53)
	at org.apache.lucene.index.DocFieldProcessor.flush(DocFieldProcessor.java:81)
	at org.apache.lucene.index.DocumentsWriterPerThread.flush(DocumentsWriterPerThread.java:475)
	at org.apache.lucene.index.DocumentsWriter.doFlush(DocumentsWriter.java:422)
	at org.apache.lucene.index.DocumentsWriter.flushAllThreads(DocumentsWriter.java:553)
	at org.apache.lucene.index.IndexWriter.getReader(IndexWriter.java:353)
	at org.apache.lucene.index.StandardDirectoryReader.doOpenFromWriter(StandardDirectoryReader.java:264)
	at org.apache.lucene.index.StandardDirectoryReader.doOpenIfChanged(StandardDirectoryReader.java:239)
	at org.apache.lucene.index.StandardDirectoryReader.doOpenIfChanged(StandardDirectoryReader.java:229)
	at org.apache.lucene.index.DirectoryReader.openIfChanged(DirectoryReader.java:165)
	at org.apache.lucene.search.SearcherManager.refreshIfNeeded(SearcherManager.java:118)
	at org.apache.lucene.search.SearcherManager.refreshIfNeeded(SearcherManager.java:58)
	at org.apache.lucene.search.ReferenceManager.maybeRefresh(ReferenceManager.java:137)
	at org.apache.lucene.search.ShardSearchingTestBase$NodeState.reopen(ShardSearchingTestBase.java:488)
	at org.apache.lucene.search.ShardSearchingTestBase$ChangeIndices.run(ShardSearchingTestBase.java:543)




Build Log (for compile errors):
[...truncated 1738 lines...]



Mime
View raw message