lucene-dev mailing list archives

Site index · List index
Message view « Date » · « Thread »
Top « Date » · « Thread »
From Michael McCandless <luc...@mikemccandless.com>
Subject Re: [JENKINS] Lucene-Solr-tests-only-3.x - Build # 12906 - Still Failing
Date Thu, 29 Mar 2012 15:36:17 GMT
I'll take this one... I broke the "ignore JVM bug" logic in this test...

Mike McCandless

http://blog.mikemccandless.com

On Thu, Mar 29, 2012 at 11:11 AM, Apache Jenkins Server
<jenkins@builds.apache.org> wrote:
> Build: https://builds.apache.org/job/Lucene-Solr-tests-only-3.x/12906/
>
> 1 tests failed.
> REGRESSION:  org.apache.lucene.analysis.miscellaneous.PatternAnalyzerTest.testRandomStrings
>
> Error Message:
> Uncaught exception by thread: Thread[Thread-56,5,]
>
> Stack Trace:
> org.apache.lucene.util.UncaughtExceptionsRule$UncaughtExceptionsInBackgroundThread: Uncaught
exception by thread: Thread[Thread-56,5,]
>        at org.apache.lucene.util.UncaughtExceptionsRule$1.evaluate(UncaughtExceptionsRule.java:83)
>        at org.apache.lucene.util.LuceneTestCase$SaveThreadAndTestNameRule$1.evaluate(LuceneTestCase.java:508)
>        at org.junit.rules.RunRules.evaluate(RunRules.java:18)
>        at org.junit.runners.ParentRunner.runLeaf(ParentRunner.java:263)
>        at org.junit.runners.BlockJUnit4ClassRunner.runChild(BlockJUnit4ClassRunner.java:68)
>        at org.apache.lucene.util.LuceneTestCaseRunner.runChild(LuceneTestCaseRunner.java:146)
>        at org.apache.lucene.util.LuceneTestCaseRunner.runChild(LuceneTestCaseRunner.java:50)
>        at org.junit.runners.ParentRunner$3.run(ParentRunner.java:231)
>        at org.junit.runners.ParentRunner$1.schedule(ParentRunner.java:60)
>        at org.junit.runners.ParentRunner.runChildren(ParentRunner.java:229)
>        at org.junit.runners.ParentRunner.access$000(ParentRunner.java:50)
>        at org.junit.runners.ParentRunner$2.evaluate(ParentRunner.java:222)
>        at org.junit.internal.runners.statements.RunBefores.evaluate(RunBefores.java:28)
>        at org.junit.internal.runners.statements.RunAfters.evaluate(RunAfters.java:30)
>        at org.apache.lucene.util.UncaughtExceptionsRule$1.evaluate(UncaughtExceptionsRule.java:74)
>        at org.apache.lucene.util.StoreClassNameRule$1.evaluate(StoreClassNameRule.java:36)
>        at org.apache.lucene.util.SystemPropertiesInvariantRule$1.evaluate(SystemPropertiesInvariantRule.java:67)
>        at org.junit.rules.RunRules.evaluate(RunRules.java:18)
>        at org.junit.runners.ParentRunner.run(ParentRunner.java:300)
>        at junit.framework.JUnit4TestAdapter.run(JUnit4TestAdapter.java:39)
>        at org.apache.tools.ant.taskdefs.optional.junit.JUnitTestRunner.run(JUnitTestRunner.java:420)
>        at org.apache.tools.ant.taskdefs.optional.junit.JUnitTestRunner.launch(JUnitTestRunner.java:911)
>        at org.apache.tools.ant.taskdefs.optional.junit.JUnitTestRunner.main(JUnitTestRunner.java:743)
> Caused by: java.lang.RuntimeException: java.lang.ArrayIndexOutOfBoundsException: 485
>        at org.apache.lucene.analysis.BaseTokenStreamTestCase.checkRandomData(BaseTokenStreamTestCase.java:398)
>        at org.apache.lucene.analysis.BaseTokenStreamTestCase.access$000(BaseTokenStreamTestCase.java:50)
>        at org.apache.lucene.analysis.BaseTokenStreamTestCase$AnalysisThread.run(BaseTokenStreamTestCase.java:336)
> Caused by: java.lang.ArrayIndexOutOfBoundsException: 485
>        at java.text.RuleBasedBreakIterator.lookupBackwardState(RuleBasedBreakIterator.java:1021)
>        at java.text.RuleBasedBreakIterator.handlePrevious(RuleBasedBreakIterator.java:972)
>        at java.text.RuleBasedBreakIterator.following(RuleBasedBreakIterator.java:770)
>        at java.text.RuleBasedBreakIterator.isBoundary(RuleBasedBreakIterator.java:811)
>        at java.lang.ConditionalSpecialCasing.isFinalCased(ConditionalSpecialCasing.java:206)
>        at java.lang.ConditionalSpecialCasing.isConditionMet(ConditionalSpecialCasing.java:171)
>        at java.lang.ConditionalSpecialCasing.lookUpTable(ConditionalSpecialCasing.java:158)
>        at java.lang.ConditionalSpecialCasing.toLowerCaseEx(ConditionalSpecialCasing.java:107)
>        at java.lang.String.toLowerCase(String.java:2453)
>        at org.apache.lucene.analysis.miscellaneous.PatternAnalyzer$PatternTokenizer.incrementToken(PatternAnalyzer.java:361)
>        at org.apache.lucene.analysis.FilteringTokenFilter.incrementToken(FilteringTokenFilter.java:49)
>        at org.apache.lucene.analysis.BaseTokenStreamTestCase.checkAnalysisConsistency(BaseTokenStreamTestCase.java:427)
>        at org.apache.lucene.analysis.BaseTokenStreamTestCase.checkRandomData(BaseTokenStreamTestCase.java:395)
>        ... 2 more
>
>
>
>
> Build Log (for compile errors):
> [...truncated 11445 lines...]
>
>
>
>
> ---------------------------------------------------------------------
> To unsubscribe, e-mail: dev-unsubscribe@lucene.apache.org
> For additional commands, e-mail: dev-help@lucene.apache.org

---------------------------------------------------------------------
To unsubscribe, e-mail: dev-unsubscribe@lucene.apache.org
For additional commands, e-mail: dev-help@lucene.apache.org


Mime
View raw message