lucene-dev mailing list archives

Site index · List index
Message view « Date » · « Thread »
Top « Date » · « Thread »
From Michael McCandless <luc...@mikemccandless.com>
Subject Re: [JENKINS] Lucene-Solr-tests-only-3.x - Build # 12908 - Failure
Date Thu, 29 Mar 2012 18:59:28 GMT
OK, I committed the sneaky Rethrower to test-framework...

Mike McCandless

http://blog.mikemccandless.com

On Thu, Mar 29, 2012 at 2:42 PM, Michael McCandless
<lucene@mikemccandless.com> wrote:
> Hmmm... I'll dig.  Though I fixed this already.
>
> Mike McCandless
>
> http://blog.mikemccandless.com
>
> On Thu, Mar 29, 2012 at 2:33 PM, Apache Jenkins Server
> <jenkins@builds.apache.org> wrote:
>> Build: https://builds.apache.org/job/Lucene-Solr-tests-only-3.x/12908/
>>
>> 1 tests failed.
>> REGRESSION:  org.apache.lucene.analysis.miscellaneous.PatternAnalyzerTest.testRandomStrings
>>
>> Error Message:
>> java.lang.ArrayIndexOutOfBoundsException: 485
>>
>> Stack Trace:
>> java.lang.RuntimeException: java.lang.ArrayIndexOutOfBoundsException: 485
>>        at org.apache.lucene.analysis.BaseTokenStreamTestCase.checkRandomData(BaseTokenStreamTestCase.java:398)
>>        at org.apache.lucene.analysis.BaseTokenStreamTestCase.checkRandomData(BaseTokenStreamTestCase.java:344)
>>        at org.apache.lucene.analysis.BaseTokenStreamTestCase.checkRandomData(BaseTokenStreamTestCase.java:300)
>>        at org.apache.lucene.analysis.miscellaneous.PatternAnalyzerTest.testRandomStrings(PatternAnalyzerTest.java:155)
>>        at sun.reflect.NativeMethodAccessorImpl.invoke0(Native Method)
>>        at sun.reflect.NativeMethodAccessorImpl.invoke(NativeMethodAccessorImpl.java:57)
>>        at sun.reflect.DelegatingMethodAccessorImpl.invoke(DelegatingMethodAccessorImpl.java:43)
>>        at java.lang.reflect.Method.invoke(Method.java:616)
>>        at org.junit.runners.model.FrameworkMethod$1.runReflectiveCall(FrameworkMethod.java:45)
>>        at org.junit.internal.runners.model.ReflectiveCallable.run(ReflectiveCallable.java:15)
>>        at org.junit.runners.model.FrameworkMethod.invokeExplosively(FrameworkMethod.java:42)
>>        at org.junit.internal.runners.statements.InvokeMethod.evaluate(InvokeMethod.java:20)
>>        at org.junit.internal.runners.statements.RunBefores.evaluate(RunBefores.java:28)
>>        at org.junit.internal.runners.statements.RunAfters.evaluate(RunAfters.java:30)
>>        at org.apache.lucene.util.LuceneTestCase$SubclassSetupTeardownRule$1.evaluate(LuceneTestCase.java:630)
>>        at org.apache.lucene.util.LuceneTestCase$InternalSetupTeardownRule$1.evaluate(LuceneTestCase.java:536)
>>        at org.apache.lucene.util.SystemPropertiesInvariantRule$1.evaluate(SystemPropertiesInvariantRule.java:67)
>>        at org.apache.lucene.util.LuceneTestCase$TestResultInterceptorRule$1.evaluate(LuceneTestCase.java:457)
>>        at org.apache.lucene.util.UncaughtExceptionsRule$1.evaluate(UncaughtExceptionsRule.java:74)
>>        at org.apache.lucene.util.LuceneTestCase$SaveThreadAndTestNameRule$1.evaluate(LuceneTestCase.java:508)
>>        at org.junit.rules.RunRules.evaluate(RunRules.java:18)
>>        at org.junit.runners.ParentRunner.runLeaf(ParentRunner.java:263)
>>        at org.junit.runners.BlockJUnit4ClassRunner.runChild(BlockJUnit4ClassRunner.java:68)
>>        at org.apache.lucene.util.LuceneTestCaseRunner.runChild(LuceneTestCaseRunner.java:146)
>>        at org.apache.lucene.util.LuceneTestCaseRunner.runChild(LuceneTestCaseRunner.java:50)
>>        at org.junit.runners.ParentRunner$3.run(ParentRunner.java:231)
>>        at org.junit.runners.ParentRunner$1.schedule(ParentRunner.java:60)
>>        at org.junit.runners.ParentRunner.runChildren(ParentRunner.java:229)
>>        at org.junit.runners.ParentRunner.access$000(ParentRunner.java:50)
>>        at org.junit.runners.ParentRunner$2.evaluate(ParentRunner.java:222)
>>        at org.junit.internal.runners.statements.RunBefores.evaluate(RunBefores.java:28)
>>        at org.junit.internal.runners.statements.RunAfters.evaluate(RunAfters.java:30)
>>        at org.apache.lucene.util.UncaughtExceptionsRule$1.evaluate(UncaughtExceptionsRule.java:74)
>>        at org.apache.lucene.util.StoreClassNameRule$1.evaluate(StoreClassNameRule.java:36)
>>        at org.apache.lucene.util.SystemPropertiesInvariantRule$1.evaluate(SystemPropertiesInvariantRule.java:67)
>>        at org.junit.rules.RunRules.evaluate(RunRules.java:18)
>>        at org.junit.runners.ParentRunner.run(ParentRunner.java:300)
>>        at junit.framework.JUnit4TestAdapter.run(JUnit4TestAdapter.java:39)
>>        at org.apache.tools.ant.taskdefs.optional.junit.JUnitTestRunner.run(JUnitTestRunner.java:420)
>>        at org.apache.tools.ant.taskdefs.optional.junit.JUnitTestRunner.launch(JUnitTestRunner.java:911)
>>        at org.apache.tools.ant.taskdefs.optional.junit.JUnitTestRunner.main(JUnitTestRunner.java:743)
>> Caused by: java.lang.ArrayIndexOutOfBoundsException: 485
>>        at java.text.RuleBasedBreakIterator.lookupBackwardState(RuleBasedBreakIterator.java:1021)
>>        at java.text.RuleBasedBreakIterator.handlePrevious(RuleBasedBreakIterator.java:972)
>>        at java.text.RuleBasedBreakIterator.following(RuleBasedBreakIterator.java:770)
>>        at java.text.RuleBasedBreakIterator.isBoundary(RuleBasedBreakIterator.java:811)
>>        at java.lang.ConditionalSpecialCasing.isFinalCased(ConditionalSpecialCasing.java:206)
>>        at java.lang.ConditionalSpecialCasing.isConditionMet(ConditionalSpecialCasing.java:171)
>>        at java.lang.ConditionalSpecialCasing.lookUpTable(ConditionalSpecialCasing.java:158)
>>        at java.lang.ConditionalSpecialCasing.toLowerCaseEx(ConditionalSpecialCasing.java:107)
>>        at java.lang.String.toLowerCase(String.java:2453)
>>        at org.apache.lucene.analysis.miscellaneous.PatternAnalyzer$PatternTokenizer.incrementToken(PatternAnalyzer.java:361)
>>        at org.apache.lucene.analysis.FilteringTokenFilter.incrementToken(FilteringTokenFilter.java:49)
>>        at org.apache.lucene.analysis.BaseTokenStreamTestCase.checkAnalysisConsistency(BaseTokenStreamTestCase.java:427)
>>        at org.apache.lucene.analysis.BaseTokenStreamTestCase.checkRandomData(BaseTokenStreamTestCase.java:395)
>>        ... 40 more
>>
>>
>>
>>
>> Build Log (for compile errors):
>> [...truncated 11440 lines...]
>>
>>
>>
>>
>> ---------------------------------------------------------------------
>> To unsubscribe, e-mail: dev-unsubscribe@lucene.apache.org
>> For additional commands, e-mail: dev-help@lucene.apache.org

---------------------------------------------------------------------
To unsubscribe, e-mail: dev-unsubscribe@lucene.apache.org
For additional commands, e-mail: dev-help@lucene.apache.org


Mime
View raw message