lucene-dev mailing list archives

Site index · List index
Message view « Date » · « Thread »
Top « Date » · « Thread »
From Yonik Seeley <yo...@lucidimagination.com>
Subject Re: [JENKINS] Lucene-Solr-tests-only-trunk - Build # 12811 - Failure
Date Mon, 19 Mar 2012 18:24:30 GMT
Oops, looks related to the QEC stuff I recently committed.  Looking into it...

-Yonik
lucenerevolution.com - Lucene/Solr Open Source Search Conference.
Boston May 7-10


On Mon, Mar 19, 2012 at 2:19 PM, Apache Jenkins Server
<jenkins@builds.apache.org> wrote:
> Build: https://builds.apache.org/job/Lucene-Solr-tests-only-trunk/12811/
>
> 8 tests failed.
> FAILED:  junit.framework.TestSuite.org.apache.solr.cloud.BasicDistributedZkTest
>
> Error Message:
> ERROR: SolrIndexSearcher opens=93 closes=92
>
> Stack Trace:
> junit.framework.AssertionFailedError: ERROR: SolrIndexSearcher opens=93 closes=92
>        at org.apache.tools.ant.taskdefs.optional.junit.JUnitTestRunner$3.addError(JUnitTestRunner.java:974)
>        at junit.framework.TestResult.addError(TestResult.java:38)
>        at junit.framework.JUnit4TestAdapterCache$1.testFailure(JUnit4TestAdapterCache.java:51)
>        at org.junit.runner.notification.RunNotifier$4.notifyListener(RunNotifier.java:100)
>        at org.junit.runner.notification.RunNotifier$SafeNotifier.run(RunNotifier.java:41)
>        at org.junit.runner.notification.RunNotifier.fireTestFailure(RunNotifier.java:97)
>        at org.junit.internal.runners.model.EachTestNotifier.addFailure(EachTestNotifier.java:26)
>        at org.junit.runners.ParentRunner.run(ParentRunner.java:306)
>        at junit.framework.JUnit4TestAdapter.run(JUnit4TestAdapter.java:39)
>        at org.apache.tools.ant.taskdefs.optional.junit.JUnitTestRunner.run(JUnitTestRunner.java:420)
>        at org.apache.tools.ant.taskdefs.optional.junit.JUnitTestRunner.launch(JUnitTestRunner.java:911)
>        at org.apache.tools.ant.taskdefs.optional.junit.JUnitTestRunner.main(JUnitTestRunner.java:743)
> Caused by: java.lang.AssertionError: ERROR: SolrIndexSearcher opens=93 closes=92
>        at org.junit.Assert.fail(Assert.java:93)
>        at org.apache.solr.SolrTestCaseJ4.endTrackingSearchers(SolrTestCaseJ4.java:211)
>        at org.apache.solr.SolrTestCaseJ4.afterClassSolrTestCase(SolrTestCaseJ4.java:100)
>        at sun.reflect.NativeMethodAccessorImpl.invoke0(Native Method)
>        at sun.reflect.NativeMethodAccessorImpl.invoke(NativeMethodAccessorImpl.java:57)
>        at sun.reflect.DelegatingMethodAccessorImpl.invoke(DelegatingMethodAccessorImpl.java:43)
>        at java.lang.reflect.Method.invoke(Method.java:616)
>        at org.junit.runners.model.FrameworkMethod$1.runReflectiveCall(FrameworkMethod.java:45)
>        at org.junit.internal.runners.model.ReflectiveCallable.run(ReflectiveCallable.java:15)
>        at org.junit.runners.model.FrameworkMethod.invokeExplosively(FrameworkMethod.java:42)
>        at org.junit.internal.runners.statements.RunAfters.evaluate(RunAfters.java:36)
>        at org.apache.lucene.util.SystemPropertiesRestoreRule$1.evaluate(SystemPropertiesRestoreRule.java:20)
>        at org.apache.lucene.util.UncaughtExceptionsRule$1.evaluate(UncaughtExceptionsRule.java:51)
>        at org.apache.lucene.util.StoreClassNameRule$1.evaluate(StoreClassNameRule.java:21)
>        at org.apache.lucene.util.SystemPropertiesInvariantRule$1.evaluate(SystemPropertiesInvariantRule.java:22)
>        at org.junit.rules.RunRules.evaluate(RunRules.java:18)
>        at org.junit.runners.ParentRunner.run(ParentRunner.java:300)
>        ... 4 more
>
>
> REGRESSION:  org.apache.solr.handler.component.QueryElevationComponentTest.testSorting
>
> Error Message:
> org.apache.solr.common.SolrException
>
> Stack Trace:
> java.lang.RuntimeException: org.apache.solr.common.SolrException
>        at org.apache.solr.util.TestHarness.<init>(TestHarness.java:152)
>        at org.apache.solr.util.TestHarness.<init>(TestHarness.java:135)
>        at org.apache.solr.util.TestHarness.<init>(TestHarness.java:125)
>        at org.apache.solr.SolrTestCaseJ4.createCore(SolrTestCaseJ4.java:342)
>        at org.apache.solr.SolrTestCaseJ4.initCore(SolrTestCaseJ4.java:335)
>        at org.apache.solr.SolrTestCaseJ4.initCore(SolrTestCaseJ4.java:158)
>        at org.apache.solr.SolrTestCaseJ4.initCore(SolrTestCaseJ4.java:147)
>        at org.apache.solr.handler.component.QueryElevationComponentTest.init(QueryElevationComponentTest.java:64)
>        at org.apache.solr.handler.component.QueryElevationComponentTest.init(QueryElevationComponentTest.java:52)
>        at org.apache.solr.handler.component.QueryElevationComponentTest.testSorting(QueryElevationComponentTest.java:289)
>        at sun.reflect.NativeMethodAccessorImpl.invoke0(Native Method)
>        at sun.reflect.NativeMethodAccessorImpl.invoke(NativeMethodAccessorImpl.java:57)
>        at sun.reflect.DelegatingMethodAccessorImpl.invoke(DelegatingMethodAccessorImpl.java:43)
>        at java.lang.reflect.Method.invoke(Method.java:616)
>        at org.junit.runners.model.FrameworkMethod$1.runReflectiveCall(FrameworkMethod.java:45)
>        at org.junit.internal.runners.model.ReflectiveCallable.run(ReflectiveCallable.java:15)
>        at org.junit.runners.model.FrameworkMethod.invokeExplosively(FrameworkMethod.java:42)
>        at org.junit.internal.runners.statements.InvokeMethod.evaluate(InvokeMethod.java:20)
>        at org.junit.internal.runners.statements.RunBefores.evaluate(RunBefores.java:28)
>        at org.junit.internal.runners.statements.RunAfters.evaluate(RunAfters.java:30)
>        at org.apache.lucene.util.SystemPropertiesRestoreRule$1.evaluate(SystemPropertiesRestoreRule.java:20)
>        at org.apache.lucene.util.LuceneTestCase$SubclassSetupTeardownRule$1.evaluate(LuceneTestCase.java:729)
>        at org.apache.lucene.util.LuceneTestCase$InternalSetupTeardownRule$1.evaluate(LuceneTestCase.java:645)
>        at org.apache.lucene.util.SystemPropertiesInvariantRule$1.evaluate(SystemPropertiesInvariantRule.java:22)
>        at org.apache.lucene.util.LuceneTestCase$TestResultInterceptorRule$1.evaluate(LuceneTestCase.java:556)
>        at org.apache.lucene.util.UncaughtExceptionsRule$1.evaluate(UncaughtExceptionsRule.java:51)
>        at org.apache.lucene.util.LuceneTestCase$RememberThreadRule$1.evaluate(LuceneTestCase.java:618)
>        at org.junit.rules.RunRules.evaluate(RunRules.java:18)
>        at org.junit.runners.ParentRunner.runLeaf(ParentRunner.java:263)
>        at org.junit.runners.BlockJUnit4ClassRunner.runChild(BlockJUnit4ClassRunner.java:68)
>        at org.apache.lucene.util.LuceneTestCaseRunner.runChild(LuceneTestCaseRunner.java:164)
>        at org.apache.lucene.util.LuceneTestCaseRunner.runChild(LuceneTestCaseRunner.java:57)
>        at org.junit.runners.ParentRunner$3.run(ParentRunner.java:231)
>        at org.junit.runners.ParentRunner$1.schedule(ParentRunner.java:60)
>        at org.junit.runners.ParentRunner.runChildren(ParentRunner.java:229)
>        at org.junit.runners.ParentRunner.access$000(ParentRunner.java:50)
>        at org.junit.runners.ParentRunner$2.evaluate(ParentRunner.java:222)
>        at org.junit.internal.runners.statements.RunBefores.evaluate(RunBefores.java:28)
>        at org.junit.internal.runners.statements.RunAfters.evaluate(RunAfters.java:30)
>        at org.apache.lucene.util.SystemPropertiesRestoreRule$1.evaluate(SystemPropertiesRestoreRule.java:20)
>        at org.apache.lucene.util.UncaughtExceptionsRule$1.evaluate(UncaughtExceptionsRule.java:51)
>        at org.apache.lucene.util.StoreClassNameRule$1.evaluate(StoreClassNameRule.java:21)
>        at org.apache.lucene.util.SystemPropertiesInvariantRule$1.evaluate(SystemPropertiesInvariantRule.java:22)
>        at org.junit.rules.RunRules.evaluate(RunRules.java:18)
>        at org.junit.runners.ParentRunner.run(ParentRunner.java:300)
>        at junit.framework.JUnit4TestAdapter.run(JUnit4TestAdapter.java:39)
>        at org.apache.tools.ant.taskdefs.optional.junit.JUnitTestRunner.run(JUnitTestRunner.java:420)
>        at org.apache.tools.ant.taskdefs.optional.junit.JUnitTestRunner.launch(JUnitTestRunner.java:911)
>        at org.apache.tools.ant.taskdefs.optional.junit.JUnitTestRunner.main(JUnitTestRunner.java:743)
> Caused by: org.apache.solr.common.SolrException
>        at org.apache.solr.core.SolrCore.<init>(SolrCore.java:614)
>        at org.apache.solr.core.SolrCore.<init>(SolrCore.java:498)
>        at org.apache.solr.util.TestHarness$Initializer.initialize(TestHarness.java:216)
>        at org.apache.solr.util.TestHarness.<init>(TestHarness.java:140)
>        ... 48 more
> Caused by: org.apache.solr.common.SolrException: Error initializing QueryElevationComponent.
>        at org.apache.solr.handler.component.QueryElevationComponent.inform(QueryElevationComponent.java:217)
>        at org.apache.solr.core.SolrResourceLoader.inform(SolrResourceLoader.java:542)
>        at org.apache.solr.core.SolrCore.<init>(SolrCore.java:609)
>        ... 51 more
> Caused by: org.apache.solr.common.SolrException: QueryElevationComponent missing config
file: 'elevate-data.xml
> either: /usr/home/hudson/hudson-slave/workspace/Lucene-Solr-tests-only-trunk/checkout/solr/core/src/test-files/solr/conf/elevate-data.xml
or /usr/home/hudson/hudson-slave/workspace/Lucene-Solr-tests-only-trunk/checkout/solr/build/solr-core/test/1/solrtest-QueryElevationComponentTest-1332181111946/elevate-data.xml
must exist, but not both.
>        at org.apache.solr.handler.component.QueryElevationComponent.inform(QueryElevationComponent.java:192)
>        ... 53 more
>
>
> REGRESSION:  org.apache.solr.handler.component.QueryElevationComponentTest.testTrieFieldType
>
> Error Message:
> org.apache.solr.common.SolrException
>
> Stack Trace:
> java.lang.RuntimeException: org.apache.solr.common.SolrException
>        at org.apache.solr.util.TestHarness.<init>(TestHarness.java:152)
>        at org.apache.solr.util.TestHarness.<init>(TestHarness.java:135)
>        at org.apache.solr.util.TestHarness.<init>(TestHarness.java:125)
>        at org.apache.solr.SolrTestCaseJ4.createCore(SolrTestCaseJ4.java:342)
>        at org.apache.solr.SolrTestCaseJ4.initCore(SolrTestCaseJ4.java:335)
>        at org.apache.solr.SolrTestCaseJ4.initCore(SolrTestCaseJ4.java:158)
>        at org.apache.solr.SolrTestCaseJ4.initCore(SolrTestCaseJ4.java:147)
>        at org.apache.solr.handler.component.QueryElevationComponentTest.init(QueryElevationComponentTest.java:64)
>        at org.apache.solr.handler.component.QueryElevationComponentTest.init(QueryElevationComponentTest.java:52)
>        at org.apache.solr.handler.component.QueryElevationComponentTest.testTrieFieldType(QueryElevationComponentTest.java:109)
>        at sun.reflect.NativeMethodAccessorImpl.invoke0(Native Method)
>        at sun.reflect.NativeMethodAccessorImpl.invoke(NativeMethodAccessorImpl.java:57)
>        at sun.reflect.DelegatingMethodAccessorImpl.invoke(DelegatingMethodAccessorImpl.java:43)
>        at java.lang.reflect.Method.invoke(Method.java:616)
>        at org.junit.runners.model.FrameworkMethod$1.runReflectiveCall(FrameworkMethod.java:45)
>        at org.junit.internal.runners.model.ReflectiveCallable.run(ReflectiveCallable.java:15)
>        at org.junit.runners.model.FrameworkMethod.invokeExplosively(FrameworkMethod.java:42)
>        at org.junit.internal.runners.statements.InvokeMethod.evaluate(InvokeMethod.java:20)
>        at org.junit.internal.runners.statements.RunBefores.evaluate(RunBefores.java:28)
>        at org.junit.internal.runners.statements.RunAfters.evaluate(RunAfters.java:30)
>        at org.apache.lucene.util.SystemPropertiesRestoreRule$1.evaluate(SystemPropertiesRestoreRule.java:20)
>        at org.apache.lucene.util.LuceneTestCase$SubclassSetupTeardownRule$1.evaluate(LuceneTestCase.java:729)
>        at org.apache.lucene.util.LuceneTestCase$InternalSetupTeardownRule$1.evaluate(LuceneTestCase.java:645)
>        at org.apache.lucene.util.SystemPropertiesInvariantRule$1.evaluate(SystemPropertiesInvariantRule.java:22)
>        at org.apache.lucene.util.LuceneTestCase$TestResultInterceptorRule$1.evaluate(LuceneTestCase.java:556)
>        at org.apache.lucene.util.UncaughtExceptionsRule$1.evaluate(UncaughtExceptionsRule.java:51)
>        at org.apache.lucene.util.LuceneTestCase$RememberThreadRule$1.evaluate(LuceneTestCase.java:618)
>        at org.junit.rules.RunRules.evaluate(RunRules.java:18)
>        at org.junit.runners.ParentRunner.runLeaf(ParentRunner.java:263)
>        at org.junit.runners.BlockJUnit4ClassRunner.runChild(BlockJUnit4ClassRunner.java:68)
>        at org.apache.lucene.util.LuceneTestCaseRunner.runChild(LuceneTestCaseRunner.java:164)
>        at org.apache.lucene.util.LuceneTestCaseRunner.runChild(LuceneTestCaseRunner.java:57)
>        at org.junit.runners.ParentRunner$3.run(ParentRunner.java:231)
>        at org.junit.runners.ParentRunner$1.schedule(ParentRunner.java:60)
>        at org.junit.runners.ParentRunner.runChildren(ParentRunner.java:229)
>        at org.junit.runners.ParentRunner.access$000(ParentRunner.java:50)
>        at org.junit.runners.ParentRunner$2.evaluate(ParentRunner.java:222)
>        at org.junit.internal.runners.statements.RunBefores.evaluate(RunBefores.java:28)
>        at org.junit.internal.runners.statements.RunAfters.evaluate(RunAfters.java:30)
>        at org.apache.lucene.util.SystemPropertiesRestoreRule$1.evaluate(SystemPropertiesRestoreRule.java:20)
>        at org.apache.lucene.util.UncaughtExceptionsRule$1.evaluate(UncaughtExceptionsRule.java:51)
>        at org.apache.lucene.util.StoreClassNameRule$1.evaluate(StoreClassNameRule.java:21)
>        at org.apache.lucene.util.SystemPropertiesInvariantRule$1.evaluate(SystemPropertiesInvariantRule.java:22)
>        at org.junit.rules.RunRules.evaluate(RunRules.java:18)
>        at org.junit.runners.ParentRunner.run(ParentRunner.java:300)
>        at junit.framework.JUnit4TestAdapter.run(JUnit4TestAdapter.java:39)
>        at org.apache.tools.ant.taskdefs.optional.junit.JUnitTestRunner.run(JUnitTestRunner.java:420)
>        at org.apache.tools.ant.taskdefs.optional.junit.JUnitTestRunner.launch(JUnitTestRunner.java:911)
>        at org.apache.tools.ant.taskdefs.optional.junit.JUnitTestRunner.main(JUnitTestRunner.java:743)
> Caused by: org.apache.solr.common.SolrException
>        at org.apache.solr.core.SolrCore.<init>(SolrCore.java:614)
>        at org.apache.solr.core.SolrCore.<init>(SolrCore.java:498)
>        at org.apache.solr.util.TestHarness$Initializer.initialize(TestHarness.java:216)
>        at org.apache.solr.util.TestHarness.<init>(TestHarness.java:140)
>        ... 48 more
> Caused by: org.apache.solr.common.SolrException: Error initializing QueryElevationComponent.
>        at org.apache.solr.handler.component.QueryElevationComponent.inform(QueryElevationComponent.java:217)
>        at org.apache.solr.core.SolrResourceLoader.inform(SolrResourceLoader.java:542)
>        at org.apache.solr.core.SolrCore.<init>(SolrCore.java:609)
>        ... 51 more
> Caused by: org.apache.solr.common.SolrException: QueryElevationComponent missing config
file: 'elevate-data.xml
> either: /usr/home/hudson/hudson-slave/workspace/Lucene-Solr-tests-only-trunk/checkout/solr/core/src/test-files/solr/conf/elevate-data.xml
or /usr/home/hudson/hudson-slave/workspace/Lucene-Solr-tests-only-trunk/checkout/solr/build/solr-core/test/1/solrtest-QueryElevationComponentTest-1332181112338/elevate-data.xml
must exist, but not both.
>        at org.apache.solr.handler.component.QueryElevationComponent.inform(QueryElevationComponent.java:192)
>        ... 53 more
>
>
> REGRESSION:  org.apache.solr.handler.component.QueryElevationComponentTest.testElevationReloading
>
> Error Message:
> org.apache.solr.common.SolrException
>
> Stack Trace:
> java.lang.RuntimeException: org.apache.solr.common.SolrException
>        at org.apache.solr.util.TestHarness.<init>(TestHarness.java:152)
>        at org.apache.solr.util.TestHarness.<init>(TestHarness.java:135)
>        at org.apache.solr.util.TestHarness.<init>(TestHarness.java:125)
>        at org.apache.solr.SolrTestCaseJ4.createCore(SolrTestCaseJ4.java:342)
>        at org.apache.solr.SolrTestCaseJ4.initCore(SolrTestCaseJ4.java:335)
>        at org.apache.solr.SolrTestCaseJ4.initCore(SolrTestCaseJ4.java:158)
>        at org.apache.solr.SolrTestCaseJ4.initCore(SolrTestCaseJ4.java:147)
>        at org.apache.solr.handler.component.QueryElevationComponentTest.init(QueryElevationComponentTest.java:64)
>        at org.apache.solr.handler.component.QueryElevationComponentTest.init(QueryElevationComponentTest.java:52)
>        at org.apache.solr.handler.component.QueryElevationComponentTest.testElevationReloading(QueryElevationComponentTest.java:424)
>        at sun.reflect.NativeMethodAccessorImpl.invoke0(Native Method)
>        at sun.reflect.NativeMethodAccessorImpl.invoke(NativeMethodAccessorImpl.java:57)
>        at sun.reflect.DelegatingMethodAccessorImpl.invoke(DelegatingMethodAccessorImpl.java:43)
>        at java.lang.reflect.Method.invoke(Method.java:616)
>        at org.junit.runners.model.FrameworkMethod$1.runReflectiveCall(FrameworkMethod.java:45)
>        at org.junit.internal.runners.model.ReflectiveCallable.run(ReflectiveCallable.java:15)
>        at org.junit.runners.model.FrameworkMethod.invokeExplosively(FrameworkMethod.java:42)
>        at org.junit.internal.runners.statements.InvokeMethod.evaluate(InvokeMethod.java:20)
>        at org.junit.internal.runners.statements.RunBefores.evaluate(RunBefores.java:28)
>        at org.junit.internal.runners.statements.RunAfters.evaluate(RunAfters.java:30)
>        at org.apache.lucene.util.SystemPropertiesRestoreRule$1.evaluate(SystemPropertiesRestoreRule.java:20)
>        at org.apache.lucene.util.LuceneTestCase$SubclassSetupTeardownRule$1.evaluate(LuceneTestCase.java:729)
>        at org.apache.lucene.util.LuceneTestCase$InternalSetupTeardownRule$1.evaluate(LuceneTestCase.java:645)
>        at org.apache.lucene.util.SystemPropertiesInvariantRule$1.evaluate(SystemPropertiesInvariantRule.java:22)
>        at org.apache.lucene.util.LuceneTestCase$TestResultInterceptorRule$1.evaluate(LuceneTestCase.java:556)
>        at org.apache.lucene.util.UncaughtExceptionsRule$1.evaluate(UncaughtExceptionsRule.java:51)
>        at org.apache.lucene.util.LuceneTestCase$RememberThreadRule$1.evaluate(LuceneTestCase.java:618)
>        at org.junit.rules.RunRules.evaluate(RunRules.java:18)
>        at org.junit.runners.ParentRunner.runLeaf(ParentRunner.java:263)
>        at org.junit.runners.BlockJUnit4ClassRunner.runChild(BlockJUnit4ClassRunner.java:68)
>        at org.apache.lucene.util.LuceneTestCaseRunner.runChild(LuceneTestCaseRunner.java:164)
>        at org.apache.lucene.util.LuceneTestCaseRunner.runChild(LuceneTestCaseRunner.java:57)
>        at org.junit.runners.ParentRunner$3.run(ParentRunner.java:231)
>        at org.junit.runners.ParentRunner$1.schedule(ParentRunner.java:60)
>        at org.junit.runners.ParentRunner.runChildren(ParentRunner.java:229)
>        at org.junit.runners.ParentRunner.access$000(ParentRunner.java:50)
>        at org.junit.runners.ParentRunner$2.evaluate(ParentRunner.java:222)
>        at org.junit.internal.runners.statements.RunBefores.evaluate(RunBefores.java:28)
>        at org.junit.internal.runners.statements.RunAfters.evaluate(RunAfters.java:30)
>        at org.apache.lucene.util.SystemPropertiesRestoreRule$1.evaluate(SystemPropertiesRestoreRule.java:20)
>        at org.apache.lucene.util.UncaughtExceptionsRule$1.evaluate(UncaughtExceptionsRule.java:51)
>        at org.apache.lucene.util.StoreClassNameRule$1.evaluate(StoreClassNameRule.java:21)
>        at org.apache.lucene.util.SystemPropertiesInvariantRule$1.evaluate(SystemPropertiesInvariantRule.java:22)
>        at org.junit.rules.RunRules.evaluate(RunRules.java:18)
>        at org.junit.runners.ParentRunner.run(ParentRunner.java:300)
>        at junit.framework.JUnit4TestAdapter.run(JUnit4TestAdapter.java:39)
>        at org.apache.tools.ant.taskdefs.optional.junit.JUnitTestRunner.run(JUnitTestRunner.java:420)
>        at org.apache.tools.ant.taskdefs.optional.junit.JUnitTestRunner.launch(JUnitTestRunner.java:911)
>        at org.apache.tools.ant.taskdefs.optional.junit.JUnitTestRunner.main(JUnitTestRunner.java:743)
> Caused by: org.apache.solr.common.SolrException
>        at org.apache.solr.core.SolrCore.<init>(SolrCore.java:614)
>        at org.apache.solr.core.SolrCore.<init>(SolrCore.java:498)
>        at org.apache.solr.util.TestHarness$Initializer.initialize(TestHarness.java:216)
>        at org.apache.solr.util.TestHarness.<init>(TestHarness.java:140)
>        ... 48 more
> Caused by: org.apache.solr.common.SolrException: Error initializing QueryElevationComponent.
>        at org.apache.solr.handler.component.QueryElevationComponent.inform(QueryElevationComponent.java:217)
>        at org.apache.solr.core.SolrResourceLoader.inform(SolrResourceLoader.java:542)
>        at org.apache.solr.core.SolrCore.<init>(SolrCore.java:609)
>        ... 51 more
> Caused by: org.apache.solr.common.SolrException: QueryElevationComponent missing config
file: 'elevate-data.xml
> either: /usr/home/hudson/hudson-slave/workspace/Lucene-Solr-tests-only-trunk/checkout/solr/core/src/test-files/solr/conf/elevate-data.xml
or /usr/home/hudson/hudson-slave/workspace/Lucene-Solr-tests-only-trunk/checkout/solr/build/solr-core/test/1/solrtest-QueryElevationComponentTest-1332181112784/elevate-data.xml
must exist, but not both.
>        at org.apache.solr.handler.component.QueryElevationComponent.inform(QueryElevationComponent.java:192)
>        ... 53 more
>
>
> REGRESSION:  org.apache.solr.handler.component.QueryElevationComponentTest.testFieldType
>
> Error Message:
> org.apache.solr.common.SolrException
>
> Stack Trace:
> java.lang.RuntimeException: org.apache.solr.common.SolrException
>        at org.apache.solr.util.TestHarness.<init>(TestHarness.java:152)
>        at org.apache.solr.util.TestHarness.<init>(TestHarness.java:135)
>        at org.apache.solr.util.TestHarness.<init>(TestHarness.java:125)
>        at org.apache.solr.SolrTestCaseJ4.createCore(SolrTestCaseJ4.java:342)
>        at org.apache.solr.SolrTestCaseJ4.initCore(SolrTestCaseJ4.java:335)
>        at org.apache.solr.SolrTestCaseJ4.initCore(SolrTestCaseJ4.java:158)
>        at org.apache.solr.SolrTestCaseJ4.initCore(SolrTestCaseJ4.java:147)
>        at org.apache.solr.handler.component.QueryElevationComponentTest.init(QueryElevationComponentTest.java:64)
>        at org.apache.solr.handler.component.QueryElevationComponentTest.init(QueryElevationComponentTest.java:52)
>        at org.apache.solr.handler.component.QueryElevationComponentTest.testFieldType(QueryElevationComponentTest.java:76)
>        at sun.reflect.NativeMethodAccessorImpl.invoke0(Native Method)
>        at sun.reflect.NativeMethodAccessorImpl.invoke(NativeMethodAccessorImpl.java:57)
>        at sun.reflect.DelegatingMethodAccessorImpl.invoke(DelegatingMethodAccessorImpl.java:43)
>        at java.lang.reflect.Method.invoke(Method.java:616)
>        at org.junit.runners.model.FrameworkMethod$1.runReflectiveCall(FrameworkMethod.java:45)
>        at org.junit.internal.runners.model.ReflectiveCallable.run(ReflectiveCallable.java:15)
>        at org.junit.runners.model.FrameworkMethod.invokeExplosively(FrameworkMethod.java:42)
>        at org.junit.internal.runners.statements.InvokeMethod.evaluate(InvokeMethod.java:20)
>        at org.junit.internal.runners.statements.RunBefores.evaluate(RunBefores.java:28)
>        at org.junit.internal.runners.statements.RunAfters.evaluate(RunAfters.java:30)
>        at org.apache.lucene.util.SystemPropertiesRestoreRule$1.evaluate(SystemPropertiesRestoreRule.java:20)
>        at org.apache.lucene.util.LuceneTestCase$SubclassSetupTeardownRule$1.evaluate(LuceneTestCase.java:729)
>        at org.apache.lucene.util.LuceneTestCase$InternalSetupTeardownRule$1.evaluate(LuceneTestCase.java:645)
>        at org.apache.lucene.util.SystemPropertiesInvariantRule$1.evaluate(SystemPropertiesInvariantRule.java:22)
>        at org.apache.lucene.util.LuceneTestCase$TestResultInterceptorRule$1.evaluate(LuceneTestCase.java:556)
>        at org.apache.lucene.util.UncaughtExceptionsRule$1.evaluate(UncaughtExceptionsRule.java:51)
>        at org.apache.lucene.util.LuceneTestCase$RememberThreadRule$1.evaluate(LuceneTestCase.java:618)
>        at org.junit.rules.RunRules.evaluate(RunRules.java:18)
>        at org.junit.runners.ParentRunner.runLeaf(ParentRunner.java:263)
>        at org.junit.runners.BlockJUnit4ClassRunner.runChild(BlockJUnit4ClassRunner.java:68)
>        at org.apache.lucene.util.LuceneTestCaseRunner.runChild(LuceneTestCaseRunner.java:164)
>        at org.apache.lucene.util.LuceneTestCaseRunner.runChild(LuceneTestCaseRunner.java:57)
>        at org.junit.runners.ParentRunner$3.run(ParentRunner.java:231)
>        at org.junit.runners.ParentRunner$1.schedule(ParentRunner.java:60)
>        at org.junit.runners.ParentRunner.runChildren(ParentRunner.java:229)
>        at org.junit.runners.ParentRunner.access$000(ParentRunner.java:50)
>        at org.junit.runners.ParentRunner$2.evaluate(ParentRunner.java:222)
>        at org.junit.internal.runners.statements.RunBefores.evaluate(RunBefores.java:28)
>        at org.junit.internal.runners.statements.RunAfters.evaluate(RunAfters.java:30)
>        at org.apache.lucene.util.SystemPropertiesRestoreRule$1.evaluate(SystemPropertiesRestoreRule.java:20)
>        at org.apache.lucene.util.UncaughtExceptionsRule$1.evaluate(UncaughtExceptionsRule.java:51)
>        at org.apache.lucene.util.StoreClassNameRule$1.evaluate(StoreClassNameRule.java:21)
>        at org.apache.lucene.util.SystemPropertiesInvariantRule$1.evaluate(SystemPropertiesInvariantRule.java:22)
>        at org.junit.rules.RunRules.evaluate(RunRules.java:18)
>        at org.junit.runners.ParentRunner.run(ParentRunner.java:300)
>        at junit.framework.JUnit4TestAdapter.run(JUnit4TestAdapter.java:39)
>        at org.apache.tools.ant.taskdefs.optional.junit.JUnitTestRunner.run(JUnitTestRunner.java:420)
>        at org.apache.tools.ant.taskdefs.optional.junit.JUnitTestRunner.launch(JUnitTestRunner.java:911)
>        at org.apache.tools.ant.taskdefs.optional.junit.JUnitTestRunner.main(JUnitTestRunner.java:743)
> Caused by: org.apache.solr.common.SolrException
>        at org.apache.solr.core.SolrCore.<init>(SolrCore.java:614)
>        at org.apache.solr.core.SolrCore.<init>(SolrCore.java:498)
>        at org.apache.solr.util.TestHarness$Initializer.initialize(TestHarness.java:216)
>        at org.apache.solr.util.TestHarness.<init>(TestHarness.java:140)
>        ... 48 more
> Caused by: org.apache.solr.common.SolrException: Error initializing QueryElevationComponent.
>        at org.apache.solr.handler.component.QueryElevationComponent.inform(QueryElevationComponent.java:217)
>        at org.apache.solr.core.SolrResourceLoader.inform(SolrResourceLoader.java:542)
>        at org.apache.solr.core.SolrCore.<init>(SolrCore.java:609)
>        ... 51 more
> Caused by: org.apache.solr.common.SolrException: QueryElevationComponent missing config
file: 'elevate-data.xml
> either: /usr/home/hudson/hudson-slave/workspace/Lucene-Solr-tests-only-trunk/checkout/solr/core/src/test-files/solr/conf/elevate-data.xml
or /usr/home/hudson/hudson-slave/workspace/Lucene-Solr-tests-only-trunk/checkout/solr/build/solr-core/test/1/solrtest-QueryElevationComponentTest-1332181113378/elevate-data.xml
must exist, but not both.
>        at org.apache.solr.handler.component.QueryElevationComponent.inform(QueryElevationComponent.java:192)
>        ... 53 more
>
>
> REGRESSION:  org.apache.solr.handler.component.QueryElevationComponentTest.testInterface
>
> Error Message:
> org.apache.solr.common.SolrException
>
> Stack Trace:
> java.lang.RuntimeException: org.apache.solr.common.SolrException
>        at org.apache.solr.util.TestHarness.<init>(TestHarness.java:152)
>        at org.apache.solr.util.TestHarness.<init>(TestHarness.java:135)
>        at org.apache.solr.util.TestHarness.<init>(TestHarness.java:125)
>        at org.apache.solr.SolrTestCaseJ4.createCore(SolrTestCaseJ4.java:342)
>        at org.apache.solr.SolrTestCaseJ4.initCore(SolrTestCaseJ4.java:335)
>        at org.apache.solr.SolrTestCaseJ4.initCore(SolrTestCaseJ4.java:158)
>        at org.apache.solr.SolrTestCaseJ4.initCore(SolrTestCaseJ4.java:147)
>        at org.apache.solr.handler.component.QueryElevationComponentTest.init(QueryElevationComponentTest.java:64)
>        at org.apache.solr.handler.component.QueryElevationComponentTest.init(QueryElevationComponentTest.java:52)
>        at org.apache.solr.handler.component.QueryElevationComponentTest.testInterface(QueryElevationComponentTest.java:143)
>        at sun.reflect.NativeMethodAccessorImpl.invoke0(Native Method)
>        at sun.reflect.NativeMethodAccessorImpl.invoke(NativeMethodAccessorImpl.java:57)
>        at sun.reflect.DelegatingMethodAccessorImpl.invoke(DelegatingMethodAccessorImpl.java:43)
>        at java.lang.reflect.Method.invoke(Method.java:616)
>        at org.junit.runners.model.FrameworkMethod$1.runReflectiveCall(FrameworkMethod.java:45)
>        at org.junit.internal.runners.model.ReflectiveCallable.run(ReflectiveCallable.java:15)
>        at org.junit.runners.model.FrameworkMethod.invokeExplosively(FrameworkMethod.java:42)
>        at org.junit.internal.runners.statements.InvokeMethod.evaluate(InvokeMethod.java:20)
>        at org.junit.internal.runners.statements.RunBefores.evaluate(RunBefores.java:28)
>        at org.junit.internal.runners.statements.RunAfters.evaluate(RunAfters.java:30)
>        at org.apache.lucene.util.SystemPropertiesRestoreRule$1.evaluate(SystemPropertiesRestoreRule.java:20)
>        at org.apache.lucene.util.LuceneTestCase$SubclassSetupTeardownRule$1.evaluate(LuceneTestCase.java:729)
>        at org.apache.lucene.util.LuceneTestCase$InternalSetupTeardownRule$1.evaluate(LuceneTestCase.java:645)
>        at org.apache.lucene.util.SystemPropertiesInvariantRule$1.evaluate(SystemPropertiesInvariantRule.java:22)
>        at org.apache.lucene.util.LuceneTestCase$TestResultInterceptorRule$1.evaluate(LuceneTestCase.java:556)
>        at org.apache.lucene.util.UncaughtExceptionsRule$1.evaluate(UncaughtExceptionsRule.java:51)
>        at org.apache.lucene.util.LuceneTestCase$RememberThreadRule$1.evaluate(LuceneTestCase.java:618)
>        at org.junit.rules.RunRules.evaluate(RunRules.java:18)
>        at org.junit.runners.ParentRunner.runLeaf(ParentRunner.java:263)
>        at org.junit.runners.BlockJUnit4ClassRunner.runChild(BlockJUnit4ClassRunner.java:68)
>        at org.apache.lucene.util.LuceneTestCaseRunner.runChild(LuceneTestCaseRunner.java:164)
>        at org.apache.lucene.util.LuceneTestCaseRunner.runChild(LuceneTestCaseRunner.java:57)
>        at org.junit.runners.ParentRunner$3.run(ParentRunner.java:231)
>        at org.junit.runners.ParentRunner$1.schedule(ParentRunner.java:60)
>        at org.junit.runners.ParentRunner.runChildren(ParentRunner.java:229)
>        at org.junit.runners.ParentRunner.access$000(ParentRunner.java:50)
>        at org.junit.runners.ParentRunner$2.evaluate(ParentRunner.java:222)
>        at org.junit.internal.runners.statements.RunBefores.evaluate(RunBefores.java:28)
>        at org.junit.internal.runners.statements.RunAfters.evaluate(RunAfters.java:30)
>        at org.apache.lucene.util.SystemPropertiesRestoreRule$1.evaluate(SystemPropertiesRestoreRule.java:20)
>        at org.apache.lucene.util.UncaughtExceptionsRule$1.evaluate(UncaughtExceptionsRule.java:51)
>        at org.apache.lucene.util.StoreClassNameRule$1.evaluate(StoreClassNameRule.java:21)
>        at org.apache.lucene.util.SystemPropertiesInvariantRule$1.evaluate(SystemPropertiesInvariantRule.java:22)
>        at org.junit.rules.RunRules.evaluate(RunRules.java:18)
>        at org.junit.runners.ParentRunner.run(ParentRunner.java:300)
>        at junit.framework.JUnit4TestAdapter.run(JUnit4TestAdapter.java:39)
>        at org.apache.tools.ant.taskdefs.optional.junit.JUnitTestRunner.run(JUnitTestRunner.java:420)
>        at org.apache.tools.ant.taskdefs.optional.junit.JUnitTestRunner.launch(JUnitTestRunner.java:911)
>        at org.apache.tools.ant.taskdefs.optional.junit.JUnitTestRunner.main(JUnitTestRunner.java:743)
> Caused by: org.apache.solr.common.SolrException
>        at org.apache.solr.core.SolrCore.<init>(SolrCore.java:614)
>        at org.apache.solr.core.SolrCore.<init>(SolrCore.java:498)
>        at org.apache.solr.util.TestHarness$Initializer.initialize(TestHarness.java:216)
>        at org.apache.solr.util.TestHarness.<init>(TestHarness.java:140)
>        ... 48 more
> Caused by: org.apache.solr.common.SolrException: Error initializing QueryElevationComponent.
>        at org.apache.solr.handler.component.QueryElevationComponent.inform(QueryElevationComponent.java:217)
>        at org.apache.solr.core.SolrResourceLoader.inform(SolrResourceLoader.java:542)
>        at org.apache.solr.core.SolrCore.<init>(SolrCore.java:609)
>        ... 51 more
> Caused by: org.apache.solr.common.SolrException: QueryElevationComponent missing config
file: 'elevate-data.xml
> either: /usr/home/hudson/hudson-slave/workspace/Lucene-Solr-tests-only-trunk/checkout/solr/core/src/test-files/solr/conf/elevate-data.xml
or /usr/home/hudson/hudson-slave/workspace/Lucene-Solr-tests-only-trunk/checkout/solr/build/solr-core/test/1/solrtest-QueryElevationComponentTest-1332181113591/elevate-data.xml
must exist, but not both.
>        at org.apache.solr.handler.component.QueryElevationComponent.inform(QueryElevationComponent.java:192)
>        ... 53 more
>
>
> REGRESSION:  org.apache.solr.handler.component.QueryElevationComponentTest.testMarkExcludes
>
> Error Message:
> org.apache.solr.common.SolrException
>
> Stack Trace:
> java.lang.RuntimeException: org.apache.solr.common.SolrException
>        at org.apache.solr.util.TestHarness.<init>(TestHarness.java:152)
>        at org.apache.solr.util.TestHarness.<init>(TestHarness.java:135)
>        at org.apache.solr.util.TestHarness.<init>(TestHarness.java:125)
>        at org.apache.solr.SolrTestCaseJ4.createCore(SolrTestCaseJ4.java:342)
>        at org.apache.solr.SolrTestCaseJ4.initCore(SolrTestCaseJ4.java:335)
>        at org.apache.solr.SolrTestCaseJ4.initCore(SolrTestCaseJ4.java:158)
>        at org.apache.solr.SolrTestCaseJ4.initCore(SolrTestCaseJ4.java:147)
>        at org.apache.solr.handler.component.QueryElevationComponentTest.init(QueryElevationComponentTest.java:64)
>        at org.apache.solr.handler.component.QueryElevationComponentTest.init(QueryElevationComponentTest.java:52)
>        at org.apache.solr.handler.component.QueryElevationComponentTest.testMarkExcludes(QueryElevationComponentTest.java:243)
>        at sun.reflect.NativeMethodAccessorImpl.invoke0(Native Method)
>        at sun.reflect.NativeMethodAccessorImpl.invoke(NativeMethodAccessorImpl.java:57)
>        at sun.reflect.DelegatingMethodAccessorImpl.invoke(DelegatingMethodAccessorImpl.java:43)
>        at java.lang.reflect.Method.invoke(Method.java:616)
>        at org.junit.runners.model.FrameworkMethod$1.runReflectiveCall(FrameworkMethod.java:45)
>        at org.junit.internal.runners.model.ReflectiveCallable.run(ReflectiveCallable.java:15)
>        at org.junit.runners.model.FrameworkMethod.invokeExplosively(FrameworkMethod.java:42)
>        at org.junit.internal.runners.statements.InvokeMethod.evaluate(InvokeMethod.java:20)
>        at org.junit.internal.runners.statements.RunBefores.evaluate(RunBefores.java:28)
>        at org.junit.internal.runners.statements.RunAfters.evaluate(RunAfters.java:30)
>        at org.apache.lucene.util.SystemPropertiesRestoreRule$1.evaluate(SystemPropertiesRestoreRule.java:20)
>        at org.apache.lucene.util.LuceneTestCase$SubclassSetupTeardownRule$1.evaluate(LuceneTestCase.java:729)
>        at org.apache.lucene.util.LuceneTestCase$InternalSetupTeardownRule$1.evaluate(LuceneTestCase.java:645)
>        at org.apache.lucene.util.SystemPropertiesInvariantRule$1.evaluate(SystemPropertiesInvariantRule.java:22)
>        at org.apache.lucene.util.LuceneTestCase$TestResultInterceptorRule$1.evaluate(LuceneTestCase.java:556)
>        at org.apache.lucene.util.UncaughtExceptionsRule$1.evaluate(UncaughtExceptionsRule.java:51)
>        at org.apache.lucene.util.LuceneTestCase$RememberThreadRule$1.evaluate(LuceneTestCase.java:618)
>        at org.junit.rules.RunRules.evaluate(RunRules.java:18)
>        at org.junit.runners.ParentRunner.runLeaf(ParentRunner.java:263)
>        at org.junit.runners.BlockJUnit4ClassRunner.runChild(BlockJUnit4ClassRunner.java:68)
>        at org.apache.lucene.util.LuceneTestCaseRunner.runChild(LuceneTestCaseRunner.java:164)
>        at org.apache.lucene.util.LuceneTestCaseRunner.runChild(LuceneTestCaseRunner.java:57)
>        at org.junit.runners.ParentRunner$3.run(ParentRunner.java:231)
>        at org.junit.runners.ParentRunner$1.schedule(ParentRunner.java:60)
>        at org.junit.runners.ParentRunner.runChildren(ParentRunner.java:229)
>        at org.junit.runners.ParentRunner.access$000(ParentRunner.java:50)
>        at org.junit.runners.ParentRunner$2.evaluate(ParentRunner.java:222)
>        at org.junit.internal.runners.statements.RunBefores.evaluate(RunBefores.java:28)
>        at org.junit.internal.runners.statements.RunAfters.evaluate(RunAfters.java:30)
>        at org.apache.lucene.util.SystemPropertiesRestoreRule$1.evaluate(SystemPropertiesRestoreRule.java:20)
>        at org.apache.lucene.util.UncaughtExceptionsRule$1.evaluate(UncaughtExceptionsRule.java:51)
>        at org.apache.lucene.util.StoreClassNameRule$1.evaluate(StoreClassNameRule.java:21)
>        at org.apache.lucene.util.SystemPropertiesInvariantRule$1.evaluate(SystemPropertiesInvariantRule.java:22)
>        at org.junit.rules.RunRules.evaluate(RunRules.java:18)
>        at org.junit.runners.ParentRunner.run(ParentRunner.java:300)
>        at junit.framework.JUnit4TestAdapter.run(JUnit4TestAdapter.java:39)
>        at org.apache.tools.ant.taskdefs.optional.junit.JUnitTestRunner.run(JUnitTestRunner.java:420)
>        at org.apache.tools.ant.taskdefs.optional.junit.JUnitTestRunner.launch(JUnitTestRunner.java:911)
>        at org.apache.tools.ant.taskdefs.optional.junit.JUnitTestRunner.main(JUnitTestRunner.java:743)
> Caused by: org.apache.solr.common.SolrException
>        at org.apache.solr.core.SolrCore.<init>(SolrCore.java:614)
>        at org.apache.solr.core.SolrCore.<init>(SolrCore.java:498)
>        at org.apache.solr.util.TestHarness$Initializer.initialize(TestHarness.java:216)
>        at org.apache.solr.util.TestHarness.<init>(TestHarness.java:140)
>        ... 48 more
> Caused by: org.apache.solr.common.SolrException: Error initializing QueryElevationComponent.
>        at org.apache.solr.handler.component.QueryElevationComponent.inform(QueryElevationComponent.java:217)
>        at org.apache.solr.core.SolrResourceLoader.inform(SolrResourceLoader.java:542)
>        at org.apache.solr.core.SolrCore.<init>(SolrCore.java:609)
>        ... 51 more
> Caused by: org.apache.solr.common.SolrException: QueryElevationComponent missing config
file: 'elevate-data.xml
> either: /usr/home/hudson/hudson-slave/workspace/Lucene-Solr-tests-only-trunk/checkout/solr/core/src/test-files/solr/conf/elevate-data.xml
or /usr/home/hudson/hudson-slave/workspace/Lucene-Solr-tests-only-trunk/checkout/solr/build/solr-core/test/1/solrtest-QueryElevationComponentTest-1332181113990/elevate-data.xml
must exist, but not both.
>        at org.apache.solr.handler.component.QueryElevationComponent.inform(QueryElevationComponent.java:192)
>        ... 53 more
>
>
> REGRESSION:  org.apache.solr.handler.component.QueryElevationComponentTest.testMarker
>
> Error Message:
> org.apache.solr.common.SolrException
>
> Stack Trace:
> java.lang.RuntimeException: org.apache.solr.common.SolrException
>        at org.apache.solr.util.TestHarness.<init>(TestHarness.java:152)
>        at org.apache.solr.util.TestHarness.<init>(TestHarness.java:135)
>        at org.apache.solr.util.TestHarness.<init>(TestHarness.java:125)
>        at org.apache.solr.SolrTestCaseJ4.createCore(SolrTestCaseJ4.java:342)
>        at org.apache.solr.SolrTestCaseJ4.initCore(SolrTestCaseJ4.java:335)
>        at org.apache.solr.SolrTestCaseJ4.initCore(SolrTestCaseJ4.java:158)
>        at org.apache.solr.SolrTestCaseJ4.initCore(SolrTestCaseJ4.java:147)
>        at org.apache.solr.handler.component.QueryElevationComponentTest.init(QueryElevationComponentTest.java:64)
>        at org.apache.solr.handler.component.QueryElevationComponentTest.init(QueryElevationComponentTest.java:52)
>        at org.apache.solr.handler.component.QueryElevationComponentTest.testMarker(QueryElevationComponentTest.java:199)
>        at sun.reflect.NativeMethodAccessorImpl.invoke0(Native Method)
>        at sun.reflect.NativeMethodAccessorImpl.invoke(NativeMethodAccessorImpl.java:57)
>        at sun.reflect.DelegatingMethodAccessorImpl.invoke(DelegatingMethodAccessorImpl.java:43)
>        at java.lang.reflect.Method.invoke(Method.java:616)
>        at org.junit.runners.model.FrameworkMethod$1.runReflectiveCall(FrameworkMethod.java:45)
>        at org.junit.internal.runners.model.ReflectiveCallable.run(ReflectiveCallable.java:15)
>        at org.junit.runners.model.FrameworkMethod.invokeExplosively(FrameworkMethod.java:42)
>        at org.junit.internal.runners.statements.InvokeMethod.evaluate(InvokeMethod.java:20)
>        at org.junit.internal.runners.statements.RunBefores.evaluate(RunBefores.java:28)
>        at org.junit.internal.runners.statements.RunAfters.evaluate(RunAfters.java:30)
>        at org.apache.lucene.util.SystemPropertiesRestoreRule$1.evaluate(SystemPropertiesRestoreRule.java:20)
>        at org.apache.lucene.util.LuceneTestCase$SubclassSetupTeardownRule$1.evaluate(LuceneTestCase.java:729)
>        at org.apache.lucene.util.LuceneTestCase$InternalSetupTeardownRule$1.evaluate(LuceneTestCase.java:645)
>        at org.apache.lucene.util.SystemPropertiesInvariantRule$1.evaluate(SystemPropertiesInvariantRule.java:22)
>        at org.apache.lucene.util.LuceneTestCase$TestResultInterceptorRule$1.evaluate(LuceneTestCase.java:556)
>        at org.apache.lucene.util.UncaughtExceptionsRule$1.evaluate(UncaughtExceptionsRule.java:51)
>        at org.apache.lucene.util.LuceneTestCase$RememberThreadRule$1.evaluate(LuceneTestCase.java:618)
>        at org.junit.rules.RunRules.evaluate(RunRules.java:18)
>        at org.junit.runners.ParentRunner.runLeaf(ParentRunner.java:263)
>        at org.junit.runners.BlockJUnit4ClassRunner.runChild(BlockJUnit4ClassRunner.java:68)
>        at org.apache.lucene.util.LuceneTestCaseRunner.runChild(LuceneTestCaseRunner.java:164)
>        at org.apache.lucene.util.LuceneTestCaseRunner.runChild(LuceneTestCaseRunner.java:57)
>        at org.junit.runners.ParentRunner$3.run(ParentRunner.java:231)
>        at org.junit.runners.ParentRunner$1.schedule(ParentRunner.java:60)
>        at org.junit.runners.ParentRunner.runChildren(ParentRunner.java:229)
>        at org.junit.runners.ParentRunner.access$000(ParentRunner.java:50)
>        at org.junit.runners.ParentRunner$2.evaluate(ParentRunner.java:222)
>        at org.junit.internal.runners.statements.RunBefores.evaluate(RunBefores.java:28)
>        at org.junit.internal.runners.statements.RunAfters.evaluate(RunAfters.java:30)
>        at org.apache.lucene.util.SystemPropertiesRestoreRule$1.evaluate(SystemPropertiesRestoreRule.java:20)
>        at org.apache.lucene.util.UncaughtExceptionsRule$1.evaluate(UncaughtExceptionsRule.java:51)
>        at org.apache.lucene.util.StoreClassNameRule$1.evaluate(StoreClassNameRule.java:21)
>        at org.apache.lucene.util.SystemPropertiesInvariantRule$1.evaluate(SystemPropertiesInvariantRule.java:22)
>        at org.junit.rules.RunRules.evaluate(RunRules.java:18)
>        at org.junit.runners.ParentRunner.run(ParentRunner.java:300)
>        at junit.framework.JUnit4TestAdapter.run(JUnit4TestAdapter.java:39)
>        at org.apache.tools.ant.taskdefs.optional.junit.JUnitTestRunner.run(JUnitTestRunner.java:420)
>        at org.apache.tools.ant.taskdefs.optional.junit.JUnitTestRunner.launch(JUnitTestRunner.java:911)
>        at org.apache.tools.ant.taskdefs.optional.junit.JUnitTestRunner.main(JUnitTestRunner.java:743)
> Caused by: org.apache.solr.common.SolrException
>        at org.apache.solr.core.SolrCore.<init>(SolrCore.java:614)
>        at org.apache.solr.core.SolrCore.<init>(SolrCore.java:498)
>        at org.apache.solr.util.TestHarness$Initializer.initialize(TestHarness.java:216)
>        at org.apache.solr.util.TestHarness.<init>(TestHarness.java:140)
>        ... 48 more
> Caused by: org.apache.solr.common.SolrException: Error initializing QueryElevationComponent.
>        at org.apache.solr.handler.component.QueryElevationComponent.inform(QueryElevationComponent.java:217)
>        at org.apache.solr.core.SolrResourceLoader.inform(SolrResourceLoader.java:542)
>        at org.apache.solr.core.SolrCore.<init>(SolrCore.java:609)
>        ... 51 more
> Caused by: org.apache.solr.common.SolrException: QueryElevationComponent missing config
file: 'elevate-data.xml
> either: /usr/home/hudson/hudson-slave/workspace/Lucene-Solr-tests-only-trunk/checkout/solr/core/src/test-files/solr/conf/elevate-data.xml
or /usr/home/hudson/hudson-slave/workspace/Lucene-Solr-tests-only-trunk/checkout/solr/build/solr-core/test/1/solrtest-QueryElevationComponentTest-1332181114381/elevate-data.xml
must exist, but not both.
>        at org.apache.solr.handler.component.QueryElevationComponent.inform(QueryElevationComponent.java:192)
>        ... 53 more
>
>
>
>
> Build Log (for compile errors):
> [...truncated 9678 lines...]
>
>
>
>
> ---------------------------------------------------------------------
> To unsubscribe, e-mail: dev-unsubscribe@lucene.apache.org
> For additional commands, e-mail: dev-help@lucene.apache.org

---------------------------------------------------------------------
To unsubscribe, e-mail: dev-unsubscribe@lucene.apache.org
For additional commands, e-mail: dev-help@lucene.apache.org


Mime
View raw message