lucene-dev mailing list archives

Site index · List index
Message view « Date » · « Thread »
Top « Date » · « Thread »
From Apache Jenkins Server <jenk...@builds.apache.org>
Subject [JENKINS] Lucene-Solr-tests-only-trunk - Build # 12583 - Still Failing
Date Fri, 02 Mar 2012 13:27:17 GMT
Build: https://builds.apache.org/job/Lucene-Solr-tests-only-trunk/12583/

29 tests failed.
REGRESSION:  org.apache.lucene.search.spans.TestSpanExplanations.testSNear9

Error Message:
unable to create new native thread

Stack Trace:
java.lang.OutOfMemoryError: unable to create new native thread
	at java.lang.Thread.start0(Native Method)
	at java.lang.Thread.start(Thread.java:657)
	at java.util.concurrent.ThreadPoolExecutor.addWorker(ThreadPoolExecutor.java:943)
	at java.util.concurrent.ThreadPoolExecutor.prestartAllCoreThreads(ThreadPoolExecutor.java:1549)
	at org.apache.lucene.util.LuceneTestCase.newSearcher(LuceneTestCase.java:1436)
	at org.apache.lucene.util.LuceneTestCase.newSearcher(LuceneTestCase.java:1410)
	at org.apache.lucene.search.QueryUtils.wrapUnderlyingReader(QueryUtils.java:187)
	at org.apache.lucene.search.QueryUtils.check(QueryUtils.java:118)
	at org.apache.lucene.search.QueryUtils.check(QueryUtils.java:108)
	at org.apache.lucene.search.CheckHits.checkHitCollector(CheckHits.java:98)
	at org.apache.lucene.search.TestExplanations.qtest(TestExplanations.java:98)
	at org.apache.lucene.search.spans.TestSpanExplanations.testSNear9(TestSpanExplanations.java:132)
	at org.apache.lucene.util.LuceneTestCase$SubclassSetupTeardownRule$1.evaluate(LuceneTestCase.java:713)
	at org.apache.lucene.util.LuceneTestCase$InternalSetupTeardownRule$1.evaluate(LuceneTestCase.java:609)
	at org.apache.lucene.util.LuceneTestCase$TestResultInterceptorRule$1.evaluate(LuceneTestCase.java:509)
	at org.apache.lucene.util.LuceneTestCase$RememberThreadRule$1.evaluate(LuceneTestCase.java:571)
	at org.apache.lucene.util.LuceneTestCaseRunner.runChild(LuceneTestCaseRunner.java:165)
	at org.apache.lucene.util.LuceneTestCaseRunner.runChild(LuceneTestCaseRunner.java:57)


REGRESSION:  org.apache.lucene.search.spans.TestSpanExplanations.testSNear10

Error Message:
unable to create new native thread

Stack Trace:
java.lang.OutOfMemoryError: unable to create new native thread
	at java.lang.Thread.start0(Native Method)
	at java.lang.Thread.start(Thread.java:657)
	at java.util.concurrent.ThreadPoolExecutor.addWorker(ThreadPoolExecutor.java:943)
	at java.util.concurrent.ThreadPoolExecutor.prestartAllCoreThreads(ThreadPoolExecutor.java:1549)
	at org.apache.lucene.util.LuceneTestCase.newSearcher(LuceneTestCase.java:1436)
	at org.apache.lucene.util.LuceneTestCase.newSearcher(LuceneTestCase.java:1410)
	at org.apache.lucene.search.QueryUtils$2.setNextReader(QueryUtils.java:325)
	at org.apache.lucene.search.IndexSearcher.search(IndexSearcher.java:505)
	at org.apache.lucene.search.IndexSearcher.search(IndexSearcher.java:297)
	at org.apache.lucene.search.QueryUtils.checkSkipTo(QueryUtils.java:264)
	at org.apache.lucene.search.QueryUtils.check(QueryUtils.java:115)
	at org.apache.lucene.search.QueryUtils.check(QueryUtils.java:117)
	at org.apache.lucene.search.QueryUtils.check(QueryUtils.java:108)
	at org.apache.lucene.search.CheckHits.checkHitCollector(CheckHits.java:98)
	at org.apache.lucene.search.TestExplanations.qtest(TestExplanations.java:98)
	at org.apache.lucene.search.spans.TestSpanExplanations.testSNear10(TestSpanExplanations.java:136)
	at org.apache.lucene.util.LuceneTestCase$SubclassSetupTeardownRule$1.evaluate(LuceneTestCase.java:713)
	at org.apache.lucene.util.LuceneTestCase$InternalSetupTeardownRule$1.evaluate(LuceneTestCase.java:609)
	at org.apache.lucene.util.LuceneTestCase$TestResultInterceptorRule$1.evaluate(LuceneTestCase.java:509)
	at org.apache.lucene.util.LuceneTestCase$RememberThreadRule$1.evaluate(LuceneTestCase.java:571)
	at org.apache.lucene.util.LuceneTestCaseRunner.runChild(LuceneTestCaseRunner.java:165)
	at org.apache.lucene.util.LuceneTestCaseRunner.runChild(LuceneTestCaseRunner.java:57)


REGRESSION:  org.apache.lucene.search.spans.TestSpanExplanations.testSNot4

Error Message:
unable to create new native thread

Stack Trace:
java.lang.OutOfMemoryError: unable to create new native thread
	at java.lang.Thread.start0(Native Method)
	at java.lang.Thread.start(Thread.java:657)
	at java.util.concurrent.ThreadPoolExecutor.addWorker(ThreadPoolExecutor.java:943)
	at java.util.concurrent.ThreadPoolExecutor.prestartAllCoreThreads(ThreadPoolExecutor.java:1549)
	at org.apache.lucene.util.LuceneTestCase.newSearcher(LuceneTestCase.java:1436)
	at org.apache.lucene.util.LuceneTestCase.newSearcher(LuceneTestCase.java:1410)
	at org.apache.lucene.search.QueryUtils.wrapUnderlyingReader(QueryUtils.java:187)
	at org.apache.lucene.search.QueryUtils.check(QueryUtils.java:118)
	at org.apache.lucene.search.QueryUtils.check(QueryUtils.java:108)
	at org.apache.lucene.search.CheckHits.checkHitCollector(CheckHits.java:98)
	at org.apache.lucene.search.TestExplanations.qtest(TestExplanations.java:98)
	at org.apache.lucene.search.spans.TestSpanExplanations.testSNot4(TestSpanExplanations.java:157)
	at org.apache.lucene.util.LuceneTestCase$SubclassSetupTeardownRule$1.evaluate(LuceneTestCase.java:713)
	at org.apache.lucene.util.LuceneTestCase$InternalSetupTeardownRule$1.evaluate(LuceneTestCase.java:609)
	at org.apache.lucene.util.LuceneTestCase$TestResultInterceptorRule$1.evaluate(LuceneTestCase.java:509)
	at org.apache.lucene.util.LuceneTestCase$RememberThreadRule$1.evaluate(LuceneTestCase.java:571)
	at org.apache.lucene.util.LuceneTestCaseRunner.runChild(LuceneTestCaseRunner.java:165)
	at org.apache.lucene.util.LuceneTestCaseRunner.runChild(LuceneTestCaseRunner.java:57)


REGRESSION:  org.apache.lucene.search.spans.TestSpanExplanations.testSNear8

Error Message:
unable to create new native thread

Stack Trace:
java.lang.OutOfMemoryError: unable to create new native thread
	at java.lang.Thread.start0(Native Method)
	at java.lang.Thread.start(Thread.java:657)
	at java.util.concurrent.ThreadPoolExecutor.addWorker(ThreadPoolExecutor.java:943)
	at java.util.concurrent.ThreadPoolExecutor.prestartAllCoreThreads(ThreadPoolExecutor.java:1549)
	at org.apache.lucene.util.LuceneTestCase.newSearcher(LuceneTestCase.java:1436)
	at org.apache.lucene.search.QueryUtils.checkSkipTo(QueryUtils.java:351)
	at org.apache.lucene.search.QueryUtils.check(QueryUtils.java:115)
	at org.apache.lucene.search.QueryUtils.check(QueryUtils.java:108)
	at org.apache.lucene.search.CheckHits.checkHitCollector(CheckHits.java:98)
	at org.apache.lucene.search.TestExplanations.qtest(TestExplanations.java:98)
	at org.apache.lucene.search.spans.TestSpanExplanations.testSNear8(TestSpanExplanations.java:128)
	at org.apache.lucene.util.LuceneTestCase$SubclassSetupTeardownRule$1.evaluate(LuceneTestCase.java:713)
	at org.apache.lucene.util.LuceneTestCase$InternalSetupTeardownRule$1.evaluate(LuceneTestCase.java:609)
	at org.apache.lucene.util.LuceneTestCase$TestResultInterceptorRule$1.evaluate(LuceneTestCase.java:509)
	at org.apache.lucene.util.LuceneTestCase$RememberThreadRule$1.evaluate(LuceneTestCase.java:571)
	at org.apache.lucene.util.LuceneTestCaseRunner.runChild(LuceneTestCaseRunner.java:165)
	at org.apache.lucene.util.LuceneTestCaseRunner.runChild(LuceneTestCaseRunner.java:57)


REGRESSION:  org.apache.lucene.search.spans.TestSpanExplanations.testST4

Error Message:
unable to create new native thread

Stack Trace:
java.lang.OutOfMemoryError: unable to create new native thread
	at java.lang.Thread.start0(Native Method)
	at java.lang.Thread.start(Thread.java:657)
	at java.util.concurrent.ThreadPoolExecutor.addWorker(ThreadPoolExecutor.java:943)
	at java.util.concurrent.ThreadPoolExecutor.prestartAllCoreThreads(ThreadPoolExecutor.java:1549)
	at org.apache.lucene.util.LuceneTestCase.newSearcher(LuceneTestCase.java:1436)
	at org.apache.lucene.search.QueryUtils.checkSkipTo(QueryUtils.java:351)
	at org.apache.lucene.search.QueryUtils.check(QueryUtils.java:115)
	at org.apache.lucene.search.QueryUtils.check(QueryUtils.java:118)
	at org.apache.lucene.search.QueryUtils.check(QueryUtils.java:108)
	at org.apache.lucene.search.CheckHits.checkHitCollector(CheckHits.java:98)
	at org.apache.lucene.search.TestExplanations.qtest(TestExplanations.java:98)
	at org.apache.lucene.search.spans.TestSpanExplanations.testST4(TestSpanExplanations.java:41)
	at org.apache.lucene.util.LuceneTestCase$SubclassSetupTeardownRule$1.evaluate(LuceneTestCase.java:713)
	at org.apache.lucene.util.LuceneTestCase$InternalSetupTeardownRule$1.evaluate(LuceneTestCase.java:609)
	at org.apache.lucene.util.LuceneTestCase$TestResultInterceptorRule$1.evaluate(LuceneTestCase.java:509)
	at org.apache.lucene.util.LuceneTestCase$RememberThreadRule$1.evaluate(LuceneTestCase.java:571)
	at org.apache.lucene.util.LuceneTestCaseRunner.runChild(LuceneTestCaseRunner.java:165)
	at org.apache.lucene.util.LuceneTestCaseRunner.runChild(LuceneTestCaseRunner.java:57)


REGRESSION:  org.apache.lucene.search.spans.TestSpanExplanations.testSO3

Error Message:
unable to create new native thread

Stack Trace:
java.lang.OutOfMemoryError: unable to create new native thread
	at java.lang.Thread.start0(Native Method)
	at java.lang.Thread.start(Thread.java:657)
	at java.util.concurrent.ThreadPoolExecutor.addWorker(ThreadPoolExecutor.java:943)
	at java.util.concurrent.ThreadPoolExecutor.prestartAllCoreThreads(ThreadPoolExecutor.java:1549)
	at org.apache.lucene.util.LuceneTestCase.newSearcher(LuceneTestCase.java:1436)
	at org.apache.lucene.search.QueryUtils.checkSkipTo(QueryUtils.java:351)
	at org.apache.lucene.search.QueryUtils.check(QueryUtils.java:115)
	at org.apache.lucene.search.QueryUtils.check(QueryUtils.java:119)
	at org.apache.lucene.search.QueryUtils.check(QueryUtils.java:108)
	at org.apache.lucene.search.CheckHits.checkHitCollector(CheckHits.java:98)
	at org.apache.lucene.search.TestExplanations.qtest(TestExplanations.java:98)
	at org.apache.lucene.search.spans.TestSpanExplanations.testSO3(TestSpanExplanations.java:86)
	at org.apache.lucene.util.LuceneTestCase$SubclassSetupTeardownRule$1.evaluate(LuceneTestCase.java:713)
	at org.apache.lucene.util.LuceneTestCase$InternalSetupTeardownRule$1.evaluate(LuceneTestCase.java:609)
	at org.apache.lucene.util.LuceneTestCase$TestResultInterceptorRule$1.evaluate(LuceneTestCase.java:509)
	at org.apache.lucene.util.LuceneTestCase$RememberThreadRule$1.evaluate(LuceneTestCase.java:571)
	at org.apache.lucene.util.LuceneTestCaseRunner.runChild(LuceneTestCaseRunner.java:165)
	at org.apache.lucene.util.LuceneTestCaseRunner.runChild(LuceneTestCaseRunner.java:57)


REGRESSION:  org.apache.lucene.search.spans.TestSpanExplanations.testSO1

Error Message:
unable to create new native thread

Stack Trace:
java.lang.OutOfMemoryError: unable to create new native thread
	at java.lang.Thread.start0(Native Method)
	at java.lang.Thread.start(Thread.java:657)
	at java.util.concurrent.ThreadPoolExecutor.addWorker(ThreadPoolExecutor.java:943)
	at java.util.concurrent.ThreadPoolExecutor.prestartAllCoreThreads(ThreadPoolExecutor.java:1549)
	at org.apache.lucene.util.LuceneTestCase.newSearcher(LuceneTestCase.java:1436)
	at org.apache.lucene.util.LuceneTestCase.newSearcher(LuceneTestCase.java:1410)
	at org.apache.lucene.search.QueryUtils$2.setNextReader(QueryUtils.java:325)
	at org.apache.lucene.search.IndexSearcher.search(IndexSearcher.java:505)
	at org.apache.lucene.search.IndexSearcher.search(IndexSearcher.java:297)
	at org.apache.lucene.search.QueryUtils.checkSkipTo(QueryUtils.java:264)
	at org.apache.lucene.search.QueryUtils.check(QueryUtils.java:115)
	at org.apache.lucene.search.QueryUtils.check(QueryUtils.java:117)
	at org.apache.lucene.search.QueryUtils.check(QueryUtils.java:108)
	at org.apache.lucene.search.CheckHits.checkHitCollector(CheckHits.java:98)
	at org.apache.lucene.search.TestExplanations.qtest(TestExplanations.java:98)
	at org.apache.lucene.search.spans.TestSpanExplanations.testSO1(TestSpanExplanations.java:78)
	at org.apache.lucene.util.LuceneTestCase$SubclassSetupTeardownRule$1.evaluate(LuceneTestCase.java:713)
	at org.apache.lucene.util.LuceneTestCase$InternalSetupTeardownRule$1.evaluate(LuceneTestCase.java:609)
	at org.apache.lucene.util.LuceneTestCase$TestResultInterceptorRule$1.evaluate(LuceneTestCase.java:509)
	at org.apache.lucene.util.LuceneTestCase$RememberThreadRule$1.evaluate(LuceneTestCase.java:571)
	at org.apache.lucene.util.LuceneTestCaseRunner.runChild(LuceneTestCaseRunner.java:165)
	at org.apache.lucene.util.LuceneTestCaseRunner.runChild(LuceneTestCaseRunner.java:57)


REGRESSION:  org.apache.lucene.search.spans.TestSpanExplanations.testSNear4

Error Message:
unable to create new native thread

Stack Trace:
java.lang.OutOfMemoryError: unable to create new native thread
	at java.lang.Thread.start0(Native Method)
	at java.lang.Thread.start(Thread.java:657)
	at java.util.concurrent.ThreadPoolExecutor.addWorker(ThreadPoolExecutor.java:943)
	at java.util.concurrent.ThreadPoolExecutor.prestartAllCoreThreads(ThreadPoolExecutor.java:1549)
	at org.apache.lucene.util.LuceneTestCase.newSearcher(LuceneTestCase.java:1436)
	at org.apache.lucene.search.QueryUtils.checkSkipTo(QueryUtils.java:351)
	at org.apache.lucene.search.QueryUtils.check(QueryUtils.java:115)
	at org.apache.lucene.search.QueryUtils.check(QueryUtils.java:108)
	at org.apache.lucene.search.CheckHits.checkHitCollector(CheckHits.java:98)
	at org.apache.lucene.search.TestExplanations.qtest(TestExplanations.java:98)
	at org.apache.lucene.search.spans.TestSpanExplanations.testSNear4(TestSpanExplanations.java:111)
	at org.apache.lucene.util.LuceneTestCase$SubclassSetupTeardownRule$1.evaluate(LuceneTestCase.java:713)
	at org.apache.lucene.util.LuceneTestCase$InternalSetupTeardownRule$1.evaluate(LuceneTestCase.java:609)
	at org.apache.lucene.util.LuceneTestCase$TestResultInterceptorRule$1.evaluate(LuceneTestCase.java:509)
	at org.apache.lucene.util.LuceneTestCase$RememberThreadRule$1.evaluate(LuceneTestCase.java:571)
	at org.apache.lucene.util.LuceneTestCaseRunner.runChild(LuceneTestCaseRunner.java:165)
	at org.apache.lucene.util.LuceneTestCaseRunner.runChild(LuceneTestCaseRunner.java:57)


REGRESSION:  org.apache.lucene.search.spans.TestSpanExplanations.testSF5

Error Message:
unable to create new native thread

Stack Trace:
java.lang.OutOfMemoryError: unable to create new native thread
	at java.lang.Thread.start0(Native Method)
	at java.lang.Thread.start(Thread.java:657)
	at java.util.concurrent.ThreadPoolExecutor.addWorker(ThreadPoolExecutor.java:943)
	at java.util.concurrent.ThreadPoolExecutor.prestartAllCoreThreads(ThreadPoolExecutor.java:1549)
	at org.apache.lucene.util.LuceneTestCase.newSearcher(LuceneTestCase.java:1436)
	at org.apache.lucene.util.LuceneTestCase.newSearcher(LuceneTestCase.java:1410)
	at org.apache.lucene.search.QueryUtils$2.setNextReader(QueryUtils.java:325)
	at org.apache.lucene.search.IndexSearcher.search(IndexSearcher.java:505)
	at org.apache.lucene.search.IndexSearcher.search(IndexSearcher.java:297)
	at org.apache.lucene.search.QueryUtils.checkSkipTo(QueryUtils.java:264)
	at org.apache.lucene.search.QueryUtils.check(QueryUtils.java:115)
	at org.apache.lucene.search.QueryUtils.check(QueryUtils.java:117)
	at org.apache.lucene.search.QueryUtils.check(QueryUtils.java:108)
	at org.apache.lucene.search.CheckHits.checkHitCollector(CheckHits.java:98)
	at org.apache.lucene.search.TestExplanations.qtest(TestExplanations.java:98)
	at org.apache.lucene.search.spans.TestSpanExplanations.testSF5(TestSpanExplanations.java:66)
	at org.apache.lucene.util.LuceneTestCase$SubclassSetupTeardownRule$1.evaluate(LuceneTestCase.java:713)
	at org.apache.lucene.util.LuceneTestCase$InternalSetupTeardownRule$1.evaluate(LuceneTestCase.java:609)
	at org.apache.lucene.util.LuceneTestCase$TestResultInterceptorRule$1.evaluate(LuceneTestCase.java:509)
	at org.apache.lucene.util.LuceneTestCase$RememberThreadRule$1.evaluate(LuceneTestCase.java:571)
	at org.apache.lucene.util.LuceneTestCaseRunner.runChild(LuceneTestCaseRunner.java:165)
	at org.apache.lucene.util.LuceneTestCaseRunner.runChild(LuceneTestCaseRunner.java:57)


REGRESSION:  org.apache.lucene.search.spans.TestSpanExplanations.testSNear1

Error Message:
unable to create new native thread

Stack Trace:
java.lang.OutOfMemoryError: unable to create new native thread
	at java.lang.Thread.start0(Native Method)
	at java.lang.Thread.start(Thread.java:657)
	at java.util.concurrent.ThreadPoolExecutor.addWorker(ThreadPoolExecutor.java:943)
	at java.util.concurrent.ThreadPoolExecutor.prestartAllCoreThreads(ThreadPoolExecutor.java:1549)
	at org.apache.lucene.util.LuceneTestCase.newSearcher(LuceneTestCase.java:1436)
	at org.apache.lucene.util.LuceneTestCase.newSearcher(LuceneTestCase.java:1410)
	at org.apache.lucene.search.QueryUtils$3.setNextReader(QueryUtils.java:410)
	at org.apache.lucene.search.IndexSearcher.search(IndexSearcher.java:505)
	at org.apache.lucene.search.IndexSearcher.search(IndexSearcher.java:297)
	at org.apache.lucene.search.QueryUtils.checkFirstSkipTo(QueryUtils.java:370)
	at org.apache.lucene.search.QueryUtils.check(QueryUtils.java:114)
	at org.apache.lucene.search.QueryUtils.check(QueryUtils.java:117)
	at org.apache.lucene.search.QueryUtils.check(QueryUtils.java:108)
	at org.apache.lucene.search.CheckHits.checkHitCollector(CheckHits.java:98)
	at org.apache.lucene.search.TestExplanations.qtest(TestExplanations.java:98)
	at org.apache.lucene.search.spans.TestSpanExplanations.testSNear1(TestSpanExplanations.java:99)
	at org.apache.lucene.util.LuceneTestCase$SubclassSetupTeardownRule$1.evaluate(LuceneTestCase.java:713)
	at org.apache.lucene.util.LuceneTestCase$InternalSetupTeardownRule$1.evaluate(LuceneTestCase.java:609)
	at org.apache.lucene.util.LuceneTestCase$TestResultInterceptorRule$1.evaluate(LuceneTestCase.java:509)
	at org.apache.lucene.util.LuceneTestCase$RememberThreadRule$1.evaluate(LuceneTestCase.java:571)
	at org.apache.lucene.util.LuceneTestCaseRunner.runChild(LuceneTestCaseRunner.java:165)
	at org.apache.lucene.util.LuceneTestCaseRunner.runChild(LuceneTestCaseRunner.java:57)


REGRESSION:  org.apache.lucene.search.spans.TestSpanExplanations.testSNear2

Error Message:
unable to create new native thread

Stack Trace:
java.lang.OutOfMemoryError: unable to create new native thread
	at java.lang.Thread.start0(Native Method)
	at java.lang.Thread.start(Thread.java:657)
	at java.util.concurrent.ThreadPoolExecutor.addWorker(ThreadPoolExecutor.java:943)
	at java.util.concurrent.ThreadPoolExecutor.prestartAllCoreThreads(ThreadPoolExecutor.java:1549)
	at org.apache.lucene.util.LuceneTestCase.newSearcher(LuceneTestCase.java:1436)
	at org.apache.lucene.util.LuceneTestCase.newSearcher(LuceneTestCase.java:1410)
	at org.apache.lucene.search.QueryUtils$2.setNextReader(QueryUtils.java:325)
	at org.apache.lucene.search.IndexSearcher.search(IndexSearcher.java:505)
	at org.apache.lucene.search.IndexSearcher.search(IndexSearcher.java:297)
	at org.apache.lucene.search.QueryUtils.checkSkipTo(QueryUtils.java:264)
	at org.apache.lucene.search.QueryUtils.check(QueryUtils.java:115)
	at org.apache.lucene.search.QueryUtils.check(QueryUtils.java:117)
	at org.apache.lucene.search.QueryUtils.check(QueryUtils.java:108)
	at org.apache.lucene.search.CheckHits.checkHitCollector(CheckHits.java:98)
	at org.apache.lucene.search.TestExplanations.qtest(TestExplanations.java:98)
	at org.apache.lucene.search.spans.TestSpanExplanations.testSNear2(TestSpanExplanations.java:103)
	at org.apache.lucene.util.LuceneTestCase$SubclassSetupTeardownRule$1.evaluate(LuceneTestCase.java:713)
	at org.apache.lucene.util.LuceneTestCase$InternalSetupTeardownRule$1.evaluate(LuceneTestCase.java:609)
	at org.apache.lucene.util.LuceneTestCase$TestResultInterceptorRule$1.evaluate(LuceneTestCase.java:509)
	at org.apache.lucene.util.LuceneTestCase$RememberThreadRule$1.evaluate(LuceneTestCase.java:571)
	at org.apache.lucene.util.LuceneTestCaseRunner.runChild(LuceneTestCaseRunner.java:165)
	at org.apache.lucene.util.LuceneTestCaseRunner.runChild(LuceneTestCaseRunner.java:57)


REGRESSION:  org.apache.lucene.search.spans.TestSpanExplanations.testST2

Error Message:
unable to create new native thread

Stack Trace:
java.lang.OutOfMemoryError: unable to create new native thread
	at java.lang.Thread.start0(Native Method)
	at java.lang.Thread.start(Thread.java:657)
	at java.util.concurrent.ThreadPoolExecutor.addWorker(ThreadPoolExecutor.java:943)
	at java.util.concurrent.ThreadPoolExecutor.prestartAllCoreThreads(ThreadPoolExecutor.java:1549)
	at org.apache.lucene.util.LuceneTestCase.newSearcher(LuceneTestCase.java:1436)
	at org.apache.lucene.search.QueryUtils.checkSkipTo(QueryUtils.java:351)
	at org.apache.lucene.search.QueryUtils.check(QueryUtils.java:115)
	at org.apache.lucene.search.QueryUtils.check(QueryUtils.java:117)
	at org.apache.lucene.search.QueryUtils.check(QueryUtils.java:108)
	at org.apache.lucene.search.CheckHits.checkHitCollector(CheckHits.java:98)
	at org.apache.lucene.search.TestExplanations.qtest(TestExplanations.java:98)
	at org.apache.lucene.search.spans.TestSpanExplanations.testST2(TestSpanExplanations.java:37)
	at org.apache.lucene.util.LuceneTestCase$SubclassSetupTeardownRule$1.evaluate(LuceneTestCase.java:713)
	at org.apache.lucene.util.LuceneTestCase$InternalSetupTeardownRule$1.evaluate(LuceneTestCase.java:609)
	at org.apache.lucene.util.LuceneTestCase$TestResultInterceptorRule$1.evaluate(LuceneTestCase.java:509)
	at org.apache.lucene.util.LuceneTestCase$RememberThreadRule$1.evaluate(LuceneTestCase.java:571)
	at org.apache.lucene.util.LuceneTestCaseRunner.runChild(LuceneTestCaseRunner.java:165)
	at org.apache.lucene.util.LuceneTestCaseRunner.runChild(LuceneTestCaseRunner.java:57)


REGRESSION:  org.apache.lucene.search.spans.TestSpanExplanations.testST5

Error Message:
unable to create new native thread

Stack Trace:
java.lang.OutOfMemoryError: unable to create new native thread
	at java.lang.Thread.start0(Native Method)
	at java.lang.Thread.start(Thread.java:657)
	at java.util.concurrent.ThreadPoolExecutor.addWorker(ThreadPoolExecutor.java:943)
	at java.util.concurrent.ThreadPoolExecutor.prestartAllCoreThreads(ThreadPoolExecutor.java:1549)
	at org.apache.lucene.util.LuceneTestCase.newSearcher(LuceneTestCase.java:1436)
	at org.apache.lucene.util.LuceneTestCase.newSearcher(LuceneTestCase.java:1410)
	at org.apache.lucene.search.QueryUtils$2.setNextReader(QueryUtils.java:325)
	at org.apache.lucene.search.IndexSearcher.search(IndexSearcher.java:505)
	at org.apache.lucene.search.IndexSearcher.search(IndexSearcher.java:297)
	at org.apache.lucene.search.QueryUtils.checkSkipTo(QueryUtils.java:264)
	at org.apache.lucene.search.QueryUtils.check(QueryUtils.java:115)
	at org.apache.lucene.search.QueryUtils.check(QueryUtils.java:117)
	at org.apache.lucene.search.QueryUtils.check(QueryUtils.java:108)
	at org.apache.lucene.search.CheckHits.checkHitCollector(CheckHits.java:98)
	at org.apache.lucene.search.TestExplanations.qtest(TestExplanations.java:98)
	at org.apache.lucene.search.spans.TestSpanExplanations.testST5(TestSpanExplanations.java:46)
	at org.apache.lucene.util.LuceneTestCase$SubclassSetupTeardownRule$1.evaluate(LuceneTestCase.java:713)
	at org.apache.lucene.util.LuceneTestCase$InternalSetupTeardownRule$1.evaluate(LuceneTestCase.java:609)
	at org.apache.lucene.util.LuceneTestCase$TestResultInterceptorRule$1.evaluate(LuceneTestCase.java:509)
	at org.apache.lucene.util.LuceneTestCase$RememberThreadRule$1.evaluate(LuceneTestCase.java:571)
	at org.apache.lucene.util.LuceneTestCaseRunner.runChild(LuceneTestCaseRunner.java:165)
	at org.apache.lucene.util.LuceneTestCaseRunner.runChild(LuceneTestCaseRunner.java:57)


REGRESSION:  org.apache.lucene.search.spans.TestSpanExplanations.testSNot1

Error Message:
unable to create new native thread

Stack Trace:
java.lang.OutOfMemoryError: unable to create new native thread
	at java.lang.Thread.start0(Native Method)
	at java.lang.Thread.start(Thread.java:657)
	at java.util.concurrent.ThreadPoolExecutor.addWorker(ThreadPoolExecutor.java:943)
	at java.util.concurrent.ThreadPoolExecutor.prestartAllCoreThreads(ThreadPoolExecutor.java:1549)
	at org.apache.lucene.util.LuceneTestCase.newSearcher(LuceneTestCase.java:1436)
	at org.apache.lucene.search.QueryUtils.checkSkipTo(QueryUtils.java:351)
	at org.apache.lucene.search.QueryUtils.check(QueryUtils.java:115)
	at org.apache.lucene.search.QueryUtils.check(QueryUtils.java:117)
	at org.apache.lucene.search.QueryUtils.check(QueryUtils.java:108)
	at org.apache.lucene.search.CheckHits.checkHitCollector(CheckHits.java:98)
	at org.apache.lucene.search.TestExplanations.qtest(TestExplanations.java:98)
	at org.apache.lucene.search.spans.TestSpanExplanations.testSNot1(TestSpanExplanations.java:148)
	at org.apache.lucene.util.LuceneTestCase$SubclassSetupTeardownRule$1.evaluate(LuceneTestCase.java:713)
	at org.apache.lucene.util.LuceneTestCase$InternalSetupTeardownRule$1.evaluate(LuceneTestCase.java:609)
	at org.apache.lucene.util.LuceneTestCase$TestResultInterceptorRule$1.evaluate(LuceneTestCase.java:509)
	at org.apache.lucene.util.LuceneTestCase$RememberThreadRule$1.evaluate(LuceneTestCase.java:571)
	at org.apache.lucene.util.LuceneTestCaseRunner.runChild(LuceneTestCaseRunner.java:165)
	at org.apache.lucene.util.LuceneTestCaseRunner.runChild(LuceneTestCaseRunner.java:57)


REGRESSION:  org.apache.lucene.search.spans.TestSpanExplanations.testSNear5

Error Message:
unable to create new native thread

Stack Trace:
java.lang.OutOfMemoryError: unable to create new native thread
	at java.lang.Thread.start0(Native Method)
	at java.lang.Thread.start(Thread.java:657)
	at java.util.concurrent.ThreadPoolExecutor.addWorker(ThreadPoolExecutor.java:943)
	at java.util.concurrent.ThreadPoolExecutor.prestartAllCoreThreads(ThreadPoolExecutor.java:1549)
	at org.apache.lucene.util.LuceneTestCase.newSearcher(LuceneTestCase.java:1436)
	at org.apache.lucene.search.QueryUtils.checkSkipTo(QueryUtils.java:351)
	at org.apache.lucene.search.QueryUtils.check(QueryUtils.java:115)
	at org.apache.lucene.search.QueryUtils.check(QueryUtils.java:118)
	at org.apache.lucene.search.QueryUtils.check(QueryUtils.java:108)
	at org.apache.lucene.search.CheckHits.checkHitCollector(CheckHits.java:98)
	at org.apache.lucene.search.TestExplanations.qtest(TestExplanations.java:98)
	at org.apache.lucene.search.spans.TestSpanExplanations.testSNear5(TestSpanExplanations.java:115)
	at org.apache.lucene.util.LuceneTestCase$SubclassSetupTeardownRule$1.evaluate(LuceneTestCase.java:713)
	at org.apache.lucene.util.LuceneTestCase$InternalSetupTeardownRule$1.evaluate(LuceneTestCase.java:609)
	at org.apache.lucene.util.LuceneTestCase$TestResultInterceptorRule$1.evaluate(LuceneTestCase.java:509)
	at org.apache.lucene.util.LuceneTestCase$RememberThreadRule$1.evaluate(LuceneTestCase.java:571)
	at org.apache.lucene.util.LuceneTestCaseRunner.runChild(LuceneTestCaseRunner.java:165)
	at org.apache.lucene.util.LuceneTestCaseRunner.runChild(LuceneTestCaseRunner.java:57)


REGRESSION:  org.apache.lucene.search.spans.TestSpanExplanations.testSF1

Error Message:
unable to create new native thread

Stack Trace:
java.lang.OutOfMemoryError: unable to create new native thread
	at java.lang.Thread.start0(Native Method)
	at java.lang.Thread.start(Thread.java:657)
	at java.util.concurrent.ThreadPoolExecutor.addWorker(ThreadPoolExecutor.java:943)
	at java.util.concurrent.ThreadPoolExecutor.prestartAllCoreThreads(ThreadPoolExecutor.java:1549)
	at org.apache.lucene.util.LuceneTestCase.newSearcher(LuceneTestCase.java:1436)
	at org.apache.lucene.search.QueryUtils.checkSkipTo(QueryUtils.java:351)
	at org.apache.lucene.search.QueryUtils.check(QueryUtils.java:115)
	at org.apache.lucene.search.QueryUtils.check(QueryUtils.java:108)
	at org.apache.lucene.search.CheckHits.checkHitCollector(CheckHits.java:98)
	at org.apache.lucene.search.TestExplanations.qtest(TestExplanations.java:98)
	at org.apache.lucene.search.spans.TestSpanExplanations.testSF1(TestSpanExplanations.java:53)
	at org.apache.lucene.util.LuceneTestCase$SubclassSetupTeardownRule$1.evaluate(LuceneTestCase.java:713)
	at org.apache.lucene.util.LuceneTestCase$InternalSetupTeardownRule$1.evaluate(LuceneTestCase.java:609)
	at org.apache.lucene.util.LuceneTestCase$TestResultInterceptorRule$1.evaluate(LuceneTestCase.java:509)
	at org.apache.lucene.util.LuceneTestCase$RememberThreadRule$1.evaluate(LuceneTestCase.java:571)
	at org.apache.lucene.util.LuceneTestCaseRunner.runChild(LuceneTestCaseRunner.java:165)
	at org.apache.lucene.util.LuceneTestCaseRunner.runChild(LuceneTestCaseRunner.java:57)


REGRESSION:  org.apache.lucene.search.spans.TestSpanExplanations.testSNot10

Error Message:
unable to create new native thread

Stack Trace:
java.lang.OutOfMemoryError: unable to create new native thread
	at java.lang.Thread.start0(Native Method)
	at java.lang.Thread.start(Thread.java:657)
	at java.util.concurrent.ThreadPoolExecutor.addWorker(ThreadPoolExecutor.java:943)
	at java.util.concurrent.ThreadPoolExecutor.prestartAllCoreThreads(ThreadPoolExecutor.java:1549)
	at org.apache.lucene.util.LuceneTestCase.newSearcher(LuceneTestCase.java:1436)
	at org.apache.lucene.util.LuceneTestCase.newSearcher(LuceneTestCase.java:1410)
	at org.apache.lucene.search.QueryUtils$2.setNextReader(QueryUtils.java:325)
	at org.apache.lucene.search.IndexSearcher.search(IndexSearcher.java:505)
	at org.apache.lucene.search.IndexSearcher.search(IndexSearcher.java:297)
	at org.apache.lucene.search.QueryUtils.checkSkipTo(QueryUtils.java:264)
	at org.apache.lucene.search.QueryUtils.check(QueryUtils.java:115)
	at org.apache.lucene.search.QueryUtils.check(QueryUtils.java:117)
	at org.apache.lucene.search.QueryUtils.check(QueryUtils.java:108)
	at org.apache.lucene.search.CheckHits.checkHitCollector(CheckHits.java:98)
	at org.apache.lucene.search.TestExplanations.qtest(TestExplanations.java:98)
	at org.apache.lucene.search.spans.TestSpanExplanations.testSNot10(TestSpanExplanations.java:174)
	at org.apache.lucene.util.LuceneTestCase$SubclassSetupTeardownRule$1.evaluate(LuceneTestCase.java:713)
	at org.apache.lucene.util.LuceneTestCase$InternalSetupTeardownRule$1.evaluate(LuceneTestCase.java:609)
	at org.apache.lucene.util.LuceneTestCase$TestResultInterceptorRule$1.evaluate(LuceneTestCase.java:509)
	at org.apache.lucene.util.LuceneTestCase$RememberThreadRule$1.evaluate(LuceneTestCase.java:571)
	at org.apache.lucene.util.LuceneTestCaseRunner.runChild(LuceneTestCaseRunner.java:165)
	at org.apache.lucene.util.LuceneTestCaseRunner.runChild(LuceneTestCaseRunner.java:57)


REGRESSION:  org.apache.lucene.search.spans.TestSpanExplanations.testSF2

Error Message:
unable to create new native thread

Stack Trace:
java.lang.OutOfMemoryError: unable to create new native thread
	at java.lang.Thread.start0(Native Method)
	at java.lang.Thread.start(Thread.java:657)
	at java.util.concurrent.ThreadPoolExecutor.addWorker(ThreadPoolExecutor.java:943)
	at java.util.concurrent.ThreadPoolExecutor.prestartAllCoreThreads(ThreadPoolExecutor.java:1549)
	at org.apache.lucene.util.LuceneTestCase.newSearcher(LuceneTestCase.java:1436)
	at org.apache.lucene.search.QueryUtils.checkSkipTo(QueryUtils.java:351)
	at org.apache.lucene.search.QueryUtils.check(QueryUtils.java:115)
	at org.apache.lucene.search.QueryUtils.check(QueryUtils.java:108)
	at org.apache.lucene.search.CheckHits.checkHitCollector(CheckHits.java:98)
	at org.apache.lucene.search.TestExplanations.qtest(TestExplanations.java:98)
	at org.apache.lucene.search.spans.TestSpanExplanations.testSF2(TestSpanExplanations.java:58)
	at org.apache.lucene.util.LuceneTestCase$SubclassSetupTeardownRule$1.evaluate(LuceneTestCase.java:713)
	at org.apache.lucene.util.LuceneTestCase$InternalSetupTeardownRule$1.evaluate(LuceneTestCase.java:609)
	at org.apache.lucene.util.LuceneTestCase$TestResultInterceptorRule$1.evaluate(LuceneTestCase.java:509)
	at org.apache.lucene.util.LuceneTestCase$RememberThreadRule$1.evaluate(LuceneTestCase.java:571)
	at org.apache.lucene.util.LuceneTestCaseRunner.runChild(LuceneTestCaseRunner.java:165)
	at org.apache.lucene.util.LuceneTestCaseRunner.runChild(LuceneTestCaseRunner.java:57)


REGRESSION:  org.apache.lucene.search.spans.TestSpanExplanations.testSNear3

Error Message:
unable to create new native thread

Stack Trace:
java.lang.OutOfMemoryError: unable to create new native thread
	at java.lang.Thread.start0(Native Method)
	at java.lang.Thread.start(Thread.java:657)
	at java.util.concurrent.ThreadPoolExecutor.addWorker(ThreadPoolExecutor.java:943)
	at java.util.concurrent.ThreadPoolExecutor.prestartAllCoreThreads(ThreadPoolExecutor.java:1549)
	at org.apache.lucene.util.LuceneTestCase.newSearcher(LuceneTestCase.java:1436)
	at org.apache.lucene.util.LuceneTestCase.newSearcher(LuceneTestCase.java:1410)
	at org.apache.lucene.search.QueryUtils$2.setNextReader(QueryUtils.java:325)
	at org.apache.lucene.search.IndexSearcher.search(IndexSearcher.java:505)
	at org.apache.lucene.search.IndexSearcher.search(IndexSearcher.java:297)
	at org.apache.lucene.search.QueryUtils.checkSkipTo(QueryUtils.java:264)
	at org.apache.lucene.search.QueryUtils.check(QueryUtils.java:115)
	at org.apache.lucene.search.QueryUtils.check(QueryUtils.java:118)
	at org.apache.lucene.search.QueryUtils.check(QueryUtils.java:108)
	at org.apache.lucene.search.CheckHits.checkHitCollector(CheckHits.java:98)
	at org.apache.lucene.search.TestExplanations.qtest(TestExplanations.java:98)
	at org.apache.lucene.search.spans.TestSpanExplanations.testSNear3(TestSpanExplanations.java:107)
	at org.apache.lucene.util.LuceneTestCase$SubclassSetupTeardownRule$1.evaluate(LuceneTestCase.java:713)
	at org.apache.lucene.util.LuceneTestCase$InternalSetupTeardownRule$1.evaluate(LuceneTestCase.java:609)
	at org.apache.lucene.util.LuceneTestCase$TestResultInterceptorRule$1.evaluate(LuceneTestCase.java:509)
	at org.apache.lucene.util.LuceneTestCase$RememberThreadRule$1.evaluate(LuceneTestCase.java:571)
	at org.apache.lucene.util.LuceneTestCaseRunner.runChild(LuceneTestCaseRunner.java:165)
	at org.apache.lucene.util.LuceneTestCaseRunner.runChild(LuceneTestCaseRunner.java:57)


REGRESSION:  org.apache.lucene.search.spans.TestSpanExplanations.testSO2

Error Message:
unable to create new native thread

Stack Trace:
java.lang.OutOfMemoryError: unable to create new native thread
	at java.lang.Thread.start0(Native Method)
	at java.lang.Thread.start(Thread.java:657)
	at java.util.concurrent.ThreadPoolExecutor.addWorker(ThreadPoolExecutor.java:943)
	at java.util.concurrent.ThreadPoolExecutor.prestartAllCoreThreads(ThreadPoolExecutor.java:1549)
	at org.apache.lucene.util.LuceneTestCase.newSearcher(LuceneTestCase.java:1436)
	at org.apache.lucene.search.QueryUtils.checkSkipTo(QueryUtils.java:351)
	at org.apache.lucene.search.QueryUtils.check(QueryUtils.java:115)
	at org.apache.lucene.search.QueryUtils.check(QueryUtils.java:108)
	at org.apache.lucene.search.CheckHits.checkHitCollector(CheckHits.java:98)
	at org.apache.lucene.search.TestExplanations.qtest(TestExplanations.java:98)
	at org.apache.lucene.search.spans.TestSpanExplanations.testSO2(TestSpanExplanations.java:82)
	at org.apache.lucene.util.LuceneTestCase$SubclassSetupTeardownRule$1.evaluate(LuceneTestCase.java:713)
	at org.apache.lucene.util.LuceneTestCase$InternalSetupTeardownRule$1.evaluate(LuceneTestCase.java:609)
	at org.apache.lucene.util.LuceneTestCase$TestResultInterceptorRule$1.evaluate(LuceneTestCase.java:509)
	at org.apache.lucene.util.LuceneTestCase$RememberThreadRule$1.evaluate(LuceneTestCase.java:571)
	at org.apache.lucene.util.LuceneTestCaseRunner.runChild(LuceneTestCaseRunner.java:165)
	at org.apache.lucene.util.LuceneTestCaseRunner.runChild(LuceneTestCaseRunner.java:57)


REGRESSION:  org.apache.lucene.search.spans.TestSpanExplanations.testSNot2

Error Message:
unable to create new native thread

Stack Trace:
java.lang.OutOfMemoryError: unable to create new native thread
	at java.lang.Thread.start0(Native Method)
	at java.lang.Thread.start(Thread.java:657)
	at java.util.concurrent.ThreadPoolExecutor.addWorker(ThreadPoolExecutor.java:943)
	at java.util.concurrent.ThreadPoolExecutor.prestartAllCoreThreads(ThreadPoolExecutor.java:1549)
	at org.apache.lucene.util.LuceneTestCase.newSearcher(LuceneTestCase.java:1436)
	at org.apache.lucene.search.QueryUtils.checkSkipTo(QueryUtils.java:351)
	at org.apache.lucene.search.QueryUtils.check(QueryUtils.java:115)
	at org.apache.lucene.search.QueryUtils.check(QueryUtils.java:108)
	at org.apache.lucene.search.CheckHits.checkHitCollector(CheckHits.java:98)
	at org.apache.lucene.search.TestExplanations.qtest(TestExplanations.java:98)
	at org.apache.lucene.search.spans.TestSpanExplanations.testSNot2(TestSpanExplanations.java:153)
	at org.apache.lucene.util.LuceneTestCase$SubclassSetupTeardownRule$1.evaluate(LuceneTestCase.java:713)
	at org.apache.lucene.util.LuceneTestCase$InternalSetupTeardownRule$1.evaluate(LuceneTestCase.java:609)
	at org.apache.lucene.util.LuceneTestCase$TestResultInterceptorRule$1.evaluate(LuceneTestCase.java:509)
	at org.apache.lucene.util.LuceneTestCase$RememberThreadRule$1.evaluate(LuceneTestCase.java:571)
	at org.apache.lucene.util.LuceneTestCaseRunner.runChild(LuceneTestCaseRunner.java:165)
	at org.apache.lucene.util.LuceneTestCaseRunner.runChild(LuceneTestCaseRunner.java:57)


REGRESSION:  org.apache.lucene.search.spans.TestSpanExplanations.testSNear6

Error Message:
unable to create new native thread

Stack Trace:
java.lang.OutOfMemoryError: unable to create new native thread
	at java.lang.Thread.start0(Native Method)
	at java.lang.Thread.start(Thread.java:657)
	at java.util.concurrent.ThreadPoolExecutor.addWorker(ThreadPoolExecutor.java:943)
	at java.util.concurrent.ThreadPoolExecutor.prestartAllCoreThreads(ThreadPoolExecutor.java:1549)
	at org.apache.lucene.util.LuceneTestCase.newSearcher(LuceneTestCase.java:1436)
	at org.apache.lucene.search.QueryUtils.checkSkipTo(QueryUtils.java:351)
	at org.apache.lucene.search.QueryUtils.check(QueryUtils.java:115)
	at org.apache.lucene.search.QueryUtils.check(QueryUtils.java:108)
	at org.apache.lucene.search.CheckHits.checkHitCollector(CheckHits.java:98)
	at org.apache.lucene.search.TestExplanations.qtest(TestExplanations.java:98)
	at org.apache.lucene.search.spans.TestSpanExplanations.testSNear6(TestSpanExplanations.java:120)
	at org.apache.lucene.util.LuceneTestCase$SubclassSetupTeardownRule$1.evaluate(LuceneTestCase.java:713)
	at org.apache.lucene.util.LuceneTestCase$InternalSetupTeardownRule$1.evaluate(LuceneTestCase.java:609)
	at org.apache.lucene.util.LuceneTestCase$TestResultInterceptorRule$1.evaluate(LuceneTestCase.java:509)
	at org.apache.lucene.util.LuceneTestCase$RememberThreadRule$1.evaluate(LuceneTestCase.java:571)
	at org.apache.lucene.util.LuceneTestCaseRunner.runChild(LuceneTestCaseRunner.java:165)
	at org.apache.lucene.util.LuceneTestCaseRunner.runChild(LuceneTestCaseRunner.java:57)


REGRESSION:  org.apache.lucene.search.spans.TestSpanExplanations.testSNear7

Error Message:
unable to create new native thread

Stack Trace:
java.lang.OutOfMemoryError: unable to create new native thread
	at java.lang.Thread.start0(Native Method)
	at java.lang.Thread.start(Thread.java:657)
	at java.util.concurrent.ThreadPoolExecutor.addWorker(ThreadPoolExecutor.java:943)
	at java.util.concurrent.ThreadPoolExecutor.prestartAllCoreThreads(ThreadPoolExecutor.java:1549)
	at org.apache.lucene.util.LuceneTestCase.newSearcher(LuceneTestCase.java:1436)
	at org.apache.lucene.util.LuceneTestCase.newSearcher(LuceneTestCase.java:1410)
	at org.apache.lucene.search.QueryUtils.wrapUnderlyingReader(QueryUtils.java:187)
	at org.apache.lucene.search.QueryUtils.check(QueryUtils.java:117)
	at org.apache.lucene.search.QueryUtils.check(QueryUtils.java:108)
	at org.apache.lucene.search.CheckHits.checkHitCollector(CheckHits.java:98)
	at org.apache.lucene.search.TestExplanations.qtest(TestExplanations.java:98)
	at org.apache.lucene.search.spans.TestSpanExplanations.testSNear7(TestSpanExplanations.java:124)
	at org.apache.lucene.util.LuceneTestCase$SubclassSetupTeardownRule$1.evaluate(LuceneTestCase.java:713)
	at org.apache.lucene.util.LuceneTestCase$InternalSetupTeardownRule$1.evaluate(LuceneTestCase.java:609)
	at org.apache.lucene.util.LuceneTestCase$TestResultInterceptorRule$1.evaluate(LuceneTestCase.java:509)
	at org.apache.lucene.util.LuceneTestCase$RememberThreadRule$1.evaluate(LuceneTestCase.java:571)
	at org.apache.lucene.util.LuceneTestCaseRunner.runChild(LuceneTestCaseRunner.java:165)
	at org.apache.lucene.util.LuceneTestCaseRunner.runChild(LuceneTestCaseRunner.java:57)


REGRESSION:  org.apache.lucene.search.spans.TestSpansAdvanced2.testMultipleDifferentSpanQueries

Error Message:
unable to create new native thread

Stack Trace:
java.lang.OutOfMemoryError: unable to create new native thread
	at java.lang.Thread.start0(Native Method)
	at java.lang.Thread.start(Thread.java:657)
	at java.util.concurrent.ThreadPoolExecutor.addWorker(ThreadPoolExecutor.java:943)
	at java.util.concurrent.ThreadPoolExecutor.prestartAllCoreThreads(ThreadPoolExecutor.java:1549)
	at org.apache.lucene.util.LuceneTestCase.newSearcher(LuceneTestCase.java:1436)
	at org.apache.lucene.util.LuceneTestCase.newSearcher(LuceneTestCase.java:1410)
	at org.apache.lucene.search.QueryUtils$2.setNextReader(QueryUtils.java:325)
	at org.apache.lucene.search.IndexSearcher.search(IndexSearcher.java:505)
	at org.apache.lucene.search.IndexSearcher.search(IndexSearcher.java:297)
	at org.apache.lucene.search.QueryUtils.checkSkipTo(QueryUtils.java:264)
	at org.apache.lucene.search.QueryUtils.check(QueryUtils.java:115)
	at org.apache.lucene.search.QueryUtils.check(QueryUtils.java:118)
	at org.apache.lucene.search.QueryUtils.check(QueryUtils.java:108)
	at org.apache.lucene.search.spans.TestSpansAdvanced.assertHits(TestSpansAdvanced.java:141)
	at org.apache.lucene.search.spans.TestSpansAdvanced2.testMultipleDifferentSpanQueries(TestSpansAdvanced2.java:115)
	at org.apache.lucene.util.LuceneTestCase$SubclassSetupTeardownRule$1.evaluate(LuceneTestCase.java:713)
	at org.apache.lucene.util.LuceneTestCase$InternalSetupTeardownRule$1.evaluate(LuceneTestCase.java:609)
	at org.apache.lucene.util.LuceneTestCase$TestResultInterceptorRule$1.evaluate(LuceneTestCase.java:509)
	at org.apache.lucene.util.LuceneTestCase$RememberThreadRule$1.evaluate(LuceneTestCase.java:571)
	at org.apache.lucene.util.LuceneTestCaseRunner.runChild(LuceneTestCaseRunner.java:165)
	at org.apache.lucene.util.LuceneTestCaseRunner.runChild(LuceneTestCaseRunner.java:57)


REGRESSION:  org.apache.lucene.util.TestSetOnce.testSetMultiThreaded

Error Message:
unable to create new native thread

Stack Trace:
java.lang.OutOfMemoryError: unable to create new native thread
	at java.lang.Thread.start0(Native Method)
	at java.lang.Thread.start(Thread.java:657)
	at org.apache.lucene.util.TestSetOnce.testSetMultiThreaded(TestSetOnce.java:84)
	at org.apache.lucene.util.LuceneTestCase$SubclassSetupTeardownRule$1.evaluate(LuceneTestCase.java:713)
	at org.apache.lucene.util.LuceneTestCase$InternalSetupTeardownRule$1.evaluate(LuceneTestCase.java:609)
	at org.apache.lucene.util.LuceneTestCase$TestResultInterceptorRule$1.evaluate(LuceneTestCase.java:509)
	at org.apache.lucene.util.LuceneTestCase$RememberThreadRule$1.evaluate(LuceneTestCase.java:571)
	at org.apache.lucene.util.LuceneTestCaseRunner.runChild(LuceneTestCaseRunner.java:165)
	at org.apache.lucene.util.LuceneTestCaseRunner.runChild(LuceneTestCaseRunner.java:57)


FAILED:  org.apache.lucene.search.spans.TestSpanExplanations.testSO4

Error Message:
unable to create new native thread

Stack Trace:
java.lang.OutOfMemoryError: unable to create new native thread
	at java.lang.Thread.start0(Native Method)
	at java.lang.Thread.start(Thread.java:657)
	at java.util.concurrent.ThreadPoolExecutor.addWorker(ThreadPoolExecutor.java:943)
	at java.util.concurrent.ThreadPoolExecutor.prestartAllCoreThreads(ThreadPoolExecutor.java:1549)
	at org.apache.lucene.util.LuceneTestCase.newSearcher(LuceneTestCase.java:1436)
	at org.apache.lucene.util.LuceneTestCase.newSearcher(LuceneTestCase.java:1410)
	at org.apache.lucene.search.QueryUtils$3.setNextReader(QueryUtils.java:410)
	at org.apache.lucene.search.IndexSearcher.search(IndexSearcher.java:505)
	at org.apache.lucene.search.IndexSearcher.search(IndexSearcher.java:297)
	at org.apache.lucene.search.QueryUtils.checkFirstSkipTo(QueryUtils.java:370)
	at org.apache.lucene.search.QueryUtils.check(QueryUtils.java:114)
	at org.apache.lucene.search.QueryUtils.check(QueryUtils.java:117)
	at org.apache.lucene.search.QueryUtils.check(QueryUtils.java:108)
	at org.apache.lucene.search.CheckHits.checkHitCollector(CheckHits.java:98)
	at org.apache.lucene.search.TestExplanations.qtest(TestExplanations.java:98)
	at org.apache.lucene.search.spans.TestSpanExplanations.testSO4(TestSpanExplanations.java:90)
	at org.apache.lucene.util.LuceneTestCase$SubclassSetupTeardownRule$1.evaluate(LuceneTestCase.java:713)
	at org.apache.lucene.util.LuceneTestCase$InternalSetupTeardownRule$1.evaluate(LuceneTestCase.java:609)
	at org.apache.lucene.util.LuceneTestCase$TestResultInterceptorRule$1.evaluate(LuceneTestCase.java:509)
	at org.apache.lucene.util.LuceneTestCase$RememberThreadRule$1.evaluate(LuceneTestCase.java:571)
	at org.apache.lucene.util.LuceneTestCaseRunner.runChild(LuceneTestCaseRunner.java:165)
	at org.apache.lucene.util.LuceneTestCaseRunner.runChild(LuceneTestCaseRunner.java:57)


FAILED:  org.apache.lucene.search.spans.TestSpanExplanations.testST1

Error Message:
unable to create new native thread

Stack Trace:
java.lang.OutOfMemoryError: unable to create new native thread
	at java.lang.Thread.start0(Native Method)
	at java.lang.Thread.start(Thread.java:657)
	at java.util.concurrent.ThreadPoolExecutor.addWorker(ThreadPoolExecutor.java:943)
	at java.util.concurrent.ThreadPoolExecutor.prestartAllCoreThreads(ThreadPoolExecutor.java:1549)
	at org.apache.lucene.util.LuceneTestCase.newSearcher(LuceneTestCase.java:1436)
	at org.apache.lucene.util.LuceneTestCase.newSearcher(LuceneTestCase.java:1410)
	at org.apache.lucene.search.QueryUtils$3.setNextReader(QueryUtils.java:410)
	at org.apache.lucene.search.IndexSearcher.search(IndexSearcher.java:505)
	at org.apache.lucene.search.IndexSearcher.search(IndexSearcher.java:297)
	at org.apache.lucene.search.QueryUtils.checkFirstSkipTo(QueryUtils.java:370)
	at org.apache.lucene.search.QueryUtils.check(QueryUtils.java:114)
	at org.apache.lucene.search.QueryUtils.check(QueryUtils.java:117)
	at org.apache.lucene.search.QueryUtils.check(QueryUtils.java:108)
	at org.apache.lucene.search.CheckHits.checkHitCollector(CheckHits.java:98)
	at org.apache.lucene.search.TestExplanations.qtest(TestExplanations.java:98)
	at org.apache.lucene.search.spans.TestSpanExplanations.testST1(TestSpanExplanations.java:32)
	at org.apache.lucene.util.LuceneTestCase$SubclassSetupTeardownRule$1.evaluate(LuceneTestCase.java:713)
	at org.apache.lucene.util.LuceneTestCase$InternalSetupTeardownRule$1.evaluate(LuceneTestCase.java:609)
	at org.apache.lucene.util.LuceneTestCase$TestResultInterceptorRule$1.evaluate(LuceneTestCase.java:509)
	at org.apache.lucene.util.LuceneTestCase$RememberThreadRule$1.evaluate(LuceneTestCase.java:571)
	at org.apache.lucene.util.LuceneTestCaseRunner.runChild(LuceneTestCaseRunner.java:165)
	at org.apache.lucene.util.LuceneTestCaseRunner.runChild(LuceneTestCaseRunner.java:57)


FAILED:  org.apache.lucene.search.spans.TestSpanExplanations.testSNot7

Error Message:
unable to create new native thread

Stack Trace:
java.lang.OutOfMemoryError: unable to create new native thread
	at java.lang.Thread.start0(Native Method)
	at java.lang.Thread.start(Thread.java:657)
	at java.util.concurrent.ThreadPoolExecutor.addWorker(ThreadPoolExecutor.java:943)
	at java.util.concurrent.ThreadPoolExecutor.prestartAllCoreThreads(ThreadPoolExecutor.java:1549)
	at org.apache.lucene.util.LuceneTestCase.newSearcher(LuceneTestCase.java:1436)
	at org.apache.lucene.search.QueryUtils.checkSkipTo(QueryUtils.java:351)
	at org.apache.lucene.search.QueryUtils.check(QueryUtils.java:115)
	at org.apache.lucene.search.QueryUtils.check(QueryUtils.java:117)
	at org.apache.lucene.search.QueryUtils.check(QueryUtils.java:108)
	at org.apache.lucene.search.CheckHits.checkHitCollector(CheckHits.java:98)
	at org.apache.lucene.search.TestExplanations.qtest(TestExplanations.java:98)
	at org.apache.lucene.search.spans.TestSpanExplanations.testSNot7(TestSpanExplanations.java:168)
	at org.apache.lucene.util.LuceneTestCase$SubclassSetupTeardownRule$1.evaluate(LuceneTestCase.java:713)
	at org.apache.lucene.util.LuceneTestCase$InternalSetupTeardownRule$1.evaluate(LuceneTestCase.java:609)
	at org.apache.lucene.util.LuceneTestCase$TestResultInterceptorRule$1.evaluate(LuceneTestCase.java:509)
	at org.apache.lucene.util.LuceneTestCase$RememberThreadRule$1.evaluate(LuceneTestCase.java:571)
	at org.apache.lucene.util.LuceneTestCaseRunner.runChild(LuceneTestCaseRunner.java:165)
	at org.apache.lucene.util.LuceneTestCaseRunner.runChild(LuceneTestCaseRunner.java:57)


FAILED:  org.apache.lucene.search.spans.TestSpanExplanations.testSF4

Error Message:
unable to create new native thread

Stack Trace:
java.lang.OutOfMemoryError: unable to create new native thread
	at java.lang.Thread.start0(Native Method)
	at java.lang.Thread.start(Thread.java:657)
	at java.util.concurrent.ThreadPoolExecutor.addWorker(ThreadPoolExecutor.java:943)
	at java.util.concurrent.ThreadPoolExecutor.prestartAllCoreThreads(ThreadPoolExecutor.java:1549)
	at org.apache.lucene.util.LuceneTestCase.newSearcher(LuceneTestCase.java:1436)
	at org.apache.lucene.search.QueryUtils.checkSkipTo(QueryUtils.java:351)
	at org.apache.lucene.search.QueryUtils.check(QueryUtils.java:115)
	at org.apache.lucene.search.QueryUtils.check(QueryUtils.java:117)
	at org.apache.lucene.search.QueryUtils.check(QueryUtils.java:108)
	at org.apache.lucene.search.CheckHits.checkHitCollector(CheckHits.java:98)
	at org.apache.lucene.search.TestExplanations.qtest(TestExplanations.java:98)
	at org.apache.lucene.search.spans.TestSpanExplanations.testSF4(TestSpanExplanations.java:62)
	at org.apache.lucene.util.LuceneTestCase$SubclassSetupTeardownRule$1.evaluate(LuceneTestCase.java:713)
	at org.apache.lucene.util.LuceneTestCase$InternalSetupTeardownRule$1.evaluate(LuceneTestCase.java:609)
	at org.apache.lucene.util.LuceneTestCase$TestResultInterceptorRule$1.evaluate(LuceneTestCase.java:509)
	at org.apache.lucene.util.LuceneTestCase$RememberThreadRule$1.evaluate(LuceneTestCase.java:571)
	at org.apache.lucene.util.LuceneTestCaseRunner.runChild(LuceneTestCaseRunner.java:165)
	at org.apache.lucene.util.LuceneTestCaseRunner.runChild(LuceneTestCaseRunner.java:57)




Build Log (for compile errors):
[...truncated 8853 lines...]



Mime
View raw message