lucene-dev mailing list archives

Site index · List index
Message view « Date » · « Thread »
Top « Date » · « Thread »
From Apache Jenkins Server <jenk...@builds.apache.org>
Subject [JENKINS] Lucene-Solr-tests-only-trunk-java7 - Build # 1865 - Failure
Date Sat, 03 Mar 2012 14:38:12 GMT
Build: https://builds.apache.org/job/Lucene-Solr-tests-only-trunk-java7/1865/

1 tests failed.
REGRESSION:  org.apache.lucene.queries.function.TestOrdValues.testReverseOrdFieldRank

Error Message:
java.lang.AssertionError: org.apache.lucene.queries.function.TestOrdValues.testReverseOrdFieldRank:
Insane FieldCache usage(s) found expected:<0> but was:<1>

Stack Trace:
java.lang.RuntimeException: java.lang.AssertionError: org.apache.lucene.queries.function.TestOrdValues.testReverseOrdFieldRank:
Insane FieldCache usage(s) found expected:<0> but was:<1>
	at org.apache.lucene.util.LuceneTestCase.tearDownInternal(LuceneTestCase.java:786)
	at org.apache.lucene.util.LuceneTestCase.access$1100(LuceneTestCase.java:136)
	at org.apache.lucene.util.LuceneTestCase$InternalSetupTeardownRule$1.evaluate(LuceneTestCase.java:610)
	at org.apache.lucene.util.LuceneTestCase$TestResultInterceptorRule$1.evaluate(LuceneTestCase.java:509)
	at org.apache.lucene.util.LuceneTestCase$RememberThreadRule$1.evaluate(LuceneTestCase.java:571)
	at org.apache.lucene.util.LuceneTestCaseRunner.runChild(LuceneTestCaseRunner.java:165)
	at org.apache.lucene.util.LuceneTestCaseRunner.runChild(LuceneTestCaseRunner.java:57)
	at org.apache.lucene.util.LuceneTestCase.assertSaneFieldCaches(LuceneTestCase.java:913)
	at org.apache.lucene.util.LuceneTestCase.tearDownInternal(LuceneTestCase.java:776)




Build Log (for compile errors):
[...truncated 7148 lines...]



Mime
View raw message