lucene-dev mailing list archives

Site index · List index
Message view « Date » · « Thread »
Top « Date » · « Thread »
From Apache Jenkins Server <jenk...@builds.apache.org>
Subject [JENKINS] Lucene-Solr-tests-only-trunk-java7 - Build # 1897 - Failure
Date Tue, 06 Mar 2012 21:56:19 GMT
Build: https://builds.apache.org/job/Lucene-Solr-tests-only-trunk-java7/1897/

1 tests failed.
REGRESSION:  org.apache.solr.client.solrj.embedded.TestSolrProperties.testProperties

Error Message:
org.apache.solr.client.solrj.SolrServerException: org.apache.solr.common.SolrException: Error
handling 'status' action 

Stack Trace:
org.apache.solr.client.solrj.SolrServerException: org.apache.solr.client.solrj.SolrServerException:
org.apache.solr.common.SolrException: Error handling 'status' action 
	at org.apache.solr.client.solrj.embedded.EmbeddedSolrServer.request(EmbeddedSolrServer.java:223)
	at org.apache.solr.client.solrj.request.CoreAdminRequest.process(CoreAdminRequest.java:384)
	at org.apache.solr.client.solrj.request.CoreAdminRequest.getStatus(CoreAdminRequest.java:436)
	at org.apache.solr.client.solrj.embedded.TestSolrProperties.testProperties(TestSolrProperties.java:208)
	at org.apache.lucene.util.SystemPropertiesRestoreRule$1.evaluate(SystemPropertiesRestoreRule.java:20)
	at org.apache.lucene.util.LuceneTestCase$SubclassSetupTeardownRule$1.evaluate(LuceneTestCase.java:736)
	at org.apache.lucene.util.LuceneTestCase$InternalSetupTeardownRule$1.evaluate(LuceneTestCase.java:632)
	at org.apache.lucene.util.SystemPropertiesInvariantRule$1.evaluate(SystemPropertiesInvariantRule.java:22)
	at org.apache.lucene.util.LuceneTestCase$TestResultInterceptorRule$1.evaluate(LuceneTestCase.java:531)
	at org.apache.lucene.util.LuceneTestCase$RememberThreadRule$1.evaluate(LuceneTestCase.java:593)
	at org.apache.lucene.util.LuceneTestCaseRunner.runChild(LuceneTestCaseRunner.java:165)
	at org.apache.lucene.util.LuceneTestCaseRunner.runChild(LuceneTestCaseRunner.java:57)
	at org.apache.lucene.util.SystemPropertiesInvariantRule$1.evaluate(SystemPropertiesInvariantRule.java:22)
Caused by: org.apache.solr.client.solrj.SolrServerException: org.apache.solr.common.SolrException:
Error handling 'status' action 
	at org.apache.solr.client.solrj.embedded.EmbeddedSolrServer.request(EmbeddedSolrServer.java:158)
Caused by: org.apache.solr.common.SolrException: Error handling 'status' action 
	at org.apache.solr.handler.admin.CoreAdminHandler.handleStatusAction(CoreAdminHandler.java:551)
	at org.apache.solr.handler.admin.CoreAdminHandler.handleRequestBody(CoreAdminHandler.java:161)
	at org.apache.solr.handler.RequestHandlerBase.handleRequest(RequestHandlerBase.java:129)
	at org.apache.solr.core.SolrCore.execute(SolrCore.java:1540)
	at org.apache.solr.client.solrj.embedded.EmbeddedSolrServer.request(EmbeddedSolrServer.java:156)
Caused by: java.lang.IllegalArgumentException: /usr/home/hudson/hudson-slave/workspace/Lucene-Solr-tests-only-trunk-java7/checkout/solr/solrj/src/test-files/solrj/solr/shared/data/EN-3.5/index
does not exist
	at org.apache.commons.io.FileUtils.sizeOfDirectory(FileUtils.java:2074)
	at org.apache.solr.handler.admin.CoreAdminHandler.getIndexSize(CoreAdminHandler.java:837)
	at org.apache.solr.handler.admin.CoreAdminHandler.getCoreStatus(CoreAdminHandler.java:822)
	at org.apache.solr.handler.admin.CoreAdminHandler.handleStatusAction(CoreAdminHandler.java:545)




Build Log (for compile errors):
[...truncated 9921 lines...]



Mime
View raw message