lucene-dev mailing list archives

Site index · List index
Message view « Date » · « Thread »
Top « Date » · « Thread »
From Apache Jenkins Server <jenk...@builds.apache.org>
Subject [JENKINS] Solr-trunk - Build # 1786 - Failure
Date Thu, 08 Mar 2012 08:57:02 GMT
Build: https://builds.apache.org/job/Solr-trunk/1786/

1 tests failed.
REGRESSION:  org.apache.solr.TestDistributedSearch.testDistribSearch

Error Message:
java.lang.AssertionError: Some threads threw uncaught exceptions!

Stack Trace:
java.lang.RuntimeException: java.lang.AssertionError: Some threads threw uncaught exceptions!
	at org.apache.lucene.util.LuceneTestCase.tearDownInternal(LuceneTestCase.java:816)
	at org.apache.lucene.util.LuceneTestCase.access$1100(LuceneTestCase.java:137)
	at org.apache.lucene.util.LuceneTestCase$InternalSetupTeardownRule$1.evaluate(LuceneTestCase.java:640)
	at org.apache.lucene.util.SystemPropertiesInvariantRule$1.evaluate(SystemPropertiesInvariantRule.java:22)
	at org.apache.lucene.util.LuceneTestCase$TestResultInterceptorRule$1.evaluate(LuceneTestCase.java:538)
	at org.apache.lucene.util.LuceneTestCase$RememberThreadRule$1.evaluate(LuceneTestCase.java:600)
	at org.apache.lucene.util.LuceneTestCaseRunner.runChild(LuceneTestCaseRunner.java:164)
	at org.apache.lucene.util.LuceneTestCaseRunner.runChild(LuceneTestCaseRunner.java:57)
	at org.apache.lucene.util.SystemPropertiesRestoreRule$1.evaluate(SystemPropertiesRestoreRule.java:20)
	at org.apache.lucene.util.StoreClassNameRule$1.evaluate(StoreClassNameRule.java:21)
	at org.apache.lucene.util.SystemPropertiesInvariantRule$1.evaluate(SystemPropertiesInvariantRule.java:22)
	at org.apache.lucene.util.LuceneTestCase.checkUncaughtExceptionsAfter(LuceneTestCase.java:844)
	at org.apache.lucene.util.LuceneTestCase.tearDownInternal(LuceneTestCase.java:788)




Build Log (for compile errors):
[...truncated 9335 lines...]



Mime
View raw message