lucene-dev mailing list archives

Site index · List index
Message view « Date » · « Thread »
Top « Date » · « Thread »
From Apache Jenkins Server <jenk...@builds.apache.org>
Subject [JENKINS] Lucene-Solr-tests-only-trunk - Build # 12716 - Failure
Date Mon, 12 Mar 2012 15:19:14 GMT
Build: https://builds.apache.org/job/Lucene-Solr-tests-only-trunk/12716/

1 tests failed.
FAILED:  junit.framework.TestSuite.org.apache.solr.TestPluginEnable

Error Message:
Uncaught exception by thread: Thread[TimeLimitedCollector timer thread,5,]

Stack Trace:
org.apache.lucene.util.UncaughtExceptionsRule$UncaughtExceptionsInBackgroundThread: Uncaught
exception by thread: Thread[TimeLimitedCollector timer thread,5,]
	at org.apache.lucene.util.UncaughtExceptionsRule$1.evaluate(UncaughtExceptionsRule.java:60)
	at org.apache.lucene.util.StoreClassNameRule$1.evaluate(StoreClassNameRule.java:21)
	at org.apache.lucene.util.SystemPropertiesInvariantRule$1.evaluate(SystemPropertiesInvariantRule.java:22)
Caused by: org.apache.lucene.util.ThreadInterruptedException: java.lang.InterruptedException:
sleep interrupted
	at org.apache.lucene.search.TimeLimitingCollector$TimerThread.run(TimeLimitingCollector.java:268)
Caused by: java.lang.InterruptedException: sleep interrupted
	at java.lang.Thread.sleep(Native Method)
	at org.apache.lucene.search.TimeLimitingCollector$TimerThread.run(TimeLimitingCollector.java:266)




Build Log (for compile errors):
[...truncated 7647 lines...]



Mime
View raw message