lucene-dev mailing list archives

Site index · List index
Message view « Date » · « Thread »
Top « Date » · « Thread »
From Apache Jenkins Server <jenk...@builds.apache.org>
Subject [JENKINS] Lucene-Solr-tests-only-trunk-java7 - Build # 1878 - Failure
Date Mon, 05 Mar 2012 00:19:17 GMT
Build: https://builds.apache.org/job/Lucene-Solr-tests-only-trunk-java7/1878/

1 tests failed.
REGRESSION:  org.apache.lucene.queries.function.TestOrdValues.testOrdFieldRank

Error Message:
java.lang.AssertionError: org.apache.lucene.queries.function.TestOrdValues.testOrdFieldRank:
Insane FieldCache usage(s) found expected:<0> but was:<1>

Stack Trace:
java.lang.RuntimeException: java.lang.AssertionError: org.apache.lucene.queries.function.TestOrdValues.testOrdFieldRank:
Insane FieldCache usage(s) found expected:<0> but was:<1>
	at org.apache.lucene.util.LuceneTestCase.tearDownInternal(LuceneTestCase.java:809)
	at org.apache.lucene.util.LuceneTestCase.access$1100(LuceneTestCase.java:137)
	at org.apache.lucene.util.LuceneTestCase$InternalSetupTeardownRule$1.evaluate(LuceneTestCase.java:633)
	at org.apache.lucene.util.SystemPropertiesInvariantRule$1.evaluate(SystemPropertiesInvariantRule.java:22)
	at org.apache.lucene.util.LuceneTestCase$TestResultInterceptorRule$1.evaluate(LuceneTestCase.java:531)
	at org.apache.lucene.util.LuceneTestCase$RememberThreadRule$1.evaluate(LuceneTestCase.java:593)
	at org.apache.lucene.util.LuceneTestCaseRunner.runChild(LuceneTestCaseRunner.java:165)
	at org.apache.lucene.util.LuceneTestCaseRunner.runChild(LuceneTestCaseRunner.java:57)
	at org.apache.lucene.util.SystemPropertiesInvariantRule$1.evaluate(SystemPropertiesInvariantRule.java:22)
	at org.apache.lucene.util.LuceneTestCase.assertSaneFieldCaches(LuceneTestCase.java:936)
	at org.apache.lucene.util.LuceneTestCase.tearDownInternal(LuceneTestCase.java:799)




Build Log (for compile errors):
[...truncated 7171 lines...]



Mime
View raw message