lucene-dev mailing list archives

Site index · List index
Message view « Date » · « Thread »
Top « Date » · « Thread »
From "Dawid Weiss (Commented) (JIRA)" <j...@apache.org>
Subject [jira] [Commented] (LUCENE-3855) TestStressNRT failures (reproducible)
Date Wed, 07 Mar 2012 12:40:58 GMT

    [ https://issues.apache.org/jira/browse/LUCENE-3855?page=com.atlassian.jira.plugin.system.issuetabpanels:comment-tabpanel&focusedCommentId=13224239#comment-13224239
] 

Dawid Weiss commented on LUCENE-3855:
-------------------------------------

{noformat}
junit-sequential:
    [junit] Testsuite: org.apache.lucene.index.TestStressNRT
    [junit] Tests run: 1, Failures: 0, Errors: 1, Time elapsed: 10.377 sec
    [junit] 
    [junit] ------------- Standard Error -----------------
    [junit] The following exceptions were thrown by threads:
    [junit] *** Thread: Lucene Merge Thread #133 ***
    [junit] org.apache.lucene.index.MergePolicy$MergeException: java.lang.AssertionError
    [junit] 	at org.apache.lucene.index.ConcurrentMergeScheduler.handleMergeException(ConcurrentMergeScheduler.java:507)
    [junit] 	at org.apache.lucene.index.ConcurrentMergeScheduler$MergeThread.run(ConcurrentMergeScheduler.java:480)
    [junit] Caused by: java.lang.AssertionError
    [junit] 	at org.apache.lucene.index.IndexWriter.commitMergedDeletes(IndexWriter.java:3028)
    [junit] 	at org.apache.lucene.index.IndexWriter.commitMerge(IndexWriter.java:3137)
    [junit] 	at org.apache.lucene.index.IndexWriter.mergeMiddle(IndexWriter.java:3718)
    [junit] 	at org.apache.lucene.index.IndexWriter.merge(IndexWriter.java:3257)
    [junit] 	at org.apache.lucene.index.ConcurrentMergeScheduler.doMerge(ConcurrentMergeScheduler.java:382)
    [junit] 	at org.apache.lucene.index.ConcurrentMergeScheduler$MergeThread.run(ConcurrentMergeScheduler.java:451)
    [junit] NOTE: reproduce with: ant test -Dtestcase=TestStressNRT -Dtestmethod=test -Dtests.seed=69468941c1bbf693:19e66d58475da929:69e9d2f81769b6d0
-Dargs="-Dfile.encoding=UTF-8"
    [junit] NOTE: reproduce with: ant test -Dtestcase=TestStressNRT -Dtestmethod=test -Dtests.seed=69468941c1bbf693:19e66d58475da929:69e9d2f81769b6d0
-Dargs="-Dfile.encoding=UTF-8"
    [junit] NOTE: test params are: codec=Lucene3x, sim=RandomSimilarityProvider(queryNorm=true,coord=false):
{}, locale=ro, timezone=Etc/GMT+1
    [junit] NOTE: all tests run in this JVM:
    [junit] [TestStressNRT]
    [junit] NOTE: Linux 3.0.0-16-generic amd64/Sun Microsystems Inc. 1.6.0_27 (64-bit)/cpus=2,threads=1,free=86308600,total=202244096
    [junit] ------------- ---------------- ---------------
    [junit] Testcase: test(org.apache.lucene.index.TestStressNRT):	Caused an ERROR
    [junit] java.lang.AssertionError: Some threads threw uncaught exceptions!
    [junit] java.lang.RuntimeException: java.lang.AssertionError: Some threads threw uncaught
exceptions!
    [junit] 	at org.apache.lucene.util.LuceneTestCase.tearDownInternal(LuceneTestCase.java:816)
    [junit] 	at org.apache.lucene.util.LuceneTestCase.access$1100(LuceneTestCase.java:137)
    [junit] 	at org.apache.lucene.util.LuceneTestCase$InternalSetupTeardownRule$1.evaluate(LuceneTestCase.java:640)
    [junit] 	at org.apache.lucene.util.SystemPropertiesInvariantRule$1.evaluate(SystemPropertiesInvariantRule.java:22)
    [junit] 	at org.apache.lucene.util.LuceneTestCase$TestResultInterceptorRule$1.evaluate(LuceneTestCase.java:538)
    [junit] 	at org.apache.lucene.util.LuceneTestCase$RememberThreadRule$1.evaluate(LuceneTestCase.java:600)
    [junit] 	at org.apache.lucene.util.LuceneTestCaseRunner.runChild(LuceneTestCaseRunner.java:164)
    [junit] 	at org.apache.lucene.util.LuceneTestCaseRunner.runChild(LuceneTestCaseRunner.java:57)
    [junit] 	at org.apache.lucene.util.StoreClassNameRule$1.evaluate(StoreClassNameRule.java:21)
    [junit] 	at org.apache.lucene.util.SystemPropertiesInvariantRule$1.evaluate(SystemPropertiesInvariantRule.java:22)
    [junit] Caused by: java.lang.AssertionError: Some threads threw uncaught exceptions!
    [junit] 	at org.apache.lucene.util.LuceneTestCase.checkUncaughtExceptionsAfter(LuceneTestCase.java:844)
    [junit] 	at org.apache.lucene.util.LuceneTestCase.tearDownInternal(LuceneTestCase.java:788)
    [junit] 
    [junit] 

junit-sequential:
    [junit] Testsuite: org.apache.lucene.index.TestStressNRT
    [junit] Tests run: 1, Failures: 0, Errors: 1, Time elapsed: 11.454 sec
    [junit] 
    [junit] ------------- Standard Error -----------------
    [junit] NOTE: reproduce with: ant test -Dtestcase=TestStressNRT -Dtestmethod=test -Dtests.seed=69468941c1bbf693:19e66d58475da929:69e9d2f81769b6d0
-Dargs="-Dfile.encoding=UTF-8"
    [junit] NOTE: test params are: codec=Lucene3x, sim=RandomSimilarityProvider(queryNorm=true,coord=false):
{}, locale=ro, timezone=Etc/GMT+1
    [junit] NOTE: all tests run in this JVM:
    [junit] [TestStressNRT]
    [junit] NOTE: Linux 3.0.0-16-generic amd64/Sun Microsystems Inc. 1.6.0_27 (64-bit)/cpus=2,threads=1,free=77427992,total=143851520
    [junit] ------------- ---------------- ---------------
    [junit] Testcase: test(org.apache.lucene.index.TestStressNRT):	Caused an ERROR
    [junit] MockDirectoryWrapper: cannot close: there are still open files: {_eb.cfs=5}
    [junit] java.lang.RuntimeException: MockDirectoryWrapper: cannot close: there are still
open files: {_eb.cfs=5}
    [junit] 	at org.apache.lucene.store.MockDirectoryWrapper.close(MockDirectoryWrapper.java:555)
    [junit] 	at org.apache.lucene.index.TestStressNRT.test(TestStressNRT.java:385)
    [junit] 	at org.apache.lucene.util.LuceneTestCase$SubclassSetupTeardownRule$1.evaluate(LuceneTestCase.java:743)
    [junit] 	at org.apache.lucene.util.LuceneTestCase$InternalSetupTeardownRule$1.evaluate(LuceneTestCase.java:639)
    [junit] 	at org.apache.lucene.util.SystemPropertiesInvariantRule$1.evaluate(SystemPropertiesInvariantRule.java:22)
    [junit] 	at org.apache.lucene.util.LuceneTestCase$TestResultInterceptorRule$1.evaluate(LuceneTestCase.java:538)
    [junit] 	at org.apache.lucene.util.LuceneTestCase$RememberThreadRule$1.evaluate(LuceneTestCase.java:600)
    [junit] 	at org.apache.lucene.util.LuceneTestCaseRunner.runChild(LuceneTestCaseRunner.java:164)
    [junit] 	at org.apache.lucene.util.LuceneTestCaseRunner.runChild(LuceneTestCaseRunner.java:57)
    [junit] 	at org.apache.lucene.util.StoreClassNameRule$1.evaluate(StoreClassNameRule.java:21)
    [junit] 	at org.apache.lucene.util.SystemPropertiesInvariantRule$1.evaluate(SystemPropertiesInvariantRule.java:22)
    [junit] Caused by: java.lang.RuntimeException: unclosed IndexInput: _eb.cfs
    [junit] 	at org.apache.lucene.store.MockDirectoryWrapper.addFileHandle(MockDirectoryWrapper.java:479)
    [junit] 	at org.apache.lucene.store.MockDirectoryWrapper$1.openSlice(MockDirectoryWrapper.java:777)
    [junit] 	at org.apache.lucene.store.CompoundFileDirectory.openInput(CompoundFileDirectory.java:221)
    [junit] 	at org.apache.lucene.codecs.lucene3x.TermInfosReader.<init>(TermInfosReader.java:112)
    [junit] 	at org.apache.lucene.codecs.lucene3x.Lucene3xFields.<init>(Lucene3xFields.java:84)
    [junit] 	at org.apache.lucene.codecs.lucene3x.PreFlexRWPostingsFormat$1.<init>(PreFlexRWPostingsFormat.java:51)
    [junit] 	at org.apache.lucene.codecs.lucene3x.PreFlexRWPostingsFormat.fieldsProducer(PreFlexRWPostingsFormat.java:51)
    [junit] 	at org.apache.lucene.index.SegmentCoreReaders.<init>(SegmentCoreReaders.java:108)
    [junit] 	at org.apache.lucene.index.SegmentReader.<init>(SegmentReader.java:51)
    [junit] 	at org.apache.lucene.index.IndexWriter$ReadersAndLiveDocs.getMergeReader(IndexWriter.java:521)
    [junit] 	at org.apache.lucene.index.IndexWriter.mergeMiddle(IndexWriter.java:3587)
    [junit] 	at org.apache.lucene.index.IndexWriter.merge(IndexWriter.java:3257)
    [junit] 	at org.apache.lucene.index.ConcurrentMergeScheduler.doMerge(ConcurrentMergeScheduler.java:382)
    [junit] 	at org.apache.lucene.index.ConcurrentMergeScheduler$MergeThread.run(ConcurrentMergeScheduler.java:451)
    [junit] 
    [junit] 

junit-sequential:
    [junit] Testsuite: org.apache.lucene.index.TestStressNRT
    [junit] Tests run: 1, Failures: 0, Errors: 1, Time elapsed: 10.892 sec
    [junit] 
    [junit] ------------- Standard Error -----------------
    [junit] NOTE: reproduce with: ant test -Dtestcase=TestStressNRT -Dtestmethod=test -Dtests.seed=69468941c1bbf693:19e66d58475da929:69e9d2f81769b6d0
-Dargs="-Dfile.encoding=UTF-8"
    [junit] NOTE: test params are: codec=Lucene3x, sim=RandomSimilarityProvider(queryNorm=true,coord=false):
{}, locale=ro, timezone=Etc/GMT+1
    [junit] NOTE: all tests run in this JVM:
    [junit] [TestStressNRT]
    [junit] NOTE: Linux 3.0.0-16-generic amd64/Sun Microsystems Inc. 1.6.0_27 (64-bit)/cpus=2,threads=1,free=70056648,total=148111360
    [junit] ------------- ---------------- ---------------
    [junit] Testcase: test(org.apache.lucene.index.TestStressNRT):	Caused an ERROR
    [junit] MockDirectoryWrapper: cannot close: there are still open files: {_30.frq=1, _l8.cfs=5,
_30.tis=1, _30.tvx=1, _30.fdx=1, _30.fdt=1, _30.tvf=1, _30.tvd=1}
    [junit] java.lang.RuntimeException: MockDirectoryWrapper: cannot close: there are still
open files: {_30.frq=1, _l8.cfs=5, _30.tis=1, _30.tvx=1, _30.fdx=1, _30.fdt=1, _30.tvf=1,
_30.tvd=1}
    [junit] 	at org.apache.lucene.store.MockDirectoryWrapper.close(MockDirectoryWrapper.java:555)
    [junit] 	at org.apache.lucene.index.TestStressNRT.test(TestStressNRT.java:385)
    [junit] 	at org.apache.lucene.util.LuceneTestCase$SubclassSetupTeardownRule$1.evaluate(LuceneTestCase.java:743)
    [junit] 	at org.apache.lucene.util.LuceneTestCase$InternalSetupTeardownRule$1.evaluate(LuceneTestCase.java:639)
    [junit] 	at org.apache.lucene.util.SystemPropertiesInvariantRule$1.evaluate(SystemPropertiesInvariantRule.java:22)
    [junit] 	at org.apache.lucene.util.LuceneTestCase$TestResultInterceptorRule$1.evaluate(LuceneTestCase.java:538)
    [junit] 	at org.apache.lucene.util.LuceneTestCase$RememberThreadRule$1.evaluate(LuceneTestCase.java:600)
    [junit] 	at org.apache.lucene.util.LuceneTestCaseRunner.runChild(LuceneTestCaseRunner.java:164)
    [junit] 	at org.apache.lucene.util.LuceneTestCaseRunner.runChild(LuceneTestCaseRunner.java:57)
    [junit] 	at org.apache.lucene.util.StoreClassNameRule$1.evaluate(StoreClassNameRule.java:21)
    [junit] 	at org.apache.lucene.util.SystemPropertiesInvariantRule$1.evaluate(SystemPropertiesInvariantRule.java:22)
    [junit] Caused by: java.lang.RuntimeException: unclosed IndexInput: _30.tis
    [junit] 	at org.apache.lucene.store.MockDirectoryWrapper.addFileHandle(MockDirectoryWrapper.java:479)
    [junit] 	at org.apache.lucene.store.MockDirectoryWrapper.openInput(MockDirectoryWrapper.java:504)
    [junit] 	at org.apache.lucene.codecs.lucene3x.TermInfosReader.<init>(TermInfosReader.java:112)
    [junit] 	at org.apache.lucene.codecs.lucene3x.Lucene3xFields.<init>(Lucene3xFields.java:84)
    [junit] 	at org.apache.lucene.codecs.lucene3x.PreFlexRWPostingsFormat$1.<init>(PreFlexRWPostingsFormat.java:51)
    [junit] 	at org.apache.lucene.codecs.lucene3x.PreFlexRWPostingsFormat.fieldsProducer(PreFlexRWPostingsFormat.java:51)
    [junit] 	at org.apache.lucene.index.SegmentCoreReaders.<init>(SegmentCoreReaders.java:108)
    [junit] 	at org.apache.lucene.index.SegmentReader.<init>(SegmentReader.java:51)
    [junit] 	at org.apache.lucene.index.IndexWriter$ReadersAndLiveDocs.getMergeReader(IndexWriter.java:521)
    [junit] 	at org.apache.lucene.index.IndexWriter.mergeMiddle(IndexWriter.java:3587)
    [junit] 	at org.apache.lucene.index.IndexWriter.merge(IndexWriter.java:3257)
    [junit] 	at org.apache.lucene.index.ConcurrentMergeScheduler.doMerge(ConcurrentMergeScheduler.java:382)
    [junit] 	at org.apache.lucene.index.ConcurrentMergeScheduler$MergeThread.run(ConcurrentMergeScheduler.java:451)
    [junit] 
    [junit] 

junit-sequential:
    [junit] Testsuite: org.apache.lucene.index.TestStressNRT
    [junit] Tests run: 1, Failures: 0, Errors: 1, Time elapsed: 11.678 sec
    [junit] 
    [junit] ------------- Standard Error -----------------
    [junit] The following exceptions were thrown by threads:
    [junit] *** Thread: Lucene Merge Thread #78 ***
    [junit] org.apache.lucene.index.MergePolicy$MergeException: java.lang.AssertionError
    [junit] 	at org.apache.lucene.index.ConcurrentMergeScheduler.handleMergeException(ConcurrentMergeScheduler.java:507)
    [junit] 	at org.apache.lucene.index.ConcurrentMergeScheduler$MergeThread.run(ConcurrentMergeScheduler.java:480)
    [junit] Caused by: java.lang.AssertionError
    [junit] 	at org.apache.lucene.index.IndexWriter.commitMergedDeletes(IndexWriter.java:3028)
    [junit] 	at org.apache.lucene.index.IndexWriter.commitMerge(IndexWriter.java:3137)
    [junit] 	at org.apache.lucene.index.IndexWriter.mergeMiddle(IndexWriter.java:3718)
    [junit] 	at org.apache.lucene.index.IndexWriter.merge(IndexWriter.java:3257)
    [junit] 	at org.apache.lucene.index.ConcurrentMergeScheduler.doMerge(ConcurrentMergeScheduler.java:382)
    [junit] 	at org.apache.lucene.index.ConcurrentMergeScheduler$MergeThread.run(ConcurrentMergeScheduler.java:451)
    [junit] *** Thread: Lucene Merge Thread #125 ***
    [junit] org.apache.lucene.index.MergePolicy$MergeException: java.lang.AssertionError
    [junit] 	at org.apache.lucene.index.ConcurrentMergeScheduler.handleMergeException(ConcurrentMergeScheduler.java:507)
    [junit] 	at org.apache.lucene.index.ConcurrentMergeScheduler$MergeThread.run(ConcurrentMergeScheduler.java:480)
    [junit] Caused by: java.lang.AssertionError
    [junit] 	at org.apache.lucene.index.IndexWriter.commitMergedDeletes(IndexWriter.java:3028)
    [junit] 	at org.apache.lucene.index.IndexWriter.commitMerge(IndexWriter.java:3137)
    [junit] 	at org.apache.lucene.index.IndexWriter.mergeMiddle(IndexWriter.java:3718)
    [junit] 	at org.apache.lucene.index.IndexWriter.merge(IndexWriter.java:3257)
    [junit] 	at org.apache.lucene.index.ConcurrentMergeScheduler.doMerge(ConcurrentMergeScheduler.java:382)
    [junit] 	at org.apache.lucene.index.ConcurrentMergeScheduler$MergeThread.run(ConcurrentMergeScheduler.java:451)
    [junit] NOTE: reproduce with: ant test -Dtestcase=TestStressNRT -Dtestmethod=test -Dtests.seed=69468941c1bbf693:19e66d58475da929:69e9d2f81769b6d0
-Dargs="-Dfile.encoding=UTF-8"
    [junit] NOTE: reproduce with: ant test -Dtestcase=TestStressNRT -Dtestmethod=test -Dtests.seed=69468941c1bbf693:19e66d58475da929:69e9d2f81769b6d0
-Dargs="-Dfile.encoding=UTF-8"
    [junit] NOTE: test params are: codec=Lucene3x, sim=RandomSimilarityProvider(queryNorm=true,coord=false):
{}, locale=ro, timezone=Etc/GMT+1
    [junit] NOTE: all tests run in this JVM:
    [junit] [TestStressNRT]
    [junit] NOTE: Linux 3.0.0-16-generic amd64/Sun Microsystems Inc. 1.6.0_27 (64-bit)/cpus=2,threads=1,free=135293744,total=194379776
    [junit] ------------- ---------------- ---------------
    [junit] Testcase: test(org.apache.lucene.index.TestStressNRT):	Caused an ERROR
    [junit] java.lang.AssertionError: Some threads threw uncaught exceptions!
    [junit] java.lang.RuntimeException: java.lang.AssertionError: Some threads threw uncaught
exceptions!
    [junit] 	at org.apache.lucene.util.LuceneTestCase.tearDownInternal(LuceneTestCase.java:816)
    [junit] 	at org.apache.lucene.util.LuceneTestCase.access$1100(LuceneTestCase.java:137)
    [junit] 	at org.apache.lucene.util.LuceneTestCase$InternalSetupTeardownRule$1.evaluate(LuceneTestCase.java:640)
    [junit] 	at org.apache.lucene.util.SystemPropertiesInvariantRule$1.evaluate(SystemPropertiesInvariantRule.java:22)
    [junit] 	at org.apache.lucene.util.LuceneTestCase$TestResultInterceptorRule$1.evaluate(LuceneTestCase.java:538)
    [junit] 	at org.apache.lucene.util.LuceneTestCase$RememberThreadRule$1.evaluate(LuceneTestCase.java:600)
    [junit] 	at org.apache.lucene.util.LuceneTestCaseRunner.runChild(LuceneTestCaseRunner.java:164)
    [junit] 	at org.apache.lucene.util.LuceneTestCaseRunner.runChild(LuceneTestCaseRunner.java:57)
    [junit] 	at org.apache.lucene.util.StoreClassNameRule$1.evaluate(StoreClassNameRule.java:21)
    [junit] 	at org.apache.lucene.util.SystemPropertiesInvariantRule$1.evaluate(SystemPropertiesInvariantRule.java:22)
    [junit] Caused by: java.lang.AssertionError: Some threads threw uncaught exceptions!
    [junit] 	at org.apache.lucene.util.LuceneTestCase.checkUncaughtExceptionsAfter(LuceneTestCase.java:844)
    [junit] 	at org.apache.lucene.util.LuceneTestCase.tearDownInternal(LuceneTestCase.java:788)
    [junit] 
    [junit] 
{noformat}

                
> TestStressNRT failures (reproducible)
> -------------------------------------
>
>                 Key: LUCENE-3855
>                 URL: https://issues.apache.org/jira/browse/LUCENE-3855
>             Project: Lucene - Java
>          Issue Type: Bug
>            Reporter: Dawid Weiss
>            Priority: Minor
>             Fix For: 4.0
>
>         Attachments: output1.log, output2.log, output3.log, output4.log
>
>
> Build server logs. Reproduces on at least two machines.
> {noformat}
>     [junit] ------------- Standard Error -----------------
>     [junit] NOTE: reproduce with: ant test -Dtestcase=TestStressNRT -Dtestmethod=test
-Dtests.seed=69468941c1bbf693:19e66d58475da929:69e9d2f81769b6d0 -Dargs="-Dfile.encoding=UTF-8"
>     [junit] NOTE: test params are: codec=Lucene3x, sim=RandomSimilarityProvider(queryNorm=true,coord=false):
{}, locale=ro, timezone=Etc/GMT+1
>     [junit] NOTE: all tests run in this JVM:
>     [junit] [TestStressNRT]
>     [junit] NOTE: Linux 3.0.0-16-generic amd64/Sun Microsystems Inc. 1.6.0_27 (64-bit)/cpus=2,threads=1,free=74960064,total=135987200
>     [junit] ------------- ---------------- ---------------
>     [junit] Testcase: test(org.apache.lucene.index.TestStressNRT):	Caused an ERROR
>     [junit] MockDirectoryWrapper: cannot close: there are still open files: {_ng.cfs=8}
>     [junit] java.lang.RuntimeException: MockDirectoryWrapper: cannot close: there are
still open files: {_ng.cfs=8}
>     [junit] 	at org.apache.lucene.store.MockDirectoryWrapper.close(MockDirectoryWrapper.java:555)
>     [junit] 	at org.apache.lucene.index.TestStressNRT.test(TestStressNRT.java:385)
>     [junit] 	at org.apache.lucene.util.LuceneTestCase$SubclassSetupTeardownRule$1.evaluate(LuceneTestCase.java:743)
>     [junit] 	at org.apache.lucene.util.LuceneTestCase$InternalSetupTeardownRule$1.evaluate(LuceneTestCase.java:639)
>     [junit] 	at org.apache.lucene.util.SystemPropertiesInvariantRule$1.evaluate(SystemPropertiesInvariantRule.java:22)
>     [junit] 	at org.apache.lucene.util.LuceneTestCase$TestResultInterceptorRule$1.evaluate(LuceneTestCase.java:538)
>     [junit] 	at org.apache.lucene.util.LuceneTestCase$RememberThreadRule$1.evaluate(LuceneTestCase.java:600)
>     [junit] 	at org.apache.lucene.util.LuceneTestCaseRunner.runChild(LuceneTestCaseRunner.java:164)
>     [junit] 	at org.apache.lucene.util.LuceneTestCaseRunner.runChild(LuceneTestCaseRunner.java:57)
>     [junit] 	at org.apache.lucene.util.StoreClassNameRule$1.evaluate(StoreClassNameRule.java:21)
>     [junit] 	at org.apache.lucene.util.SystemPropertiesInvariantRule$1.evaluate(SystemPropertiesInvariantRule.java:22)
>     [junit] Caused by: java.lang.RuntimeException: unclosed IndexInput: _ng.cfs
>     [junit] 	at org.apache.lucene.store.MockDirectoryWrapper.addFileHandle(MockDirectoryWrapper.java:479)
>     [junit] 	at org.apache.lucene.store.MockDirectoryWrapper$1.openSlice(MockDirectoryWrapper.java:777)
>     [junit] 	at org.apache.lucene.store.CompoundFileDirectory.openInput(CompoundFileDirectory.java:221)
>     [junit] 	at org.apache.lucene.codecs.lucene3x.TermInfosReader.<init>(TermInfosReader.java:112)
>     [junit] 	at org.apache.lucene.codecs.lucene3x.Lucene3xFields.<init>(Lucene3xFields.java:84)
>     [junit] 	at org.apache.lucene.codecs.lucene3x.PreFlexRWPostingsFormat$1.<init>(PreFlexRWPostingsFormat.java:51)
>     [junit] 	at org.apache.lucene.codecs.lucene3x.PreFlexRWPostingsFormat.fieldsProducer(PreFlexRWPostingsFormat.java:51)
>     [junit] 	at org.apache.lucene.index.SegmentCoreReaders.<init>(SegmentCoreReaders.java:108)
>     [junit] 	at org.apache.lucene.index.SegmentReader.<init>(SegmentReader.java:51)
>     [junit] 	at org.apache.lucene.index.IndexWriter$ReadersAndLiveDocs.getMergeReader(IndexWriter.java:521)
>     [junit] 	at org.apache.lucene.index.IndexWriter.mergeMiddle(IndexWriter.java:3587)
>     [junit] 	at org.apache.lucene.index.IndexWriter.merge(IndexWriter.java:3257)
>     [junit] 	at org.apache.lucene.index.ConcurrentMergeScheduler.doMerge(ConcurrentMergeScheduler.java:382)
>     [junit] 	at org.apache.lucene.index.ConcurrentMergeScheduler$MergeThread.run(ConcurrentMergeScheduler.java:451)
>     [junit] 
>     [junit] 
>     [junit] Test org.apache.lucene.index.TestStressNRT FAILED
> {noformat}

--
This message is automatically generated by JIRA.
If you think it was sent incorrectly, please contact your JIRA administrators: https://issues.apache.org/jira/secure/ContactAdministrators!default.jspa
For more information on JIRA, see: http://www.atlassian.com/software/jira

        

---------------------------------------------------------------------
To unsubscribe, e-mail: dev-unsubscribe@lucene.apache.org
For additional commands, e-mail: dev-help@lucene.apache.org


Mime
View raw message