lucene-dev mailing list archives

Site index · List index
Message view « Date » · « Thread »
Top « Date » · « Thread »
From Apache Jenkins Server <jenk...@builds.apache.org>
Subject [JENKINS] Lucene-Solr-tests-only-trunk - Build # 12493 - Still Failing
Date Wed, 22 Feb 2012 10:47:02 GMT
Build: https://builds.apache.org/job/Lucene-Solr-tests-only-trunk/12493/

1 tests failed.
FAILED:  org.apache.lucene.queries.function.TestOrdValues.testReverseOrdFieldRank

Error Message:
java.lang.AssertionError: org.apache.lucene.queries.function.TestOrdValues.testReverseOrdFieldRank:
Insane FieldCache usage(s) found expected:<0> but was:<1>

Stack Trace:
java.lang.RuntimeException: java.lang.AssertionError: org.apache.lucene.queries.function.TestOrdValues.testReverseOrdFieldRank:
Insane FieldCache usage(s) found expected:<0> but was:<1>
	at org.apache.lucene.util.LuceneTestCase.tearDownInternal(LuceneTestCase.java:780)
	at org.apache.lucene.util.LuceneTestCase.access$1000(LuceneTestCase.java:138)
	at org.apache.lucene.util.LuceneTestCase$InternalSetupTeardownRule$1.evaluate(LuceneTestCase.java:607)
	at org.apache.lucene.util.LuceneTestCase$TestResultInterceptorRule$1.evaluate(LuceneTestCase.java:511)
	at org.apache.lucene.util.LuceneTestCase$RememberThreadRule$1.evaluate(LuceneTestCase.java:569)
	at org.apache.lucene.util.LuceneTestCaseRunner.runChild(LuceneTestCaseRunner.java:165)
	at org.apache.lucene.util.LuceneTestCaseRunner.runChild(LuceneTestCaseRunner.java:57)
	at org.apache.lucene.util.LuceneTestCase.assertSaneFieldCaches(LuceneTestCase.java:907)
	at org.apache.lucene.util.LuceneTestCase.tearDownInternal(LuceneTestCase.java:770)




Build Log (for compile errors):
[...truncated 5037 lines...]



Mime
View raw message