lucene-dev mailing list archives

Site index · List index
Message view « Date » · « Thread »
Top « Date » · « Thread »
From Apache Jenkins Server <jenk...@builds.apache.org>
Subject [JENKINS] Lucene-Solr-tests-only-trunk-java7 - Build # 1738 - Still Failing
Date Wed, 15 Feb 2012 16:37:17 GMT
Build: https://builds.apache.org/job/Lucene-Solr-tests-only-trunk-java7/1738/

2 tests failed.
FAILED:  org.apache.lucene.analysis.uima.UIMABaseAnalyzerTest.testRandomStrings

Error Message:
java.lang.AssertionError: Some threads threw uncaught exceptions!

Stack Trace:
java.lang.RuntimeException: java.lang.AssertionError: Some threads threw uncaught exceptions!
	at org.apache.lucene.util.LuceneTestCase.tearDownInternal(LuceneTestCase.java:773)
	at org.apache.lucene.util.LuceneTestCase.access$1000(LuceneTestCase.java:131)
	at org.apache.lucene.util.LuceneTestCase$InternalSetupTeardownRule$1.evaluate(LuceneTestCase.java:600)
	at org.apache.lucene.util.LuceneTestCase$TestResultInterceptorRule$1.evaluate(LuceneTestCase.java:504)
	at org.apache.lucene.util.LuceneTestCase$RememberThreadRule$1.evaluate(LuceneTestCase.java:562)
	at org.apache.lucene.util.LuceneTestCaseRunner.runChild(LuceneTestCaseRunner.java:165)
	at org.apache.lucene.util.LuceneTestCaseRunner.runChild(LuceneTestCaseRunner.java:57)
	at org.apache.lucene.util.LuceneTestCase.checkUncaughtExceptionsAfter(LuceneTestCase.java:801)
	at org.apache.lucene.util.LuceneTestCase.tearDownInternal(LuceneTestCase.java:745)


FAILED:  org.apache.lucene.analysis.uima.UIMATypeAwareAnalyzerTest.testRandomStrings

Error Message:
java.lang.AssertionError: Some threads threw uncaught exceptions!

Stack Trace:
java.lang.RuntimeException: java.lang.AssertionError: Some threads threw uncaught exceptions!
	at org.apache.lucene.util.LuceneTestCase.tearDownInternal(LuceneTestCase.java:773)
	at org.apache.lucene.util.LuceneTestCase.access$1000(LuceneTestCase.java:131)
	at org.apache.lucene.util.LuceneTestCase$InternalSetupTeardownRule$1.evaluate(LuceneTestCase.java:600)
	at org.apache.lucene.util.LuceneTestCase$TestResultInterceptorRule$1.evaluate(LuceneTestCase.java:504)
	at org.apache.lucene.util.LuceneTestCase$RememberThreadRule$1.evaluate(LuceneTestCase.java:562)
	at org.apache.lucene.util.LuceneTestCaseRunner.runChild(LuceneTestCaseRunner.java:165)
	at org.apache.lucene.util.LuceneTestCaseRunner.runChild(LuceneTestCaseRunner.java:57)
	at org.apache.lucene.util.LuceneTestCase.checkUncaughtExceptionsAfter(LuceneTestCase.java:801)
	at org.apache.lucene.util.LuceneTestCase.tearDownInternal(LuceneTestCase.java:745)




Build Log (for compile errors):
[...truncated 5211 lines...]



Mime
View raw message