lucene-dev mailing list archives

Site index · List index
Message view « Date » · « Thread »
Top « Date » · « Thread »
From Apache Jenkins Server <jenk...@builds.apache.org>
Subject [JENKINS] Lucene-Solr-tests-only-trunk - Build # 12530 - Failure
Date Mon, 27 Feb 2012 12:51:20 GMT
Build: https://builds.apache.org/job/Lucene-Solr-tests-only-trunk/12530/

2 tests failed.
REGRESSION:  org.apache.lucene.search.TestComplexExplanations.testCSQ4

Error Message:
java.lang.AssertionError: org.apache.lucene.search.TestComplexExplanations.testCSQ4: Insane
FieldCache usage(s) found expected:<0> but was:<1>

Stack Trace:
java.lang.RuntimeException: java.lang.AssertionError: org.apache.lucene.search.TestComplexExplanations.testCSQ4:
Insane FieldCache usage(s) found expected:<0> but was:<1>
	at org.apache.lucene.util.LuceneTestCase.tearDownInternal(LuceneTestCase.java:780)
	at org.apache.lucene.util.LuceneTestCase.access$1000(LuceneTestCase.java:138)
	at org.apache.lucene.util.LuceneTestCase$InternalSetupTeardownRule$1.evaluate(LuceneTestCase.java:607)
	at org.apache.lucene.util.LuceneTestCase$TestResultInterceptorRule$1.evaluate(LuceneTestCase.java:511)
	at org.apache.lucene.util.LuceneTestCase$RememberThreadRule$1.evaluate(LuceneTestCase.java:569)
	at org.apache.lucene.util.LuceneTestCaseRunner.runChild(LuceneTestCaseRunner.java:165)
	at org.apache.lucene.util.LuceneTestCaseRunner.runChild(LuceneTestCaseRunner.java:57)
	at org.apache.lucene.util.LuceneTestCase.assertSaneFieldCaches(LuceneTestCase.java:907)
	at org.apache.lucene.util.LuceneTestCase.tearDownInternal(LuceneTestCase.java:770)


REGRESSION:  org.apache.lucene.search.TestSloppyPhraseQuery2.testRandomIncreasingSloppiness

Error Message:
null

Stack Trace:
junit.framework.AssertionFailedError
	at org.apache.lucene.util.LuceneTestCaseRunner.runChild(LuceneTestCaseRunner.java:165)
	at org.apache.lucene.util.LuceneTestCaseRunner.runChild(LuceneTestCaseRunner.java:57)
	at org.apache.lucene.search.SearchEquivalenceTestBase.assertSubsetOf(SearchEquivalenceTestBase.java:204)
	at org.apache.lucene.search.SearchEquivalenceTestBase.assertSubsetOf(SearchEquivalenceTestBase.java:159)
	at org.apache.lucene.search.TestSloppyPhraseQuery2.testRandomIncreasingSloppiness(TestSloppyPhraseQuery2.java:183)
	at org.apache.lucene.util.LuceneTestCase$SubclassSetupTeardownRule$1.evaluate(LuceneTestCase.java:707)
	at org.apache.lucene.util.LuceneTestCase$InternalSetupTeardownRule$1.evaluate(LuceneTestCase.java:606)
	at org.apache.lucene.util.LuceneTestCase$TestResultInterceptorRule$1.evaluate(LuceneTestCase.java:511)
	at org.apache.lucene.util.LuceneTestCase$RememberThreadRule$1.evaluate(LuceneTestCase.java:569)




Build Log (for compile errors):
[...truncated 1524 lines...]



Mime
View raw message