lucene-dev mailing list archives

Site index · List index
Message view « Date » · « Thread »
Top « Date » · « Thread »
From Apache Jenkins Server <jenk...@builds.apache.org>
Subject [JENKINS] Lucene-Solr-tests-only-trunk - Build # 12381 - Failure
Date Thu, 09 Feb 2012 11:33:48 GMT
Build: https://builds.apache.org/job/Lucene-Solr-tests-only-trunk/12381/

3 tests failed.
FAILED:  junit.framework.TestSuite.org.apache.solr.cloud.BasicZkTest

Error Message:
Could not connect to ZooKeeper 127.0.0.1:27506 within 30000 ms

Stack Trace:
java.util.concurrent.TimeoutException: Could not connect to ZooKeeper 127.0.0.1:27506 within
30000 ms
	at org.apache.solr.common.cloud.ConnectionManager.waitForConnected(ConnectionManager.java:129)
	at org.apache.solr.common.cloud.SolrZkClient.<init>(SolrZkClient.java:142)
	at org.apache.solr.common.cloud.SolrZkClient.<init>(SolrZkClient.java:105)
	at org.apache.solr.common.cloud.SolrZkClient.<init>(SolrZkClient.java:86)
	at org.apache.solr.cloud.AbstractZkTestCase.buildZooKeeper(AbstractZkTestCase.java:75)
	at org.apache.solr.cloud.AbstractZkTestCase.azt_beforeClass(AbstractZkTestCase.java:66)


REGRESSION:  org.apache.solr.cloud.CloudStateUpdateTest.testCoreRegistration

Error Message:
Could not get shard_id for core: testcore

Stack Trace:
org.apache.solr.common.SolrException: Could not get shard_id for core: testcore
	at org.apache.solr.cloud.ZkController.doGetShardIdProcess(ZkController.java:884)
	at org.apache.solr.cloud.ZkController.publishState(ZkController.java:829)
	at org.apache.solr.cloud.ZkController.publish(ZkController.java:633)
	at org.apache.solr.core.CoreContainer.register(CoreContainer.java:491)
	at org.apache.solr.core.CoreContainer.register(CoreContainer.java:551)
	at org.apache.solr.cloud.CloudStateUpdateTest.testCoreRegistration(CloudStateUpdateTest.java:161)
	at org.apache.lucene.util.LuceneTestCase$3$1.evaluate(LuceneTestCase.java:527)
	at org.apache.lucene.util.LuceneTestCaseRunner.runChild(LuceneTestCaseRunner.java:165)
	at org.apache.lucene.util.LuceneTestCaseRunner.runChild(LuceneTestCaseRunner.java:57)


FAILED:  junit.framework.TestSuite.org.apache.solr.cloud.CloudStateUpdateTest

Error Message:
ERROR: SolrIndexSearcher opens=4 closes=3

Stack Trace:
junit.framework.AssertionFailedError: ERROR: SolrIndexSearcher opens=4 closes=3
	at org.apache.solr.SolrTestCaseJ4.endTrackingSearchers(SolrTestCaseJ4.java:152)
	at org.apache.solr.SolrTestCaseJ4.afterClassSolrTestCase(SolrTestCaseJ4.java:76)




Build Log (for compile errors):
[...truncated 8838 lines...]



---------------------------------------------------------------------
To unsubscribe, e-mail: dev-unsubscribe@lucene.apache.org
For additional commands, e-mail: dev-help@lucene.apache.org


Mime
View raw message