lucene-dev mailing list archives

Site index · List index
Message view « Date » · « Thread »
Top « Date » · « Thread »
From Apache Jenkins Server <jenk...@builds.apache.org>
Subject [JENKINS] Lucene-Solr-tests-only-3.x - Build # 12416 - Failure
Date Sat, 11 Feb 2012 18:29:15 GMT
Build: https://builds.apache.org/job/Lucene-Solr-tests-only-3.x/12416/

1 tests failed.
REGRESSION:  org.apache.lucene.analysis.miscellaneous.PatternAnalyzerTest.testRandomStrings

Error Message:
java.lang.AssertionError: Some threads threw uncaught exceptions!

Stack Trace:
java.lang.RuntimeException: java.lang.AssertionError: Some threads threw uncaught exceptions!
	at org.apache.lucene.util.LuceneTestCase.tearDown(LuceneTestCase.java:593)
	at org.apache.lucene.util.LuceneTestCaseRunner.runChild(LuceneTestCaseRunner.java:147)
	at org.apache.lucene.util.LuceneTestCaseRunner.runChild(LuceneTestCaseRunner.java:50)
	at org.apache.lucene.util.LuceneTestCase.checkUncaughtExceptionsAfter(LuceneTestCase.java:621)
	at org.apache.lucene.util.LuceneTestCase.tearDown(LuceneTestCase.java:565)




Build Log (for compile errors):
[...truncated 11104 lines...]



---------------------------------------------------------------------
To unsubscribe, e-mail: dev-unsubscribe@lucene.apache.org
For additional commands, e-mail: dev-help@lucene.apache.org


Mime
View raw message