lucene-dev mailing list archives

Site index · List index
Message view « Date » · « Thread »
Top « Date » · « Thread »
From Apache Jenkins Server <jenk...@builds.apache.org>
Subject [JENKINS] Lucene-Solr-tests-only-trunk - Build # 12437 - Still Failing
Date Thu, 16 Feb 2012 20:13:50 GMT
Build: https://builds.apache.org/job/Lucene-Solr-tests-only-trunk/12437/

5 tests failed.
FAILED:  junit.framework.TestSuite.org.apache.solr.cloud.ChaosMonkeySafeLeaderTest

Error Message:
ERROR: SolrIndexSearcher opens=39 closes=11

Stack Trace:
junit.framework.AssertionFailedError: ERROR: SolrIndexSearcher opens=39 closes=11
	at org.apache.solr.SolrTestCaseJ4.endTrackingSearchers(SolrTestCaseJ4.java:152)
	at org.apache.solr.SolrTestCaseJ4.afterClassSolrTestCase(SolrTestCaseJ4.java:76)


REGRESSION:  org.apache.solr.cloud.FullSolrCloudDistribCmdsTest.testDistribSearch

Error Message:
null

Stack Trace:
org.apache.solr.common.cloud.ZooKeeperException: 
	at org.apache.solr.client.solrj.impl.CloudSolrServer.connect(CloudSolrServer.java:123)
	at org.apache.solr.client.solrj.impl.CloudSolrServer.request(CloudSolrServer.java:133)
	at org.apache.solr.client.solrj.request.AbstractUpdateRequest.process(AbstractUpdateRequest.java:104)
	at org.apache.solr.cloud.FullSolrCloudTest.indexDoc(FullSolrCloudTest.java:464)
	at org.apache.solr.BaseDistributedSearchTestCase.indexr(BaseDistributedSearchTestCase.java:283)
	at org.apache.solr.cloud.FullSolrCloudDistribCmdsTest.addUpdateDelete(FullSolrCloudDistribCmdsTest.java:200)
	at org.apache.solr.cloud.FullSolrCloudDistribCmdsTest.doTest(FullSolrCloudDistribCmdsTest.java:74)
	at org.apache.solr.BaseDistributedSearchTestCase.testDistribSearch(BaseDistributedSearchTestCase.java:664)
	at org.apache.lucene.util.LuceneTestCase$SubclassSetupTeardownRule$1.evaluate(LuceneTestCase.java:700)
	at org.apache.lucene.util.LuceneTestCase$InternalSetupTeardownRule$1.evaluate(LuceneTestCase.java:599)
	at org.apache.lucene.util.LuceneTestCase$TestResultInterceptorRule$1.evaluate(LuceneTestCase.java:504)
	at org.apache.lucene.util.LuceneTestCase$RememberThreadRule$1.evaluate(LuceneTestCase.java:562)
	at org.apache.lucene.util.LuceneTestCaseRunner.runChild(LuceneTestCaseRunner.java:165)
	at org.apache.lucene.util.LuceneTestCaseRunner.runChild(LuceneTestCaseRunner.java:57)
Caused by: java.util.concurrent.TimeoutException: Could not connect to ZooKeeper 127.0.0.1:27995/solr
within 10000 ms
	at org.apache.solr.common.cloud.ConnectionManager.waitForConnected(ConnectionManager.java:129)
	at org.apache.solr.common.cloud.SolrZkClient.<init>(SolrZkClient.java:142)
	at org.apache.solr.common.cloud.SolrZkClient.<init>(SolrZkClient.java:90)
	at org.apache.solr.common.cloud.ZkStateReader.<init>(ZkStateReader.java:137)
	at org.apache.solr.client.solrj.impl.CloudSolrServer.connect(CloudSolrServer.java:108)


REGRESSION:  org.apache.solr.cloud.OverseerTest.testDoubleAssignment

Error Message:
KeeperErrorCode = NoNode for /solr/node_states/localhost:89825_solr

Stack Trace:
org.apache.zookeeper.KeeperException$NoNodeException: KeeperErrorCode = NoNode for /solr/node_states/localhost:89825_solr
	at org.apache.zookeeper.KeeperException.create(KeeperException.java:102)
	at org.apache.zookeeper.KeeperException.create(KeeperException.java:42)
	at org.apache.zookeeper.ZooKeeper.delete(ZooKeeper.java:734)
	at org.apache.solr.common.cloud.SolrZkClient$2.execute(SolrZkClient.java:166)
	at org.apache.solr.common.cloud.SolrZkClient$2.execute(SolrZkClient.java:163)
	at org.apache.solr.common.cloud.ZkCmdExecutor.retryOperation(ZkCmdExecutor.java:65)
	at org.apache.solr.common.cloud.SolrZkClient.delete(SolrZkClient.java:163)
	at org.apache.solr.cloud.AbstractZkTestCase.tryCleanPath(AbstractZkTestCase.java:152)
	at org.apache.solr.cloud.AbstractZkTestCase.tryCleanPath(AbstractZkTestCase.java:150)
	at org.apache.solr.cloud.AbstractZkTestCase.tryCleanPath(AbstractZkTestCase.java:150)
	at org.apache.solr.cloud.AbstractZkTestCase.tryCleanSolrZkNode(AbstractZkTestCase.java:142)
	at org.apache.solr.cloud.OverseerTest.testDoubleAssignment(OverseerTest.java:554)
	at org.apache.lucene.util.LuceneTestCase$SubclassSetupTeardownRule$1.evaluate(LuceneTestCase.java:700)
	at org.apache.lucene.util.LuceneTestCase$InternalSetupTeardownRule$1.evaluate(LuceneTestCase.java:599)
	at org.apache.lucene.util.LuceneTestCase$TestResultInterceptorRule$1.evaluate(LuceneTestCase.java:504)
	at org.apache.lucene.util.LuceneTestCase$RememberThreadRule$1.evaluate(LuceneTestCase.java:562)
	at org.apache.lucene.util.LuceneTestCaseRunner.runChild(LuceneTestCaseRunner.java:165)
	at org.apache.lucene.util.LuceneTestCaseRunner.runChild(LuceneTestCaseRunner.java:57)


FAILED:  junit.framework.TestSuite.org.apache.solr.cloud.OverseerTest

Error Message:
ERROR: SolrZkClient opens=209 closes=206

Stack Trace:
junit.framework.AssertionFailedError: ERROR: SolrZkClient opens=209 closes=206
	at org.apache.solr.SolrTestCaseJ4.endTrackingZkClients(SolrTestCaseJ4.java:168)
	at org.apache.solr.SolrTestCaseJ4.afterClassSolrTestCase(SolrTestCaseJ4.java:77)


FAILED:  org.apache.solr.cloud.ChaosMonkeySafeLeaderTest.testDistribSearch

Error Message:
Shards in the state does not match what we set:10 vs 40

Stack Trace:
junit.framework.AssertionFailedError: Shards in the state does not match what we set:10 vs
40
	at org.apache.lucene.util.LuceneTestCaseRunner.runChild(LuceneTestCaseRunner.java:165)
	at org.apache.lucene.util.LuceneTestCaseRunner.runChild(LuceneTestCaseRunner.java:57)
	at org.apache.solr.cloud.FullSolrCloudTest.createJettys(FullSolrCloudTest.java:276)
	at org.apache.solr.cloud.FullSolrCloudTest.createServers(FullSolrCloudTest.java:230)
	at org.apache.solr.BaseDistributedSearchTestCase.testDistribSearch(BaseDistributedSearchTestCase.java:662)
	at org.apache.lucene.util.LuceneTestCase$SubclassSetupTeardownRule$1.evaluate(LuceneTestCase.java:700)
	at org.apache.lucene.util.LuceneTestCase$InternalSetupTeardownRule$1.evaluate(LuceneTestCase.java:599)
	at org.apache.lucene.util.LuceneTestCase$TestResultInterceptorRule$1.evaluate(LuceneTestCase.java:504)
	at org.apache.lucene.util.LuceneTestCase$RememberThreadRule$1.evaluate(LuceneTestCase.java:562)




Build Log (for compile errors):
[...truncated 10745 lines...]



Mime
View raw message