lucene-dev mailing list archives

Site index · List index
Message view « Date » · « Thread »
Top « Date » · « Thread »
From Apache Jenkins Server <jenk...@builds.apache.org>
Subject [JENKINS] Lucene-Solr-tests-only-trunk-java7 - Build # 1751 - Failure
Date Sat, 18 Feb 2012 09:28:59 GMT
Build: https://builds.apache.org/job/Lucene-Solr-tests-only-trunk-java7/1751/

1 tests failed.
REGRESSION:  org.apache.solr.cloud.RecoveryZkTest.testDistribSearch

Error Message:
java.lang.AssertionError: Some threads threw uncaught exceptions!

Stack Trace:
java.lang.RuntimeException: java.lang.AssertionError: Some threads threw uncaught exceptions!
	at org.apache.lucene.util.LuceneTestCase.tearDownInternal(LuceneTestCase.java:778)
	at org.apache.lucene.util.LuceneTestCase.access$1000(LuceneTestCase.java:136)
	at org.apache.lucene.util.LuceneTestCase$InternalSetupTeardownRule$1.evaluate(LuceneTestCase.java:605)
	at org.apache.lucene.util.LuceneTestCase$TestResultInterceptorRule$1.evaluate(LuceneTestCase.java:509)
	at org.apache.lucene.util.LuceneTestCase$RememberThreadRule$1.evaluate(LuceneTestCase.java:567)
	at org.apache.lucene.util.LuceneTestCaseRunner.runChild(LuceneTestCaseRunner.java:165)
	at org.apache.lucene.util.LuceneTestCaseRunner.runChild(LuceneTestCaseRunner.java:57)
	at org.apache.lucene.util.LuceneTestCase.checkUncaughtExceptionsAfter(LuceneTestCase.java:806)
	at org.apache.lucene.util.LuceneTestCase.tearDownInternal(LuceneTestCase.java:750)




Build Log (for compile errors):
[...truncated 11525 lines...]



Mime
View raw message