lucene-dev mailing list archives

Site index · List index
Message view « Date » · « Thread »
Top « Date » · « Thread »
From Apache Jenkins Server <jenk...@builds.apache.org>
Subject [JENKINS] Lucene-Solr-tests-only-trunk - Build # 12407 - Still Failing
Date Mon, 13 Feb 2012 07:17:07 GMT
Build: https://builds.apache.org/job/Lucene-Solr-tests-only-trunk/12407/

1 tests failed.
REGRESSION:  org.apache.solr.cloud.RecoveryZkTest.testDistribSearch

Error Message:
java.lang.AssertionError: Some threads threw uncaught exceptions!

Stack Trace:
java.lang.RuntimeException: java.lang.AssertionError: Some threads threw uncaught exceptions!
	at org.apache.lucene.util.LuceneTestCase.tearDown(LuceneTestCase.java:678)
	at org.apache.solr.SolrTestCaseJ4.tearDown(SolrTestCaseJ4.java:89)
	at org.apache.solr.BaseDistributedSearchTestCase.tearDown(BaseDistributedSearchTestCase.java:177)
	at org.apache.solr.cloud.AbstractDistributedZkTestCase.tearDown(AbstractDistributedZkTestCase.java:85)
	at org.apache.solr.cloud.FullSolrCloudTest.tearDown(FullSolrCloudTest.java:1277)
	at org.apache.solr.cloud.RecoveryZkTest.tearDown(RecoveryZkTest.java:132)
	at org.apache.lucene.util.LuceneTestCaseRunner.runChild(LuceneTestCaseRunner.java:165)
	at org.apache.lucene.util.LuceneTestCaseRunner.runChild(LuceneTestCaseRunner.java:57)
	at org.apache.lucene.util.LuceneTestCase.checkUncaughtExceptionsAfter(LuceneTestCase.java:706)
	at org.apache.lucene.util.LuceneTestCase.tearDown(LuceneTestCase.java:650)




Build Log (for compile errors):
[...truncated 8376 lines...]



Mime
View raw message