lucene-dev mailing list archives

Site index · List index
Message view « Date » · « Thread »
Top « Date » · « Thread »
From Apache Jenkins Server <jenk...@builds.apache.org>
Subject [JENKINS] Lucene-Solr-tests-only-trunk-java7 - Build # 1694 - Failure
Date Wed, 08 Feb 2012 00:30:48 GMT
Build: https://builds.apache.org/job/Lucene-Solr-tests-only-trunk-java7/1694/

1 tests failed.
REGRESSION:  org.apache.solr.cloud.RecoveryZkTest.testDistribSearch

Error Message:
java.lang.AssertionError: Some threads threw uncaught exceptions!

Stack Trace:
java.lang.RuntimeException: java.lang.AssertionError: Some threads threw uncaught exceptions!
	at org.apache.lucene.util.LuceneTestCase.tearDown(LuceneTestCase.java:678)
	at org.apache.solr.SolrTestCaseJ4.tearDown(SolrTestCaseJ4.java:89)
	at org.apache.solr.BaseDistributedSearchTestCase.tearDown(BaseDistributedSearchTestCase.java:177)
	at org.apache.solr.cloud.AbstractDistributedZkTestCase.tearDown(AbstractDistributedZkTestCase.java:85)
	at org.apache.solr.cloud.FullSolrCloudTest.tearDown(FullSolrCloudTest.java:1253)
	at org.apache.solr.cloud.RecoveryZkTest.tearDown(RecoveryZkTest.java:132)
	at org.apache.lucene.util.LuceneTestCaseRunner.runChild(LuceneTestCaseRunner.java:165)
	at org.apache.lucene.util.LuceneTestCaseRunner.runChild(LuceneTestCaseRunner.java:57)
	at org.apache.lucene.util.LuceneTestCase.checkUncaughtExceptionsAfter(LuceneTestCase.java:706)
	at org.apache.lucene.util.LuceneTestCase.tearDown(LuceneTestCase.java:650)




Build Log (for compile errors):
[...truncated 17958 lines...]



---------------------------------------------------------------------
To unsubscribe, e-mail: dev-unsubscribe@lucene.apache.org
For additional commands, e-mail: dev-help@lucene.apache.org


Mime
View raw message