lucene-dev mailing list archives

Site index · List index
Message view « Date » · « Thread »
Top « Date » · « Thread »
From "Uwe Schindler" <...@thetaphi.de>
Subject RE: [JENKINS] Lucene-Solr-tests-only-trunk - Build # 12521 - Failure
Date Sun, 26 Feb 2012 20:33:38 GMT
Hi,

This will be fixed, when LUCENE-3823 will be committed (later...). See issue for explanation
of those insanities because of maybeWrapReader().

Uwe

-----
Uwe Schindler
H.-H.-Meier-Allee 63, D-28213 Bremen
http://www.thetaphi.de
eMail: uwe@thetaphi.de

> -----Original Message-----
> From: Apache Jenkins Server [mailto:jenkins@builds.apache.org]
> Sent: Sunday, February 26, 2012 9:13 PM
> To: dev@lucene.apache.org
> Subject: [JENKINS] Lucene-Solr-tests-only-trunk - Build # 12521 - Failure
> 
> Build: https://builds.apache.org/job/Lucene-Solr-tests-only-trunk/12521/
> 
> 1 tests failed.
> REGRESSION:
> org.apache.lucene.search.join.TestJoinUtil.testMultiValueRandomJoin
> 
> Error Message:
> java.lang.AssertionError:
> org.apache.lucene.search.join.TestJoinUtil.testMultiValueRandomJoin: Insane
> FieldCache usage(s) found expected:<0> but was:<1>
> 
> Stack Trace:
> java.lang.RuntimeException: java.lang.AssertionError:
> org.apache.lucene.search.join.TestJoinUtil.testMultiValueRandomJoin: Insane
> FieldCache usage(s) found expected:<0> but was:<1>
> 	at
> org.apache.lucene.util.LuceneTestCase.tearDownInternal(LuceneTestCase.java:
> 780)
> 	at
> org.apache.lucene.util.LuceneTestCase.access$1000(LuceneTestCase.java:138)
> 	at
> org.apache.lucene.util.LuceneTestCase$InternalSetupTeardownRule$1.evaluate
> (LuceneTestCase.java:607)
> 	at
> org.apache.lucene.util.LuceneTestCase$TestResultInterceptorRule$1.evaluate(L
> uceneTestCase.java:511)
> 	at
> org.apache.lucene.util.LuceneTestCase$RememberThreadRule$1.evaluate(Luc
> eneTestCase.java:569)
> 	at
> org.apache.lucene.util.LuceneTestCaseRunner.runChild(LuceneTestCaseRunner.
> java:165)
> 	at
> org.apache.lucene.util.LuceneTestCaseRunner.runChild(LuceneTestCaseRunner.
> java:57)
> 	at
> org.apache.lucene.util.LuceneTestCase.assertSaneFieldCaches(LuceneTestCase.
> java:907)
> 	at
> org.apache.lucene.util.LuceneTestCase.tearDownInternal(LuceneTestCase.java:
> 770)
> 
> 
> 
> 
> Build Log (for compile errors):
> [...truncated 4885 lines...]
> 



---------------------------------------------------------------------
To unsubscribe, e-mail: dev-unsubscribe@lucene.apache.org
For additional commands, e-mail: dev-help@lucene.apache.org


Mime
View raw message