lucene-dev mailing list archives

Site index · List index
Message view « Date » · « Thread »
Top « Date » · « Thread »
From Apache Jenkins Server <jenk...@builds.apache.org>
Subject [JENKINS] Lucene-Solr-tests-only-3.x - Build # 12000 - Failure
Date Sun, 01 Jan 2012 17:17:17 GMT
Build: https://builds.apache.org/job/Lucene-Solr-tests-only-3.x/12000/

2 tests failed.
FAILED:  junit.framework.TestSuite.org.apache.solr.update.processor.SignatureUpdateProcessorFactoryTest

Error Message:
/usr/home/hudson/hudson-slave/workspace/Lucene-Solr-tests-only-3.x/checkout/solr/build/solr-core/test/4/solrtest-SignatureUpdateProcessorFactoryTest-1325437938350/index/_e.frq
(No such file or directory)

Stack Trace:
java.io.FileNotFoundException: /usr/home/hudson/hudson-slave/workspace/Lucene-Solr-tests-only-3.x/checkout/solr/build/solr-core/test/4/solrtest-SignatureUpdateProcessorFactoryTest-1325437938350/index/_e.frq
(No such file or directory)
	at java.io.RandomAccessFile.open(Native Method)
	at java.io.RandomAccessFile.<init>(RandomAccessFile.java:233)
	at org.apache.lucene.store.MMapDirectory.openInput(MMapDirectory.java:218)
	at org.apache.lucene.store.FSDirectory.openInput(FSDirectory.java:345)
	at org.apache.lucene.store.MockDirectoryWrapper.crash(MockDirectoryWrapper.java:248)
	at org.apache.lucene.store.MockDirectoryWrapper.close(MockDirectoryWrapper.java:559)
	at org.apache.solr.SolrTestCaseJ4.closeDirectories(SolrTestCaseJ4.java:82)
	at org.apache.solr.SolrTestCaseJ4.deleteCore(SolrTestCaseJ4.java:290)
	at org.apache.solr.SolrTestCaseJ4.afterClassSolrTestCase(SolrTestCaseJ4.java:72)


FAILED:  junit.framework.TestSuite.org.apache.solr.update.processor.SignatureUpdateProcessorFactoryTest

Error Message:
java.lang.AssertionError: directory of test was not closed, opened from: org.apache.solr.core.MockDirectoryFactory.open(MockDirectoryFactory.java:34)

Stack Trace:
java.lang.RuntimeException: java.lang.AssertionError: directory of test was not closed, opened
from: org.apache.solr.core.MockDirectoryFactory.open(MockDirectoryFactory.java:34)
	at org.apache.lucene.util.LuceneTestCase.afterClassLuceneTestCaseJ4(LuceneTestCase.java:310)
	at org.apache.lucene.util.LuceneTestCase.checkResourcesAfterClass(LuceneTestCase.java:349)
	at org.apache.lucene.util.LuceneTestCase.afterClassLuceneTestCaseJ4(LuceneTestCase.java:278)




Build Log (for compile errors):
[...truncated 15158 lines...]



---------------------------------------------------------------------
To unsubscribe, e-mail: dev-unsubscribe@lucene.apache.org
For additional commands, e-mail: dev-help@lucene.apache.org


Mime
View raw message