lucene-dev mailing list archives

Site index · List index
Message view « Date » · « Thread »
Top « Date » · « Thread »
From Apache Jenkins Server <jenk...@builds.apache.org>
Subject [JENKINS] Lucene-Solr-tests-only-trunk - Build # 12138 - Failure
Date Sat, 14 Jan 2012 23:50:11 GMT
Build: https://builds.apache.org/job/Lucene-Solr-tests-only-trunk/12138/

2 tests failed.
REGRESSION:  org.apache.lucene.index.TestIndexWriterReader.testDuringAddIndexes

Error Message:
expected:<0> but was:<6>

Stack Trace:
junit.framework.AssertionFailedError: expected:<0> but was:<6>
	at org.apache.lucene.util.LuceneTestCaseRunner.runChild(LuceneTestCaseRunner.java:165)
	at org.apache.lucene.util.LuceneTestCaseRunner.runChild(LuceneTestCaseRunner.java:57)
	at org.apache.lucene.index.TestIndexWriterReader.testDuringAddIndexes(TestIndexWriterReader.java:783)
	at org.apache.lucene.util.LuceneTestCase$3$1.evaluate(LuceneTestCase.java:528)


REGRESSION:  org.apache.lucene.index.TestIndexWriterReader.testAddIndexes2

Error Message:
java.lang.AssertionError: Some threads threw uncaught exceptions!

Stack Trace:
java.lang.RuntimeException: java.lang.AssertionError: Some threads threw uncaught exceptions!
	at org.apache.lucene.util.LuceneTestCase.tearDown(LuceneTestCase.java:657)
	at org.apache.lucene.util.LuceneTestCaseRunner.runChild(LuceneTestCaseRunner.java:165)
	at org.apache.lucene.util.LuceneTestCaseRunner.runChild(LuceneTestCaseRunner.java:57)
	at org.apache.lucene.util.LuceneTestCase.checkUncaughtExceptionsAfter(LuceneTestCase.java:685)
	at org.apache.lucene.util.LuceneTestCase.tearDown(LuceneTestCase.java:629)




Build Log (for compile errors):
[...truncated 1490 lines...]



---------------------------------------------------------------------
To unsubscribe, e-mail: dev-unsubscribe@lucene.apache.org
For additional commands, e-mail: dev-help@lucene.apache.org


Mime
View raw message