lucene-dev mailing list archives

Site index · List index
Message view « Date » · « Thread »
Top « Date » · « Thread »
From Steven A Rowe <sar...@syr.edu>
Subject Re: [JENKINS-MAVEN] Lucene-Solr-Maven-trunk #331: POMs out of sync
Date Sat, 17 Dec 2011 18:31:31 GMT
I'm guessing the target module doesn't have a test resource directory specified.  I'm away
from a computer until tomorrow afternoon - I'll fix it then unless someone beats me to it.

Uwe Schindler <uwe@thetaphi.de> wrote:



I have no idea how to fix this. It seem that test resource files are missing.

Ant builds pass.
Uwe
--
Uwe Schindler
H.-H.-Meier-Allee 63, 28213 Bremen
http://www.thetaphi.de



Apache Jenkins Server <jenkins@builds.apache.org> schrieb:

Build: https://builds.apache.org/job/Lucene-Solr-Maven-trunk/331/

6 tests failed.
FAILED:  org.apache.lucene.queryparser.flexible.messages.TestNLS.testNLSLoading_ja

Error Message:
Can't find bundle for base name org.apache.lucene.queryparser.flexible.core.messages.QueryParserMessages,
locale ja

Stack Trace:
java.util.MissingResourceException: Can't find bundle for base name org.apache.lucene.queryparser.flexible.core.messages.QueryParserMessages,
locale ja
        at java.util.ResourceBundle.throwMissingResourceException(ResourceBundle.java:1539)
        at java.util.ResourceBundle.getBundleImpl(ResourceBundle.java:1278)
        at java.util.ResourceBundle.getBundle(ResourceBundle.java:805)
        at org.apache.lucene.queryparser.flexible.messages.NLS.getResourceBundleObject(NLS.java:
 109)
        at org.apache.lucene.queryparser.flexible.messages.NLS.getLocalizedMessage(NLS.java:60)
        at org.apache.lucene.queryparser.flexible.messages.TestNLS.testNLSLoading_ja(TestNLS.java:66)
        at sun.reflect.NativeMethodAccessorImpl.invoke0(Native Method)
        at sun.reflect.NativeMethodAccessorImpl.invoke(NativeMethodAccessorImpl.java:57)
        at sun.reflect.DelegatingMethodAccessorImpl.invoke(DelegatingMethodAccessorImpl.java:43)
        at java.lang.reflect.Method.invoke(Method.java:616)
        at org.junit.runners.model.FrameworkMethod$1.runReflectiveCall(FrameworkMethod.java:44)
        at org.junit.internal.runners.model.ReflectiveCallable.run(ReflectiveCallable.java:15)
        at org.junit.runners.model.FrameworkMethod.invokeExplosively(FrameworkMethod.java:41)
        at org.junit.internal.runners.statements.InvokeMethod.evaluate(InvokeMethod.java:20)
        at org.junit.rules.TestWatchman$1.evaluate(TestWatchman.java:48)
        at
org.apache.lucene.util.LuceneTestCase$3$1.evaluate(LuceneTestCase.java:528)
        at org.junit.internal.runners.statements.RunBefores.evaluate(RunBefores.java:28)
        at org.junit.internal.runners.statements.RunAfters.evaluate(RunAfters.java:31)
        at org.junit.runners.BlockJUnit4ClassRunner.runChild(BlockJUnit4ClassRunner.java:76)
        at org.apache.lucene.util.LuceneTestCaseRunner.runChild(LuceneTestCaseRunner.java:165)
        at org.apache.lucene.util.LuceneTestCaseRunner.runChild(LuceneTestCaseRunner.java:57)
        at org.junit.runners.ParentRunner$3.run(ParentRunner.java:193)
        at org.junit.runners.ParentRunner$1.schedule(ParentRunner.java:52)
        at org.junit.runners.ParentRunner.runChildren(ParentRunner.java:191)
        at org.junit.runners.ParentRunner.access$000(ParentRunner.java:42)
        at org.junit.runners.ParentRunner$2.evaluate(ParentRunner.java:184)
        at org.junit.internal.runners.statements.RunBefores.evaluate(RunBefores.java:28)
        at
org.junit.internal.runners.statements.RunAfters.evaluate(RunAfters.java:31)
        at org.junit.runners.ParentRunner.run(ParentRunner.java:236)
        at org.apache.maven.surefire.junit4.JUnit4TestSet.execute(JUnit4TestSet.java:53)
        at org.apache.maven.surefire.junit4.JUnit4Provider.executeTestSet(JUnit4Provider.java:123)
        at org.apache.maven.surefire.junit4.JUnit4Provider.invoke(JUnit4Provider.java:104)
        at sun.reflect.NativeMethodAccessorImpl.invoke0(Native Method)
        at sun.reflect.NativeMethodAccessorImpl.invoke(NativeMethodAccessorImpl.java:57)
        at sun.reflect.DelegatingMethodAccessorImpl.invoke(DelegatingMethodAccessorImpl.java:43)
        at java.lang.reflect.Method.invoke(Method.java:616)
        at org.apache.maven.surefire.util.ReflectionUtils.invokeMethodWithArray(ReflectionUtils.java:164)
        at org.apache.maven.surefire.booter.ProviderFactory$ProviderProxy.invoke(ProviderFactory.java:110)
        at
org.apache.maven.surefire.booter.SurefireStarter.invokeProvider(SurefireStarter.java:175)
        at org.apache.maven.surefire.booter.SurefireStarter.runSuitesInProcessWhenForked(SurefireStarter.java:107)
        at org.apache.maven.surefire.booter.ForkedBooter.main(ForkedBooter.java:68)


FAILED:  org.apache.lucene.queryparser.flexible.messages.TestNLS.testMissingMessage

Error Message:
Can't find bundle for base name org.apache.lucene.queryparser.flexible.core.messages.QueryParserMessages,
locale en

Stack Trace:
java.util.MissingResourceException: Can't find bundle for base name org.apache.lucene.queryparser.flexible.core.messages.QueryParserMessages,
locale en
        at java.util.ResourceBundle.throwMissingResourceException(ResourceBundle.java:1539)
        at java.util.ResourceBundle.getBundleImpl(ResourceBundle.java:1278)
        at java.util.ResourceBundle.getBundle(ResourceBundle.java:805)
        at
org.apache.lucene.queryparser.flexible.messages.NLS.getResourceBundleObject(NLS.java:109)
        at org.apache.lucene.queryparser.flexible.messages.NLS.getLocalizedMessage(NLS.java:60)
        at org.apache.lucene.queryparser.flexible.messages.TestNLS.testMissingMessage(TestNLS.java:100)
        at sun.reflect.NativeMethodAccessorImpl.invoke0(Native Method)
        at sun.reflect.NativeMethodAccessorImpl.invoke(NativeMethodAccessorImpl.java:57)
        at sun.reflect.DelegatingMethodAccessorImpl.invoke(DelegatingMethodAccessorImpl.java:43)
        at java.lang.reflect.Method.invoke(Method.java:616)
        at org.junit.runners.model.FrameworkMethod$1.runReflectiveCall(FrameworkMethod.java:44)
        at org.junit.internal.runners.model.ReflectiveCallable.run(ReflectiveCallable.java:15)
        at org.junit.runners.model.FrameworkMethod.invokeExplosively(FrameworkMethod.java:41)
        at org.junit.internal.runners.statements.InvokeMethod.evaluate(InvokeMethod.java:20)
        at
org.junit.rules.TestWatchman$1.evaluate(TestWatchman.java:48)
        at org.apache.lucene.util.LuceneTestCase$3$1.evaluate(LuceneTestCase.java:528)
        at org.junit.internal.runners.statements.RunBefores.evaluate(RunBefores.java:28)
        at org.junit.internal.runners.statements.RunAfters.evaluate(RunAfters.java:31)
        at org.junit.runners.BlockJUnit4ClassRunner.runChild(BlockJUnit4ClassRunner.java:76)
        at org.apache.lucene.util.LuceneTestCaseRunner.runChild(LuceneTestCaseRunner.java:165)
        at org.apache.lucene.util.LuceneTestCaseRunner.runChild(LuceneTestCaseRunner.java:57)
        at org.junit.runners.ParentRunner$3.run(ParentRunner.java:193)
        at org.junit.runners.ParentRunner$1.schedule(ParentRunner.java:52)
        at org.junit.runners.ParentRunner.runChildren(ParentRunner.java:191)
        at org.junit.runners.ParentRunner.access$000(ParentRunner.java:42)
        at org.junit.runners.ParentRunner$2.evaluate(ParentRunner.java:184)
        at
org.junit.internal.runners.statements.RunBefores.evaluate(RunBefores.java:28)
        at org.junit.internal.runners.statements.RunAfters.evaluate(RunAfters.java:31)
        at org.junit.runners.ParentRunner.run(ParentRunner.java:236)
        at org.apache.maven.surefire.junit4.JUnit4TestSet.execute(JUnit4TestSet.java:53)
        at org.apache.maven.surefire.junit4.JUnit4Provider.executeTestSet(JUnit4Provider.java:123)
        at org.apache.maven.surefire.junit4.JUnit4Provider.invoke(JUnit4Provider.java:104)
        at sun.reflect.NativeMethodAccessorImpl.invoke0(Native Method)
        at sun.reflect.NativeMethodAccessorImpl.invoke(NativeMethodAccessorImpl.java:57)
        at sun.reflect.DelegatingMethodAccessorImpl.invoke(DelegatingMethodAccessorImpl.java:43)
        at java.lang.reflect.Method.invoke(Method.java:616)
        at org.apache.maven.surefire.util.ReflectionUtils.invokeMethodWithArray(ReflectionUtils.java:164)
        at
org.apache.maven.surefire.booter.ProviderFactory$ProviderProxy.invoke(ProviderFactory.java:110)
        at org.apache.maven.surefire.booter.SurefireStarter.invokeProvider(SurefireStarter.java:175)
        at org.apache.maven.surefire.booter.SurefireStarter.runSuitesInProcessWhenForked(SurefireStarter.java:107)
        at org.apache.maven.surefire.booter.ForkedBooter.main(ForkedBooter.java:68)


FAILED:  org.apache.lucene.queryparser.flexible.messages.TestNLS.testNLSLoading

Error Message:
Can't find bundle for base name org.apache.lucene.queryparser.flexible.core.messages.QueryParserMessages,
locale en

Stack Trace:
java.util.MissingResourceException: Can't find bundle for base name org.apache.lucene.queryparser.flexible.core.messages.QueryParserMessages,
locale en
        at java.util.ResourceBundle.throwMissingResourceException(ResourceBundle.java:1539)
        at java.util.ResourceBundle.getBundleImpl(ResourceBundle.java:1278)
        at
java.util.ResourceBundle.getBundle(ResourceBundle.java:805)
        at org.apache.lucene.queryparser.flexible.messages.NLS.getResourceBundleObject(NLS.java:109)
        at org.apache.lucene.queryparser.flexible.messages.NLS.getLocalizedMessage(NLS.java:60)
        at org.apache.lucene.queryparser.flexible.messages.TestNLS.testNLSLoading(TestNLS.java:46)
        at sun.reflect.NativeMethodAccessorImpl.invoke0(Native Method)
        at sun.reflect.NativeMethodAccessorImpl.invoke(NativeMethodAccessorImpl.java:57)
        at sun.reflect.DelegatingMethodAccessorImpl.invoke(DelegatingMethodAccessorImpl.java:43)
        at java.lang.reflect.Method.invoke(Method.java:616)
        at org.junit.runners.model.FrameworkMethod$1.runReflectiveCall(FrameworkMethod.java:44)
        at org.junit.internal.runners.model.ReflectiveCallable.run(ReflectiveCallable.java:15)
        at org.junit.runners.model.FrameworkMethod.invokeExplosively(FrameworkMethod.java:41)
        at
org.junit.internal.runners.statements.InvokeMethod.evaluate(InvokeMethod.java:20)
        at org.junit.rules.TestWatchman$1.evaluate(TestWatchman.java:48)
        at org.apache.lucene.util.LuceneTestCase$3$1.evaluate(LuceneTestCase.java:528)
        at org.junit.internal.runners.statements.RunBefores.evaluate(RunBefores.java:28)
        at org.junit.internal.runners.statements.RunAfters.evaluate(RunAfters.java:31)
        at org.junit.runners.BlockJUnit4ClassRunner.runChild(BlockJUnit4ClassRunner.java:76)
        at org.apache.lucene.util.LuceneTestCaseRunner.runChild(LuceneTestCaseRunner.java:165)
        at org.apache.lucene.util.LuceneTestCaseRunner.runChild(LuceneTestCaseRunner.java:57)
        at org.junit.runners.ParentRunner$3.run(ParentRunner.java:193)
        at org.junit.runners.ParentRunner$1.schedule(ParentRunner.java:52)
        at org.junit.runners.ParentRunner.runChildren(ParentRunner.java:191)
        at org.junit.runners.ParentRunner.access$000(ParentRunner.java:42)
        at
org.junit.runners.ParentRunner$2.evaluate(ParentRunner.java:184)
        at org.junit.internal.runners.statements.RunBefores.evaluate(RunBefores.java:28)
        at org.junit.internal.runners.statements.RunAfters.evaluate(RunAfters.java:31)
        at org.junit.runners.ParentRunner.run(ParentRunner.java:236)
        at org.apache.maven.surefire.junit4.JUnit4TestSet.execute(JUnit4TestSet.java:53)
        at org.apache.maven.surefire.junit4.JUnit4Provider.executeTestSet(JUnit4Provider.java:123)
        at org.apache.maven.surefire.junit4.JUnit4Provider.invoke(JUnit4Provider.java:104)
        at sun.reflect.NativeMethodAccessorImpl.invoke0(Native Method)
        at sun.reflect.NativeMethodAccessorImpl.invoke(NativeMethodAccessorImpl.java:57)
        at sun.reflect.DelegatingMethodAccessorImpl.invoke(DelegatingMethodAccessorImpl.java:43)
        at java.lang.reflect.Method.invoke(Method.java:616)
        at org.apache.maven.surefire.util.ReflectionUtils.invokeMethodWithArray(ReflectionUtils.java:164)<
 br
/>      at org.apache.maven.surefire.booter.ProviderFactory$ProviderProxy.invoke(ProviderFactory.java:110)
        at org.apache.maven.surefire.booter.SurefireStarter.invokeProvider(SurefireStarter.java:175)
        at org.apache.maven.surefire.booter.SurefireStarter.runSuitesInProcessWhenForked(SurefireStarter.java:107)
        at org.apache.maven.surefire.booter.ForkedBooter.main(ForkedBooter.java:68)


FAILED:  org.apache.lucene.queryparser.flexible.messages.TestNLS.testNLSLoading_xx_XX

Error Message:
Can't find bundle for base name org.apache.lucene.queryparser.flexible.core.messages.QueryParserMessages,
locale xx_XX

Stack Trace:
java.util.MissingResourceException: Can't find bundle for base name org.apache.lucene.queryparser.flexible.core.messages.QueryParserMessages,
locale xx_XX
        at java.util.ResourceBundle.throwMissingResourceException(ResourceBundle.java:1539)
        at
java.util.ResourceBundle.getBundleImpl(ResourceBundle.java:1278)
        at java.util.ResourceBundle.getBundle(ResourceBundle.java:805)
        at org.apache.lucene.queryparser.flexible.messages.NLS.getResourceBundleObject(NLS.java:109)
        at org.apache.lucene.queryparser.flexible.messages.NLS.getLocalizedMessage(NLS.java:60)
        at org.apache.lucene.queryparser.flexible.messages.TestNLS.testNLSLoading_xx_XX(TestNLS.java:78)
        at sun.reflect.NativeMethodAccessorImpl.invoke0(Native Method)
        at sun.reflect.NativeMethodAccessorImpl.invoke(NativeMethodAccessorImpl.java:57)
        at sun.reflect.DelegatingMethodAccessorImpl.invoke(DelegatingMethodAccessorImpl.java:43)
        at java.lang.reflect.Method.invoke(Method.java:616)
        at org.junit.runners.model.FrameworkMethod$1.runReflectiveCall(FrameworkMethod.java:44)
        at org.junit.internal.runners.model.ReflectiveCallable.run(ReflectiveCallable.java:15)
        at
org.junit.runners.model.FrameworkMethod.invokeExplosively(FrameworkMethod.java:41)
        at org.junit.internal.runners.statements.InvokeMethod.evaluate(InvokeMethod.java:20)
        at org.junit.rules.TestWatchman$1.evaluate(TestWatchman.java:48)
        at org.apache.lucene.util.LuceneTestCase$3$1.evaluate(LuceneTestCase.java:528)
        at org.junit.internal.runners.statements.RunBefores.evaluate(RunBefores.java:28)
        at org.junit.internal.runners.statements.RunAfters.evaluate(RunAfters.java:31)
        at org.junit.runners.BlockJUnit4ClassRunner.runChild(BlockJUnit4ClassRunner.java:76)
        at org.apache.lucene.util.LuceneTestCaseRunner.runChild(LuceneTestCaseRunner.java:165)
        at org.apache.lucene.util.LuceneTestCaseRunner.runChild(LuceneTestCaseRunner.java:57)
        at org.junit.runners.ParentRunner$3.run(ParentRunner.java:193)
        at org.junit.runners.ParentRunner$1.schedule(ParentRunner.java:52)
        at org.junit.runners.ParentRunner.runChildren(ParentRunner.java:
 191)
        at org.junit.runners.ParentRunner.access$000(ParentRunner.java:42)
        at org.junit.runners.ParentRunner$2.evaluate(ParentRunner.java:184)
        at org.junit.internal.runners.statements.RunBefores.evaluate(RunBefores.java:28)
        at org.junit.internal.runners.statements.RunAfters.evaluate(RunAfters.java:31)
        at org.junit.runners.ParentRunner.run(ParentRunner.java:236)
        at org.apache.maven.surefire.junit4.JUnit4TestSet.execute(JUnit4TestSet.java:53)
        at org.apache.maven.surefire.junit4.JUnit4Provider.executeTestSet(JUnit4Provider.java:123)
        at org.apache.maven.surefire.junit4.JUnit4Provider.invoke(JUnit4Provider.java:104)
        at sun.reflect.NativeMethodAccessorImpl.invoke0(Native Method)
        at sun.reflect.NativeMethodAccessorImpl.invoke(NativeMethodAccessorImpl.java:57)
        at sun.reflect.DelegatingMethodAccessorImpl.invoke(DelegatingMethodAccessorImpl.java:43)
        at java.lang.reflect.Method.invoke(Method.java:616)
        at
org.apache.maven.surefire.util.ReflectionUtils.invokeMethodWithArray(ReflectionUtils.java:164)
        at org.apache.maven.surefire.booter.ProviderFactory$ProviderProxy.invoke(ProviderFactory.java:110)
        at org.apache.maven.surefire.booter.SurefireStarter.invokeProvider(SurefireStarter.java:175)
        at org.apache.maven.surefire.booter.SurefireStarter.runSuitesInProcessWhenForked(SurefireStarter.java:107)
        at org.apache.maven.surefire.booter.ForkedBooter.main(ForkedBooter.java:68)


FAILED:  org.apache.lucene.queryparser.flexible.messages.TestNLS.testMessageLoading

Error Message:
Can't find bundle for base name org.apache.lucene.queryparser.flexible.core.messages.QueryParserMessages,
locale en

Stack Trace:
java.util.MissingResourceException: Can't find bundle for base name org.apache.lucene.queryparser.flexible.core.messages.QueryParserMessages,
locale en
        at
java.util.ResourceBundle.throwMissingResourceException(ResourceBundle.java:1539)
        at java.util.ResourceBundle.getBundleImpl(ResourceBundle.java:1278)
        at java.util.ResourceBundle.getBundle(ResourceBundle.java:805)
        at org.apache.lucene.queryparser.flexible.messages.NLS.getResourceBundleObject(NLS.java:109)
        at org.apache.lucene.queryparser.flexible.messages.NLS.getLocalizedMessage(NLS.java:60)
        at org.apache.lucene.queryparser.flexible.messages.NLS.getLocalizedMessage(NLS.java:70)
        at org.apache.lucene.queryparser.flexible.messages.MessageImpl.getLocalizedMessage(MessageImpl.java:55)
        at org.apache.lucene.queryparser.flexible.messages.TestNLS.testMessageLoading(TestNLS.java:35)
        at sun.reflect.NativeMethodAccessorImpl.invoke0(Native Method)
        at sun.reflect.NativeMethodAccessorImpl.invoke(NativeMethodAccessorImpl.java:57)
        at sun.reflect.DelegatingMethodAccessorImpl.invoke(DelegatingMethodAccessorImpl.java:43)
        at
java.lang.reflect.Method.invoke(Method.java:616)
        at org.junit.runners.model.FrameworkMethod$1.runReflectiveCall(FrameworkMethod.java:44)
        at org.junit.internal.runners.model.ReflectiveCallable.run(ReflectiveCallable.java:15)
        at org.junit.runners.model.FrameworkMethod.invokeExplosively(FrameworkMethod.java:41)
        at org.junit.internal.runners.statements.InvokeMethod.evaluate(InvokeMethod.java:20)
        at org.junit.rules.TestWatchman$1.evaluate(TestWatchman.java:48)
        at org.apache.lucene.util.LuceneTestCase$3$1.evaluate(LuceneTestCase.java:528)
        at org.junit.internal.runners.statements.RunBefores.evaluate(RunBefores.java:28)
        at org.junit.internal.runners.statements.RunAfters.evaluate(RunAfters.java:31)
        at org.junit.runners.BlockJUnit4ClassRunner.runChild(BlockJUnit4ClassRunner.java:76)
        at org.apache.lucene.util.LuceneTestCaseRunner.runChild(LuceneTestCaseRunner.java:165)
        at
org.apache.lucene.util.LuceneTestCaseRunner.runChild(LuceneTestCaseRunner.java:57)
        at org.junit.runners.ParentRunner$3.run(ParentRunner.java:193)
        at org.junit.runners.ParentRunner$1.schedule(ParentRunner.java:52)
        at org.junit.runners.ParentRunner.runChildren(ParentRunner.java:191)
        at org.junit.runners.ParentRunner.access$000(ParentRunner.java:42)
        at org.junit.runners.ParentRunner$2.evaluate(ParentRunner.java:184)
        at org.junit.internal.runners.statements.RunBefores.evaluate(RunBefores.java:28)
        at org.junit.internal.runners.statements.RunAfters.evaluate(RunAfters.java:31)
        at org.junit.runners.ParentRunner.run(ParentRunner.java:236)
        at org.apache.maven.surefire.junit4.JUnit4TestSet.execute(JUnit4TestSet.java:53)
        at org.apache.maven.surefire.junit4.JUnit4Provider.executeTestSet(JUnit4Provider.java:123)
        at org.apache.maven.surefire.junit4.JUnit4Provider.invoke(JUnit4Provider.java:104)
        at
sun.reflect.NativeMethodAccessorImpl.invoke0(Native Method)
        at sun.reflect.NativeMethodAccessorImpl.invoke(NativeMethodAccessorImpl.java:57)
        at sun.reflect.DelegatingMethodAccessorImpl.invoke(DelegatingMethodAccessorImpl.java:43)
        at java.lang.reflect.Method.invoke(Method.java:616)
        at org.apache.maven.surefire.util.ReflectionUtils.invokeMethodWithArray(ReflectionUtils.java:164)
        at org.apache.maven.surefire.booter.ProviderFactory$ProviderProxy.invoke(ProviderFactory.java:110)
        at org.apache.maven.surefire.booter.SurefireStarter.invokeProvider(SurefireStarter.java:175)
        at org.apache.maven.surefire.booter.SurefireStarter.runSuitesInProcessWhenForked(SurefireStarter.java:107)
        at org.apache.maven.surefire.booter.ForkedBooter.main(ForkedBooter.java:68)


FAILED:  org.apache.lucene.queryparser.flexible.messages.TestNLS.testMessageLoading_ja

Error Message:
Can't find bundle for base name
org.apache.lucene.queryparser.flexible.core.messages.QueryParserMessages, locale ja

Stack Trace:
java.util.MissingResourceException: Can't find bundle for base name org.apache.lucene.queryparser.flexible.core.messages.QueryParserMessages,
locale ja
        at java.util.ResourceBundle.throwMissingResourceException(ResourceBundle.java:1539)
        at java.util.ResourceBundle.getBundleImpl(ResourceBundle.java:1278)
        at java.util.ResourceBundle.getBundle(ResourceBundle.java:805)
        at org.apache.lucene.queryparser.flexible.messages.NLS.getResourceBundleObject(NLS.java:109)
        at org.apache.lucene.queryparser.flexible.messages.NLS.getLocalizedMessage(NLS.java:60)
        at org.apache.lucene.queryparser.flexible.messages.NLS.getLocalizedMessage(NLS.java:70)
        at org.apache.lucene.queryparser.flexible.messages.MessageImpl.getLocalizedMessage(MessageImpl.java:55)
        at
org.apache.lucene.queryparser.flexible.messages.TestNLS.testMessageLoading_ja(TestNLS.java:41)
        at sun.reflect.NativeMethodAccessorImpl.invoke0(Native Method)
        at sun.reflect.NativeMethodAccessorImpl.invoke(NativeMethodAccessorImpl.java:57)
        at sun.reflect.DelegatingMethodAccessorImpl.invoke(DelegatingMethodAccessorImpl.java:43)
        at java.lang.reflect.Method.invoke(Method.java:616)
        at org.junit.runners.model.FrameworkMethod$1.runReflectiveCall(FrameworkMethod.java:44)
        at org.junit.internal.runners.model.ReflectiveCallable.run(ReflectiveCallable.java:15)
        at org.junit.runners.model.FrameworkMethod.invokeExplosively(FrameworkMethod.java:41)
        at org.junit.internal.runners.statements.InvokeMethod.evaluate(InvokeMethod.java:20)
        at org.junit.rules.TestWatchman$1.evaluate(TestWatchman.java:48)
        at org.apache.lucene.util.LuceneTestCase$3$1.evaluate(LuceneTestCase.java:528)
        at
org.junit.internal.runners.statements.RunBefores.evaluate(RunBefores.java:28)
        at org.junit.internal.runners.statements.RunAfters.evaluate(RunAfters.java:31)
        at org.junit.runners.BlockJUnit4ClassRunner.runChild(BlockJUnit4ClassRunner.java:76)
        at org.apache.lucene.util.LuceneTestCaseRunner.runChild(LuceneTestCaseRunner.java:165)
        at org.apache.lucene.util.LuceneTestCaseRunner.runChild(LuceneTestCaseRunner.java:57)
        at org.junit.runners.ParentRunner$3.run(ParentRunner.java:193)
        at org.junit.runners.ParentRunner$1.schedule(ParentRunner.java:52)
        at org.junit.runners.ParentRunner.runChildren(ParentRunner.java:191)
        at org.junit.runners.ParentRunner.access$000(ParentRunner.java:42)
        at org.junit.runners.ParentRunner$2.evaluate(ParentRunner.java:184)
        at org.junit.internal.runners.statements.RunBefores.evaluate(RunBefores.java:28)
        at org.junit.internal.runners.statements.RunAfters.evaluate(RunAfters.java:31)
        at
org.junit.runners.ParentRunner.run(ParentRunner.java:236)
        at org.apache.maven.surefire.junit4.JUnit4TestSet.execute(JUnit4TestSet.java:53)
        at org.apache.maven.surefire.junit4.JUnit4Provider.executeTestSet(JUnit4Provider.java:123)
        at org.apache.maven.surefire.junit4.JUnit4Provider.invoke(JUnit4Provider.java:104)
        at sun.reflect.NativeMethodAccessorImpl.invoke0(Native Method)
        at sun.reflect.NativeMethodAccessorImpl.invoke(NativeMethodAccessorImpl.java:57)
        at sun.reflect.DelegatingMethodAccessorImpl.invoke(DelegatingMethodAccessorImpl.java:43)
        at java.lang.reflect.Method.invoke(Method.java:616)
        at org.apache.maven.surefire.util.ReflectionUtils.invokeMethodWithArray(ReflectionUtils.java:164)
        at org.apache.maven.surefire.booter.ProviderFactory$ProviderProxy.invoke(ProviderFactory.java:110)
        at org.apache.maven.surefire.booter.SurefireStarter.invokeProvider(SurefireStarter.java:175)
        at
org.apache.maven.surefire.booter.SurefireStarter.runSuitesInProcessWhenForked(SurefireStarter.java:107)
        at org.apache.maven.surefire.booter.ForkedBooter.main(ForkedBooter.java:68)




Build Log (for compile errors):
[...truncated 24827 lines...]



________________________________

To unsubscribe, e-mail: dev-unsubscribe@lucene.apache.org
For additional commands, e-mail: dev-help@lucene.apache.org


Mime
View raw message