lucene-dev mailing list archives

Site index · List index
Message view « Date » · « Thread »
Top « Date » · « Thread »
From Robert Muir <rcm...@gmail.com>
Subject Re: [JENKINS] Lucene-Solr-tests-only-trunk - Build # 11611 - Failure
Date Thu, 01 Dec 2011 13:19:13 GMT
Jenkins didn't read my email to the dev list :)

On Thu, Dec 1, 2011 at 8:09 AM, Apache Jenkins Server
<jenkins@builds.apache.org> wrote:
> Build: https://builds.apache.org/job/Lucene-Solr-tests-only-trunk/11611/
>
> 5 tests failed.
> REGRESSION:  org.apache.solr.core.TestCoreContainer.testPersist
>
> Error Message:
> org.apache.lucene.index.CorruptIndexException: checksum mismatch in segments file (resource:
ChecksumIndexInput(MockIndexInputWrapper(NIOFSIndexInput(path="/usr/home/hudson/hudson-slave/workspace/Lucene-Solr-tests-only-trunk/checkout/solr/build/solr-core/test/8/org.apache.solr.core.TestCoreContainer_persist/instY/data/index/segments_1"))))
>
> Stack Trace:
> java.lang.RuntimeException: org.apache.lucene.index.CorruptIndexException: checksum mismatch
in segments file (resource: ChecksumIndexInput(MockIndexInputWrapper(NIOFSIndexInput(path="/usr/home/hudson/hudson-slave/workspace/Lucene-Solr-tests-only-trunk/checkout/solr/build/solr-core/test/8/org.apache.solr.core.TestCoreContainer_persist/instY/data/index/segments_1"))))
>        at org.apache.solr.core.SolrCore.getSearcher(SolrCore.java:1160)
>        at org.apache.solr.core.SolrCore.getSearcher(SolrCore.java:1014)
>        at org.apache.solr.core.SolrCore.<init>(SolrCore.java:603)
>        at org.apache.solr.core.SolrCore.<init>(SolrCore.java:509)
>        at org.apache.solr.core.CoreContainer.create(CoreContainer.java:653)
>        at org.apache.solr.core.TestCoreContainer.testPersist(TestCoreContainer.java:95)
>        at org.apache.lucene.util.LuceneTestCase$3$1.evaluate(LuceneTestCase.java:521)
>        at org.apache.lucene.util.LuceneTestCaseRunner.runChild(LuceneTestCaseRunner.java:149)
>        at org.apache.lucene.util.LuceneTestCaseRunner.runChild(LuceneTestCaseRunner.java:51)
> Caused by: org.apache.lucene.index.CorruptIndexException: checksum mismatch in segments
file (resource: ChecksumIndexInput(MockIndexInputWrapper(NIOFSIndexInput(path="/usr/home/hudson/hudson-slave/workspace/Lucene-Solr-tests-only-trunk/checkout/solr/build/solr-core/test/8/org.apache.solr.core.TestCoreContainer_persist/instY/data/index/segments_1"))))
>        at org.apache.lucene.index.SegmentInfos.read(SegmentInfos.java:260)
>        at org.apache.lucene.index.DirectoryReader$1.doBody(DirectoryReader.java:84)
>        at org.apache.lucene.index.SegmentInfos$FindSegmentsFile.run(SegmentInfos.java:672)
>        at org.apache.lucene.index.DirectoryReader.open(DirectoryReader.java:80)
>        at org.apache.lucene.index.IndexReader.open(IndexReader.java:467)
>        at org.apache.lucene.index.IndexReader.open(IndexReader.java:410)
>        at org.apache.solr.core.StandardIndexReaderFactory.newReader(StandardIndexReaderFactory.java:38)
>        at org.apache.solr.search.SolrIndexSearcher.<init>(SolrIndexSearcher.java:112)
>        at org.apache.solr.core.SolrCore.getSearcher(SolrCore.java:1149)
>
>
> REGRESSION:  org.apache.solr.handler.admin.CoreAdminHandlerTest.testCoreAdminHandler
>
> Error Message:
> Error executing default implementation of CREATE
>
> Stack Trace:
> org.apache.solr.common.SolrException: Error executing default implementation of CREATE
>        at org.apache.solr.handler.admin.CoreAdminHandler.handleCreateAction(CoreAdminHandler.java:345)
>        at org.apache.solr.handler.admin.CoreAdminHandler.handleRequestBody(CoreAdminHandler.java:119)
>        at org.apache.solr.handler.admin.CoreAdminHandlerTest.testCoreAdminHandler(CoreAdminHandlerTest.java:77)
>        at org.apache.lucene.util.LuceneTestCase$3$1.evaluate(LuceneTestCase.java:521)
>        at org.apache.lucene.util.LuceneTestCaseRunner.runChild(LuceneTestCaseRunner.java:149)
>        at org.apache.lucene.util.LuceneTestCaseRunner.runChild(LuceneTestCaseRunner.java:51)
> Caused by: java.lang.RuntimeException: org.apache.lucene.index.CorruptIndexException:
checksum mismatch in segments file (resource: ChecksumIndexInput(MockIndexInputWrapper(SimpleFSIndexInput(path="/usr/home/hudson/hudson-slave/workspace/Lucene-Solr-tests-only-trunk/checkout/solr/build/solr-core/test/3/org.apache.solr.handler.admin.CoreAdminHandlerTest/instProp/data/index/segments_1"))))
>        at org.apache.solr.core.SolrCore.getSearcher(SolrCore.java:1160)
>        at org.apache.solr.core.SolrCore.getSearcher(SolrCore.java:1014)
>        at org.apache.solr.core.SolrCore.<init>(SolrCore.java:603)
>        at org.apache.solr.core.SolrCore.<init>(SolrCore.java:509)
>        at org.apache.solr.core.CoreContainer.create(CoreContainer.java:653)
>        at org.apache.solr.handler.admin.CoreAdminHandler.handleCreateAction(CoreAdminHandler.java:340)
> Caused by: org.apache.lucene.index.CorruptIndexException: checksum mismatch in segments
file (resource: ChecksumIndexInput(MockIndexInputWrapper(SimpleFSIndexInput(path="/usr/home/hudson/hudson-slave/workspace/Lucene-Solr-tests-only-trunk/checkout/solr/build/solr-core/test/3/org.apache.solr.handler.admin.CoreAdminHandlerTest/instProp/data/index/segments_1"))))
>        at org.apache.lucene.index.SegmentInfos.read(SegmentInfos.java:260)
>        at org.apache.lucene.index.DirectoryReader$1.doBody(DirectoryReader.java:84)
>        at org.apache.lucene.index.SegmentInfos$FindSegmentsFile.run(SegmentInfos.java:672)
>        at org.apache.lucene.index.DirectoryReader.open(DirectoryReader.java:80)
>        at org.apache.lucene.index.IndexReader.open(IndexReader.java:467)
>        at org.apache.lucene.index.IndexReader.open(IndexReader.java:410)
>        at org.apache.solr.core.StandardIndexReaderFactory.newReader(StandardIndexReaderFactory.java:38)
>        at org.apache.solr.search.SolrIndexSearcher.<init>(SolrIndexSearcher.java:112)
>        at org.apache.solr.core.SolrCore.getSearcher(SolrCore.java:1149)
>
>
> REGRESSION:  org.apache.solr.servlet.NoCacheHeaderTest.testEtag
>
> Error Message:
> Unknown request response expected:<0> but was:<500>
>
> Stack Trace:
> junit.framework.AssertionFailedError: Unknown request response expected:<0> but
was:<500>
>        at org.apache.lucene.util.LuceneTestCaseRunner.runChild(LuceneTestCaseRunner.java:149)
>        at org.apache.lucene.util.LuceneTestCaseRunner.runChild(LuceneTestCaseRunner.java:51)
>        at org.apache.solr.servlet.CacheHeaderTestBase.checkResponseBody(CacheHeaderTestBase.java:85)
>        at org.apache.solr.servlet.NoCacheHeaderTest.doETag(NoCacheHeaderTest.java:116)
>        at org.apache.solr.servlet.NoCacheHeaderTest.testEtag(NoCacheHeaderTest.java:48)
>        at org.apache.lucene.util.LuceneTestCase$3$1.evaluate(LuceneTestCase.java:521)
>
>
> REGRESSION:  org.apache.solr.servlet.NoCacheHeaderTest.testLastModified
>
> Error Message:
> Unknown request response expected:<0> but was:<500>
>
> Stack Trace:
> junit.framework.AssertionFailedError: Unknown request response expected:<0> but
was:<500>
>        at org.apache.lucene.util.LuceneTestCaseRunner.runChild(LuceneTestCaseRunner.java:149)
>        at org.apache.lucene.util.LuceneTestCaseRunner.runChild(LuceneTestCaseRunner.java:51)
>        at org.apache.solr.servlet.CacheHeaderTestBase.checkResponseBody(CacheHeaderTestBase.java:85)
>        at org.apache.solr.servlet.NoCacheHeaderTest.doLastModified(NoCacheHeaderTest.java:66)
>        at org.apache.solr.servlet.NoCacheHeaderTest.testLastModified(NoCacheHeaderTest.java:41)
>        at org.apache.lucene.util.LuceneTestCase$3$1.evaluate(LuceneTestCase.java:521)
>
>
> REGRESSION:  org.apache.solr.servlet.NoCacheHeaderTest.testCacheControl
>
> Error Message:
> Unknown request response expected:<0> but was:<500>
>
> Stack Trace:
> junit.framework.AssertionFailedError: Unknown request response expected:<0> but
was:<500>
>        at org.apache.lucene.util.LuceneTestCaseRunner.runChild(LuceneTestCaseRunner.java:149)
>        at org.apache.lucene.util.LuceneTestCaseRunner.runChild(LuceneTestCaseRunner.java:51)
>        at org.apache.solr.servlet.CacheHeaderTestBase.checkResponseBody(CacheHeaderTestBase.java:85)
>        at org.apache.solr.servlet.NoCacheHeaderTest.doCacheControl(NoCacheHeaderTest.java:165)
>        at org.apache.solr.servlet.NoCacheHeaderTest.testCacheControl(NoCacheHeaderTest.java:55)
>        at org.apache.lucene.util.LuceneTestCase$3$1.evaluate(LuceneTestCase.java:521)
>
>
>
>
> Build Log (for compile errors):
> [...truncated 8736 lines...]
>
>
>
> ---------------------------------------------------------------------
> To unsubscribe, e-mail: dev-unsubscribe@lucene.apache.org
> For additional commands, e-mail: dev-help@lucene.apache.org
>
>



-- 
lucidimagination.com

---------------------------------------------------------------------
To unsubscribe, e-mail: dev-unsubscribe@lucene.apache.org
For additional commands, e-mail: dev-help@lucene.apache.org


Mime
View raw message