lucene-dev mailing list archives

Site index · List index
Message view « Date » · « Thread »
Top « Date » · « Thread »
From Robert Muir <rcm...@gmail.com>
Subject Re: [JENKINS] Lucene-Solr-tests-only-trunk - Build # 11727 - Failure
Date Fri, 09 Dec 2011 12:47:20 GMT
I'm looking into this: this test doesn't use that many documents...

On Fri, Dec 9, 2011 at 7:35 AM, Apache Jenkins Server
<jenkins@builds.apache.org> wrote:
> Build: https://builds.apache.org/job/Lucene-Solr-tests-only-trunk/11727/
>
> 3 tests failed.
> REGRESSION:  org.apache.lucene.index.TestDuelingCodecs.testEquals
>
> Error Message:
> Java heap space
>
> Stack Trace:
> java.lang.OutOfMemoryError: Java heap space
>        at org.apache.lucene.util.fst.FST.<init>(FST.java:232)
>        at org.apache.lucene.index.codecs.memory.MemoryPostingsFormat$TermsReader.<init>(MemoryPostingsFormat.java:709)
>        at org.apache.lucene.index.codecs.memory.MemoryPostingsFormat.fieldsProducer(MemoryPostingsFormat.java:756)
>        at org.apache.lucene.index.codecs.perfield.PerFieldPostingsFormat$FieldsReader$1.visitOneFormat(PerFieldPostingsFormat.java:189)
>        at org.apache.lucene.index.codecs.perfield.PerFieldPostingsFormat$VisitPerFieldFile.<init>(PerFieldPostingsFormat.java:280)
>        at org.apache.lucene.index.codecs.perfield.PerFieldPostingsFormat$FieldsReader$1.<init>(PerFieldPostingsFormat.java:186)
>        at org.apache.lucene.index.codecs.perfield.PerFieldPostingsFormat$FieldsReader.<init>(PerFieldPostingsFormat.java:186)
>        at org.apache.lucene.index.codecs.perfield.PerFieldPostingsFormat.fieldsProducer(PerFieldPostingsFormat.java:256)
>        at org.apache.lucene.index.SegmentCoreReaders.<init>(SegmentCoreReaders.java:95)
>        at org.apache.lucene.index.SegmentReader.get(SegmentReader.java:101)
>        at org.apache.lucene.index.SegmentReader.getRW(SegmentReader.java:84)
>        at org.apache.lucene.index.IndexWriter$ReaderPool.get(IndexWriter.java:701)
>        at org.apache.lucene.index.IndexWriter$ReaderPool.get(IndexWriter.java:682)
>        at org.apache.lucene.index.IndexWriter.mergeMiddle(IndexWriter.java:3480)
>        at org.apache.lucene.index.IndexWriter.merge(IndexWriter.java:3139)
>        at org.apache.lucene.index.SerialMergeScheduler.merge(SerialMergeScheduler.java:37)
>        at org.apache.lucene.index.IndexWriter.maybeMerge(IndexWriter.java:1850)
>        at org.apache.lucene.index.IndexWriter.maybeMerge(IndexWriter.java:1844)
>        at org.apache.lucene.index.IndexWriter.updateDocument(IndexWriter.java:1494)
>        at org.apache.lucene.index.IndexWriter.addDocument(IndexWriter.java:1245)
>        at org.apache.lucene.index.IndexWriter.addDocument(IndexWriter.java:1226)
>        at org.apache.lucene.index.RandomIndexWriter.addDocument(RandomIndexWriter.java:162)
>        at org.apache.lucene.index.TestDuelingCodecs.createRandomIndex(TestDuelingCodecs.java:129)
>        at org.apache.lucene.index.TestDuelingCodecs.setUp(TestDuelingCodecs.java:98)
>
>
> FAILED:  junit.framework.TestSuite.org.apache.lucene.index.TestDuelingCodecs
>
> Error Message:
> java.lang.AssertionError: ensure your setUp() calls super.setUp() and your tearDown()
calls super.tearDown()!!!
>
> Stack Trace:
> java.lang.RuntimeException: java.lang.AssertionError: ensure your setUp() calls super.setUp()
and your tearDown() calls super.tearDown()!!!
>        at org.apache.lucene.util.LuceneTestCase.afterClassLuceneTestCaseJ4(LuceneTestCase.java:405)
>        at org.apache.lucene.util.LuceneTestCase.afterClassLuceneTestCaseJ4(LuceneTestCase.java:347)
>
>
> REGRESSION:  org.apache.lucene.util.automaton.TestDeterminizeLexicon.testLexicon
>
> Error Message:
> Java heap space
>
> Stack Trace:
> java.lang.OutOfMemoryError: Java heap space
>        at org.apache.lucene.util.automaton.RunAutomaton.<init>(RunAutomaton.java:128)
>        at org.apache.lucene.util.automaton.ByteRunAutomaton.<init>(ByteRunAutomaton.java:28)
>        at org.apache.lucene.util.automaton.ByteRunAutomaton.<init>(ByteRunAutomaton.java:23)
>        at org.apache.lucene.util.automaton.TestDeterminizeLexicon.assertLexicon(TestDeterminizeLexicon.java:57)
>        at org.apache.lucene.util.automaton.TestDeterminizeLexicon.testLexicon(TestDeterminizeLexicon.java:45)
>        at org.apache.lucene.util.LuceneTestCase$3$1.evaluate(LuceneTestCase.java:528)
>        at org.apache.lucene.util.LuceneTestCaseRunner.runChild(LuceneTestCaseRunner.java:165)
>        at org.apache.lucene.util.LuceneTestCaseRunner.runChild(LuceneTestCaseRunner.java:57)
>
>
>
>
> Build Log (for compile errors):
> [...truncated 1546 lines...]
>
>
>
> ---------------------------------------------------------------------
> To unsubscribe, e-mail: dev-unsubscribe@lucene.apache.org
> For additional commands, e-mail: dev-help@lucene.apache.org
>



-- 
lucidimagination.com

---------------------------------------------------------------------
To unsubscribe, e-mail: dev-unsubscribe@lucene.apache.org
For additional commands, e-mail: dev-help@lucene.apache.org


Mime
View raw message