lucene-dev mailing list archives

Site index · List index
Message view « Date » · « Thread »
Top « Date » · « Thread »
From "Uwe Schindler" <...@thetaphi.de>
Subject RE: [JENKINS] Lucene-Solr-tests-only-3.x - Build # 11951 - Failure
Date Wed, 28 Dec 2011 21:34:04 GMT
Sorry, misunderstood the mail. Jenkins is fine, it’s a test problem occurring sometimes.
Last run was fine.

 

-----

Uwe Schindler

H.-H.-Meier-Allee 63, D-28213 Bremen

 <http://www.thetaphi.de/> http://www.thetaphi.de

eMail: uwe@thetaphi.de

 

From: Uwe Schindler [mailto:uwe@thetaphi.de] 
Sent: Wednesday, December 28, 2011 9:27 PM
To: dev@lucene.apache.org
Subject: Re: [JENKINS] Lucene-Solr-tests-only-3.x - Build # 11951 - Failure

 

I will check later, maybe the usual out of disk space problem.
--
Uwe Schindler
H.-H.-Meier-Allee 63, 28213 Bremen
http://www.thetaphi.de



Yonik Seeley <yonik@lucidimagination.com> schrieb:

As far as I can see, this started intermittently  failing at the start
of Dec (and only on 3x).
Anyone have an idea of what changed to cause this?

-Yonik
 <http://www.lucidimagination.com> http://www.lucidimagination.com



On Wed, Dec 28, 2011 at 3:06 PM, Apache Jenkins Server
< <mailto:jenkins@builds.apache.org> jenkins@builds.apache.org> wrote:
> Build:  <https://builds.apache.org/job/Lucene-Solr-tests-only-3.x/11951> https://builds.apache.org/job/Lucene-Solr-tests-only-3.x/11951/
>
> 2 tests failed.
> FAILED:  <http:// junit.framework.TestSuite.org>  junit.framework.TestSuite.org.apache.solr.update.processor.SignatureUpdateProcessorFactoryTest
>
> Error Message:
> Cannot delete
/usr/home/hudson/hudson-slave/workspace/Lucene-Solr-tests-only-3.x/checkout/solr/build/solr-core/test/6/solrtest-SignatureUpdateProcessorFactoryTest-1325102196221/index/_f.nrm
>
> Stack Trace:
> java.io.IOException: Cannot delete /usr/home/hudson/hudson-slave/workspace/Lucene-Solr-tests-only-3.x/checkout/solr/build/solr-core/test/6/solrtest-SignatureUpdateProcessorFactoryTest-1325102196221/index/_f.nrm
>        at org.apache.lucene.store.FSDirectory.deleteFile(FSDirectory.java:296)
>        at org.apache.lucene.store.MockDirectoryWrapper.deleteFile(MockDirectoryWrapper.java:392)
>        at org.apache.lucene.store.MockDirectoryWrapper.crash(MockDirectoryWrapper.java:265)
>        at org.apache.lucene.store.MockDirectoryWrapper.close(MockDirectoryWrapper.java:556)
>        at org.apache.solr.SolrTestCaseJ4.closeDirectories(SolrTestCaseJ4.java:82)
>       
  at
org.apache.solr.SolrTestCaseJ4.deleteCore(SolrTestCaseJ4.java:290)
>        at org.apache.solr.SolrTestCaseJ4.afterClassSolrTestCase(SolrTestCaseJ4.java:72)
>
>
> FAILED:  <http:// junit.framework.TestSuite.org>  junit.framework.TestSuite.org.apache.solr.update.processor.SignatureUpdateProcessorFactoryTest
>
> Error Message:
> java.lang.AssertionError: directory of test was not closed, opened from: org.apache.solr.core.MockDirectoryFactory.open(MockDirectoryFactory.java:34)
>
> Stack Trace:
> java.lang.RuntimeException: java.lang.AssertionError: directory of test was not closed,
opened from: org.apache.solr.core.MockDirectoryFactory.open(MockDirectoryFactory.java:34)
>        at org.apache.lucene.util.LuceneTestCase.afterClassLuceneTestCaseJ4(LuceneTestCase.java:310)
>        at
org.apache.lucene.util.LuceneTestCase.checkResourcesAfterClass(LuceneTestCase.java:349)
>        at org.apache.lucene.util.LuceneTestCase.afterClassLuceneTestCaseJ4(LuceneTestCase.java:278)
>
>
>
>
> Build Log (for compile errors):
> [...truncated 15152 lines...]
>
>
>
>

  _____  


> To unsubscribe, e-mail:  <mailto:dev-unsubscribe@lucene.apache.org> dev-unsubscribe@lucene.apache.org
> For additional commands, e-mail:  <mailto:dev-help@lucene.apache.org> dev-help@lucene.apache.org
>

  _____  


To unsubscribe, e-mail:  <mailto:dev-unsubscribe@lucene.apache.org> dev-unsubscribe@lucene.apache.org
For additional commands, e-mail:  <mailto:dev-help@lucene.apache.org> dev-help@lucene.apache.org

Mime
View raw message