lucene-dev mailing list archives

Site index · List index
Message view « Date » · « Thread »
Top « Date » · « Thread »
From Apache Jenkins Server <jenk...@builds.apache.org>
Subject [JENKINS] Lucene-trunk - Build # 1735 - Failure
Date Tue, 15 Nov 2011 04:08:33 GMT
Build: https://builds.apache.org/job/Lucene-trunk/1735/

95 tests failed.
REGRESSION:  org.apache.lucene.index.TestIndexWriterDelete.testDeleteAllRollback

Error Message:
/usr/home/hudson/hudson-slave/workspace/Lucene-trunk/checkout/lucene/build/test/8/index2175721852tmp/_4_1.skp (Too many open files in system)

Stack Trace:
java.io.FileNotFoundException: /usr/home/hudson/hudson-slave/workspace/Lucene-trunk/checkout/lucene/build/test/8/index2175721852tmp/_4_1.skp (Too many open files in system)
	at java.io.RandomAccessFile.open(Native Method)
	at java.io.RandomAccessFile.<init>(RandomAccessFile.java:233)
	at org.apache.lucene.store.FSDirectory$FSIndexOutput.<init>(FSDirectory.java:457)
	at org.apache.lucene.store.FSDirectory.createOutput(FSDirectory.java:296)
	at org.apache.lucene.store.MockDirectoryWrapper.createOutput(MockDirectoryWrapper.java:388)
	at org.apache.lucene.index.codecs.sep.SepPostingsWriter.<init>(SepPostingsWriter.java:139)
	at org.apache.lucene.index.codecs.sep.SepPostingsWriter.<init>(SepPostingsWriter.java:105)
	at org.apache.lucene.index.codecs.mockintblock.MockFixedIntBlockPostingsFormat.fieldsConsumer(MockFixedIntBlockPostingsFormat.java:129)
	at org.apache.lucene.index.codecs.perfield.PerFieldPostingsFormat$FieldsWriter.addField(PerFieldPostingsFormat.java:119)
	at org.apache.lucene.index.FreqProxTermsWriterPerField.flush(FreqProxTermsWriterPerField.java:246)
	at org.apache.lucene.index.FreqProxTermsWriter.flush(FreqProxTermsWriter.java:92)
	at org.apache.lucene.index.TermsHash.flush(TermsHash.java:117)
	at org.apache.lucene.index.DocInverter.flush(DocInverter.java:80)
	at org.apache.lucene.index.DocFieldProcessor.flush(DocFieldProcessor.java:78)
	at org.apache.lucene.index.DocumentsWriterPerThread.flush(DocumentsWriterPerThread.java:476)
	at org.apache.lucene.index.DocumentsWriter.doFlush(DocumentsWriter.java:431)
	at org.apache.lucene.index.DocumentsWriter.flushAllThreads(DocumentsWriter.java:584)
	at org.apache.lucene.index.IndexWriter.prepareCommit(IndexWriter.java:2683)
	at org.apache.lucene.index.IndexWriter.commitInternal(IndexWriter.java:2811)
	at org.apache.lucene.index.IndexWriter.commit(IndexWriter.java:2793)
	at org.apache.lucene.index.IndexWriter.commit(IndexWriter.java:2777)
	at org.apache.lucene.index.TestIndexWriterDelete.testDeleteAllRollback(TestIndexWriterDelete.java:316)
	at org.apache.lucene.util.LuceneTestCase$3$1.evaluate(LuceneTestCase.java:523)
	at org.apache.lucene.util.LuceneTestCaseRunner.runChild(LuceneTestCaseRunner.java:149)
	at org.apache.lucene.util.LuceneTestCaseRunner.runChild(LuceneTestCaseRunner.java:51)


REGRESSION:  org.apache.lucene.index.TestIndexWriterMergePolicy.testNormalCase

Error Message:
/usr/home/hudson/hudson-slave/workspace/Lucene-trunk/checkout/lucene/build/test/2/index3817338185tmp/_3_0.doc (Too many open files in system)

Stack Trace:
java.io.FileNotFoundException: /usr/home/hudson/hudson-slave/workspace/Lucene-trunk/checkout/lucene/build/test/2/index3817338185tmp/_3_0.doc (Too many open files in system)
	at java.io.RandomAccessFile.open(Native Method)
	at java.io.RandomAccessFile.<init>(RandomAccessFile.java:233)
	at org.apache.lucene.store.SimpleFSDirectory$SimpleFSIndexInput$Descriptor.<init>(SimpleFSDirectory.java:97)
	at org.apache.lucene.store.SimpleFSDirectory$SimpleFSIndexInput.<init>(SimpleFSDirectory.java:120)
	at org.apache.lucene.store.NIOFSDirectory$NIOFSIndexInput.<init>(NIOFSDirectory.java:119)
	at org.apache.lucene.store.NIOFSDirectory.openInput(NIOFSDirectory.java:81)
	at org.apache.lucene.store.MockDirectoryWrapper.openInput(MockDirectoryWrapper.java:432)
	at org.apache.lucene.index.codecs.mockintblock.MockFixedIntBlockPostingsFormat$MockIntFactory.openInput(MockFixedIntBlockPostingsFormat.java:87)
	at org.apache.lucene.index.codecs.sep.SepPostingsReader.<init>(SepPostingsReader.java:68)
	at org.apache.lucene.index.codecs.mockintblock.MockFixedIntBlockPostingsFormat.fieldsProducer(MockFixedIntBlockPostingsFormat.java:160)
	at org.apache.lucene.index.codecs.perfield.PerFieldPostingsFormat$FieldsReader$1.visitOneFormat(PerFieldPostingsFormat.java:190)
	at org.apache.lucene.index.codecs.perfield.PerFieldPostingsFormat$VisitPerFieldFile.<init>(PerFieldPostingsFormat.java:281)
	at org.apache.lucene.index.codecs.perfield.PerFieldPostingsFormat$FieldsReader$1.<init>(PerFieldPostingsFormat.java:187)
	at org.apache.lucene.index.codecs.perfield.PerFieldPostingsFormat$FieldsReader.<init>(PerFieldPostingsFormat.java:187)
	at org.apache.lucene.index.codecs.perfield.PerFieldPostingsFormat.fieldsProducer(PerFieldPostingsFormat.java:257)
	at org.apache.lucene.index.SegmentCoreReaders.<init>(SegmentCoreReaders.java:92)
	at org.apache.lucene.index.SegmentReader.get(SegmentReader.java:112)
	at org.apache.lucene.index.IndexWriter$ReaderPool.get(IndexWriter.java:701)
	at org.apache.lucene.index.IndexWriter$ReaderPool.get(IndexWriter.java:682)
	at org.apache.lucene.index.IndexWriter.mergeMiddle(IndexWriter.java:3566)
	at org.apache.lucene.index.IndexWriter.merge(IndexWriter.java:3222)
	at org.apache.lucene.index.SerialMergeScheduler.merge(SerialMergeScheduler.java:37)
	at org.apache.lucene.index.IndexWriter.maybeMerge(IndexWriter.java:1867)
	at org.apache.lucene.index.IndexWriter.maybeMerge(IndexWriter.java:1861)
	at org.apache.lucene.index.IndexWriter.updateDocument(IndexWriter.java:1502)
	at org.apache.lucene.index.IndexWriter.addDocument(IndexWriter.java:1254)
	at org.apache.lucene.index.IndexWriter.addDocument(IndexWriter.java:1235)
	at org.apache.lucene.index.TestIndexWriterMergePolicy.addDoc(TestIndexWriterMergePolicy.java:222)
	at org.apache.lucene.index.TestIndexWriterMergePolicy.testNormalCase(TestIndexWriterMergePolicy.java:41)
	at org.apache.lucene.util.LuceneTestCase$3$1.evaluate(LuceneTestCase.java:523)
	at org.apache.lucene.util.LuceneTestCaseRunner.runChild(LuceneTestCaseRunner.java:149)
	at org.apache.lucene.util.LuceneTestCaseRunner.runChild(LuceneTestCaseRunner.java:51)


REGRESSION:  org.apache.lucene.index.TestIndexWriterReader.testNoTermsIndex

Error Message:
/usr/home/hudson/hudson-slave/workspace/Lucene-trunk/checkout/lucene/build/test/8/index2175721854tmp/_0.fdx (Too many open files in system)

Stack Trace:
java.io.FileNotFoundException: /usr/home/hudson/hudson-slave/workspace/Lucene-trunk/checkout/lucene/build/test/8/index2175721854tmp/_0.fdx (Too many open files in system)
	at java.io.RandomAccessFile.open(Native Method)
	at java.io.RandomAccessFile.<init>(RandomAccessFile.java:233)
	at org.apache.lucene.store.SimpleFSDirectory$SimpleFSIndexInput$Descriptor.<init>(SimpleFSDirectory.java:97)
	at org.apache.lucene.store.SimpleFSDirectory$SimpleFSIndexInput.<init>(SimpleFSDirectory.java:120)
	at org.apache.lucene.store.SimpleFSDirectory.openInput(SimpleFSDirectory.java:59)
	at org.apache.lucene.store.MockDirectoryWrapper.openInput(MockDirectoryWrapper.java:432)
	at org.apache.lucene.index.codecs.DefaultStoredFieldsReader.<init>(DefaultStoredFieldsReader.java:128)
	at org.apache.lucene.index.codecs.DefaultStoredFieldsFormat.fieldsReader(DefaultStoredFieldsFormat.java:34)
	at org.apache.lucene.index.SegmentCoreReaders.openDocStores(SegmentCoreReaders.java:169)
	at org.apache.lucene.index.SegmentReader.get(SegmentReader.java:114)
	at org.apache.lucene.index.IndexWriter$ReaderPool.get(IndexWriter.java:701)
	at org.apache.lucene.index.IndexWriter$ReaderPool.getReadOnlyClone(IndexWriter.java:673)
	at org.apache.lucene.index.IndexWriter$ReaderPool.getReadOnlyClone(IndexWriter.java:664)
	at org.apache.lucene.index.DirectoryReader.<init>(DirectoryReader.java:157)
	at org.apache.lucene.index.IndexWriter.getReader(IndexWriter.java:365)
	at org.apache.lucene.index.IndexReader.open(IndexReader.java:350)
	at org.apache.lucene.index.TestIndexWriterReader.testNoTermsIndex(TestIndexWriterReader.java:991)
	at org.apache.lucene.util.LuceneTestCase$3$1.evaluate(LuceneTestCase.java:523)
	at org.apache.lucene.util.LuceneTestCaseRunner.runChild(LuceneTestCaseRunner.java:149)
	at org.apache.lucene.util.LuceneTestCaseRunner.runChild(LuceneTestCaseRunner.java:51)


REGRESSION:  org.apache.lucene.index.TestIndexWriterReader.testAddIndexesAndDoDeletesThreads

Error Message:
expected:<0> but was:<600>

Stack Trace:
junit.framework.AssertionFailedError: expected:<0> but was:<600>
	at org.apache.lucene.util.LuceneTestCaseRunner.runChild(LuceneTestCaseRunner.java:149)
	at org.apache.lucene.util.LuceneTestCaseRunner.runChild(LuceneTestCaseRunner.java:51)
	at org.apache.lucene.index.TestIndexWriterReader.testAddIndexesAndDoDeletesThreads(TestIndexWriterReader.java:377)
	at org.apache.lucene.util.LuceneTestCase$3$1.evaluate(LuceneTestCase.java:523)


REGRESSION:  org.apache.lucene.index.TestIndexWriterReader.testDeleteFromIndexWriter

Error Message:
/usr/home/hudson/hudson-slave/workspace/Lucene-trunk/checkout/lucene/build/test/8/index2175721856tmp/_0.tvx (Too many open files in system)

Stack Trace:
java.io.FileNotFoundException: /usr/home/hudson/hudson-slave/workspace/Lucene-trunk/checkout/lucene/build/test/8/index2175721856tmp/_0.tvx (Too many open files in system)
	at java.io.RandomAccessFile.open(Native Method)
	at java.io.RandomAccessFile.<init>(RandomAccessFile.java:233)
	at org.apache.lucene.store.FSDirectory$FSIndexOutput.<init>(FSDirectory.java:457)
	at org.apache.lucene.store.FSDirectory.createOutput(FSDirectory.java:296)
	at org.apache.lucene.store.MockDirectoryWrapper.createOutput(MockDirectoryWrapper.java:388)
	at org.apache.lucene.index.TermVectorsTermsWriter.initTermVectorsWriter(TermVectorsTermsWriter.java:100)
	at org.apache.lucene.index.TermVectorsTermsWriter.finishDocument(TermVectorsTermsWriter.java:127)
	at org.apache.lucene.index.TermsHash.finishDocument(TermsHash.java:138)
	at org.apache.lucene.index.DocInverter.finishDocument(DocInverter.java:95)
	at org.apache.lucene.index.DocFieldProcessor.finishDocument(DocFieldProcessor.java:296)
	at org.apache.lucene.index.DocumentsWriterPerThread.updateDocument(DocumentsWriterPerThread.java:259)
	at org.apache.lucene.index.DocumentsWriter.updateDocument(DocumentsWriter.java:382)
	at org.apache.lucene.index.IndexWriter.updateDocument(IndexWriter.java:1494)
	at org.apache.lucene.index.IndexWriter.addDocument(IndexWriter.java:1254)
	at org.apache.lucene.index.IndexWriter.addDocument(IndexWriter.java:1235)
	at org.apache.lucene.index.TestIndexWriterReader.createIndexNoClose(TestIndexWriterReader.java:592)
	at org.apache.lucene.index.TestIndexWriterReader.testDeleteFromIndexWriter(TestIndexWriterReader.java:320)
	at org.apache.lucene.util.LuceneTestCase$3$1.evaluate(LuceneTestCase.java:523)
	at org.apache.lucene.util.LuceneTestCaseRunner.runChild(LuceneTestCaseRunner.java:149)
	at org.apache.lucene.util.LuceneTestCaseRunner.runChild(LuceneTestCaseRunner.java:51)


REGRESSION:  org.apache.lucene.index.TestIndexWriterReader.testAddCloseOpen

Error Message:
/usr/home/hudson/hudson-slave/workspace/Lucene-trunk/checkout/lucene/build/test/8/index2175721857tmp/_3_0.tii (Too many open files in system)

Stack Trace:
java.io.FileNotFoundException: /usr/home/hudson/hudson-slave/workspace/Lucene-trunk/checkout/lucene/build/test/8/index2175721857tmp/_3_0.tii (Too many open files in system)
	at java.io.RandomAccessFile.open(Native Method)
	at java.io.RandomAccessFile.<init>(RandomAccessFile.java:233)
	at org.apache.lucene.store.FSDirectory$FSIndexOutput.<init>(FSDirectory.java:457)
	at org.apache.lucene.store.FSDirectory.createOutput(FSDirectory.java:296)
	at org.apache.lucene.store.MockDirectoryWrapper.createOutput(MockDirectoryWrapper.java:388)
	at org.apache.lucene.index.codecs.FixedGapTermsIndexWriter.<init>(FixedGapTermsIndexWriter.java:61)
	at org.apache.lucene.index.codecs.lucene40ords.Lucene40WithOrds.fieldsConsumer(Lucene40WithOrds.java:62)
	at org.apache.lucene.index.codecs.perfield.PerFieldPostingsFormat$FieldsWriter.addField(PerFieldPostingsFormat.java:119)
	at org.apache.lucene.index.FreqProxTermsWriterPerField.flush(FreqProxTermsWriterPerField.java:246)
	at org.apache.lucene.index.FreqProxTermsWriter.flush(FreqProxTermsWriter.java:92)
	at org.apache.lucene.index.TermsHash.flush(TermsHash.java:117)
	at org.apache.lucene.index.DocInverter.flush(DocInverter.java:80)
	at org.apache.lucene.index.DocFieldProcessor.flush(DocFieldProcessor.java:78)
	at org.apache.lucene.index.DocumentsWriterPerThread.flush(DocumentsWriterPerThread.java:476)
	at org.apache.lucene.index.DocumentsWriter.doFlush(DocumentsWriter.java:431)
	at org.apache.lucene.index.DocumentsWriter.flushAllThreads(DocumentsWriter.java:584)
	at org.apache.lucene.index.IndexWriter.getReader(IndexWriter.java:353)
	at org.apache.lucene.index.IndexWriter.getReader(IndexWriter.java:266)
	at org.apache.lucene.index.TestIndexWriterReader.testAddCloseOpen(TestIndexWriterReader.java:71)
	at org.apache.lucene.util.LuceneTestCase$3$1.evaluate(LuceneTestCase.java:523)
	at org.apache.lucene.util.LuceneTestCaseRunner.runChild(LuceneTestCaseRunner.java:149)
	at org.apache.lucene.util.LuceneTestCaseRunner.runChild(LuceneTestCaseRunner.java:51)


REGRESSION:  org.apache.lucene.index.TestLongPostings.testLongPostingsNoPositions

Error Message:
/usr/home/hudson/hudson-slave/workspace/Lucene-trunk/checkout/lucene/build/test/3/longpostings.-54037309750992897464202742061tmp/_9.fdx (Too many open files in system)

Stack Trace:
java.io.FileNotFoundException: /usr/home/hudson/hudson-slave/workspace/Lucene-trunk/checkout/lucene/build/test/3/longpostings.-54037309750992897464202742061tmp/_9.fdx (Too many open files in system)
	at java.io.RandomAccessFile.open(Native Method)
	at java.io.RandomAccessFile.<init>(RandomAccessFile.java:233)
	at org.apache.lucene.store.FSDirectory$FSIndexOutput.<init>(FSDirectory.java:457)
	at org.apache.lucene.store.FSDirectory.createOutput(FSDirectory.java:296)
	at org.apache.lucene.store.MockDirectoryWrapper.createOutput(MockDirectoryWrapper.java:388)
	at org.apache.lucene.index.codecs.DefaultStoredFieldsWriter.<init>(DefaultStoredFieldsWriter.java:88)
	at org.apache.lucene.index.codecs.DefaultStoredFieldsFormat.fieldsWriter(DefaultStoredFieldsFormat.java:40)
	at org.apache.lucene.index.StoredFieldsConsumer.initFieldsWriter(StoredFieldsConsumer.java:83)
	at org.apache.lucene.index.StoredFieldsConsumer.finishDocument(StoredFieldsConsumer.java:113)
	at org.apache.lucene.index.DocFieldProcessor.finishDocument(DocFieldProcessor.java:294)
	at org.apache.lucene.index.DocumentsWriterPerThread.updateDocument(DocumentsWriterPerThread.java:259)
	at org.apache.lucene.index.DocumentsWriter.updateDocument(DocumentsWriter.java:382)
	at org.apache.lucene.index.IndexWriter.updateDocument(IndexWriter.java:1494)
	at org.apache.lucene.index.IndexWriter.addDocument(IndexWriter.java:1254)
	at org.apache.lucene.index.IndexWriter.addDocument(IndexWriter.java:1235)
	at org.apache.lucene.index.RandomIndexWriter.addDocument(RandomIndexWriter.java:162)
	at org.apache.lucene.index.TestLongPostings.doTestLongPostingsNoPositions(TestLongPostings.java:323)
	at org.apache.lucene.index.TestLongPostings.testLongPostingsNoPositions(TestLongPostings.java:268)
	at org.apache.lucene.util.LuceneTestCase$3$1.evaluate(LuceneTestCase.java:523)
	at org.apache.lucene.util.LuceneTestCaseRunner.runChild(LuceneTestCaseRunner.java:149)
	at org.apache.lucene.util.LuceneTestCaseRunner.runChild(LuceneTestCaseRunner.java:51)


REGRESSION:  org.apache.lucene.index.TestNRTThreads.testNRTThreads

Error Message:
org/apache/lucene/util/ThreeLongs

Stack Trace:
java.lang.NoClassDefFoundError: org/apache/lucene/util/ThreeLongs
	at org.apache.lucene.util.LuceneTestCase.reportAdditionalFailureInfo(LuceneTestCase.java:1286)
	at org.apache.lucene.util.LuceneTestCase$2.failed(LuceneTestCase.java:491)
	at org.apache.lucene.util.LuceneTestCase$3$1.evaluate(LuceneTestCase.java:523)
	at org.apache.lucene.util.LuceneTestCaseRunner.runChild(LuceneTestCaseRunner.java:149)
	at org.apache.lucene.util.LuceneTestCaseRunner.runChild(LuceneTestCaseRunner.java:51)
Caused by: java.lang.ClassNotFoundException: org.apache.lucene.util.ThreeLongs
	at java.net.URLClassLoader$1.run(URLClassLoader.java:214)
	at java.security.AccessController.doPrivileged(Native Method)
	at java.net.URLClassLoader.findClass(URLClassLoader.java:205)
	at java.lang.ClassLoader.loadClass(ClassLoader.java:321)
	at sun.misc.Launcher$AppClassLoader.loadClass(Launcher.java:294)
	at java.lang.ClassLoader.loadClass(ClassLoader.java:266)
Caused by: java.io.FileNotFoundException: /usr/home/hudson/hudson-slave/workspace/Lucene-trunk/checkout/lucene/build/classes/test-framework/org/apache/lucene/util/ThreeLongs.class (Too many open files in system)
	at java.io.FileInputStream.open(Native Method)
	at java.io.FileInputStream.<init>(FileInputStream.java:137)
	at sun.misc.URLClassPath$FileLoader$1.getInputStream(URLClassPath.java:1005)
	at sun.misc.Resource.cachedInputStream(Resource.java:77)
	at sun.misc.Resource.getByteBuffer(Resource.java:160)
	at java.net.URLClassLoader.defineClass(URLClassLoader.java:266)
	at java.net.URLClassLoader.access$000(URLClassLoader.java:73)
	at java.net.URLClassLoader$1.run(URLClassLoader.java:212)


REGRESSION:  org.apache.lucene.index.TestStressIndexing2.testMultiConfig

Error Message:
org/apache/lucene/util/ThreeLongs

Stack Trace:
java.lang.NoClassDefFoundError: org/apache/lucene/util/ThreeLongs
	at org.apache.lucene.util.LuceneTestCase.reportAdditionalFailureInfo(LuceneTestCase.java:1286)
	at org.apache.lucene.util.LuceneTestCase$2.failed(LuceneTestCase.java:491)
	at org.apache.lucene.util.LuceneTestCase$3$1.evaluate(LuceneTestCase.java:523)
	at org.apache.lucene.util.LuceneTestCaseRunner.runChild(LuceneTestCaseRunner.java:149)
	at org.apache.lucene.util.LuceneTestCaseRunner.runChild(LuceneTestCaseRunner.java:51)


REGRESSION:  org.apache.lucene.index.TestTermVectorsWriter.testEndOffsetPositionStopFilter

Error Message:
directory '/usr/home/hudson/hudson-slave/workspace/Lucene-trunk/checkout/lucene/build/test/3/index4202742062tmp' exists and is a directory, but cannot be listed: list() returned null

Stack Trace:
java.io.IOException: directory '/usr/home/hudson/hudson-slave/workspace/Lucene-trunk/checkout/lucene/build/test/3/index4202742062tmp' exists and is a directory, but cannot be listed: list() returned null
	at org.apache.lucene.store.FSDirectory.listAll(FSDirectory.java:231)
	at org.apache.lucene.store.FSDirectory.listAll(FSDirectory.java:242)
	at org.apache.lucene.store.MockDirectoryWrapper.listAll(MockDirectoryWrapper.java:592)
	at org.apache.lucene.index.IndexFileDeleter.<init>(IndexFileDeleter.java:145)
	at org.apache.lucene.index.IndexWriter.<init>(IndexWriter.java:890)
	at org.apache.lucene.index.TestTermVectorsWriter.testEndOffsetPositionStopFilter(TestTermVectorsWriter.java:166)
	at org.apache.lucene.util.LuceneTestCase$3$1.evaluate(LuceneTestCase.java:523)
	at org.apache.lucene.util.LuceneTestCaseRunner.runChild(LuceneTestCaseRunner.java:149)
	at org.apache.lucene.util.LuceneTestCaseRunner.runChild(LuceneTestCaseRunner.java:51)


REGRESSION:  org.apache.lucene.index.TestTermVectorsWriter.testNoTermVectorAfterTermVectorMerge

Error Message:
directory '/usr/home/hudson/hudson-slave/workspace/Lucene-trunk/checkout/lucene/build/test/3/index4202742063tmp' exists and is a directory, but cannot be listed: list() returned null

Stack Trace:
java.io.IOException: directory '/usr/home/hudson/hudson-slave/workspace/Lucene-trunk/checkout/lucene/build/test/3/index4202742063tmp' exists and is a directory, but cannot be listed: list() returned null
	at org.apache.lucene.store.FSDirectory.listAll(FSDirectory.java:231)
	at org.apache.lucene.store.FSDirectory.listAll(FSDirectory.java:242)
	at org.apache.lucene.store.MockDirectoryWrapper.listAll(MockDirectoryWrapper.java:592)
	at org.apache.lucene.index.IndexFileDeleter.<init>(IndexFileDeleter.java:145)
	at org.apache.lucene.index.IndexWriter.<init>(IndexWriter.java:890)
	at org.apache.lucene.index.TestTermVectorsWriter.testNoTermVectorAfterTermVectorMerge(TestTermVectorsWriter.java:463)
	at org.apache.lucene.util.LuceneTestCase$3$1.evaluate(LuceneTestCase.java:523)
	at org.apache.lucene.util.LuceneTestCaseRunner.runChild(LuceneTestCaseRunner.java:149)
	at org.apache.lucene.util.LuceneTestCaseRunner.runChild(LuceneTestCaseRunner.java:51)


REGRESSION:  org.apache.lucene.index.TestTieredMergePolicy.testPartialMerge

Error Message:
directory '/usr/home/hudson/hudson-slave/workspace/Lucene-trunk/checkout/lucene/build/test/5/index3195731973tmp' exists and is a directory, but cannot be listed: list() returned null

Stack Trace:
java.io.IOException: directory '/usr/home/hudson/hudson-slave/workspace/Lucene-trunk/checkout/lucene/build/test/5/index3195731973tmp' exists and is a directory, but cannot be listed: list() returned null
	at org.apache.lucene.store.FSDirectory.listAll(FSDirectory.java:231)
	at org.apache.lucene.store.FSDirectory.listAll(FSDirectory.java:242)
	at org.apache.lucene.store.MockDirectoryWrapper.listAll(MockDirectoryWrapper.java:592)
	at org.apache.lucene.index.IndexFileDeleter.<init>(IndexFileDeleter.java:145)
	at org.apache.lucene.index.IndexWriter.<init>(IndexWriter.java:890)
	at org.apache.lucene.index.TestTieredMergePolicy.testPartialMerge(TestTieredMergePolicy.java:83)
	at org.apache.lucene.util.LuceneTestCase$3$1.evaluate(LuceneTestCase.java:523)
	at org.apache.lucene.util.LuceneTestCaseRunner.runChild(LuceneTestCaseRunner.java:149)
	at org.apache.lucene.util.LuceneTestCaseRunner.runChild(LuceneTestCaseRunner.java:51)


REGRESSION:  org.apache.lucene.index.codecs.pulsing.Test10KPulsings.test10kNotPulsed

Error Message:
directory '/usr/home/hudson/hudson-slave/workspace/Lucene-trunk/checkout/lucene/build/test/3/10knotpulsed4202742064tmp' exists and is a directory, but cannot be listed: list() returned null

Stack Trace:
java.io.IOException: directory '/usr/home/hudson/hudson-slave/workspace/Lucene-trunk/checkout/lucene/build/test/3/10knotpulsed4202742064tmp' exists and is a directory, but cannot be listed: list() returned null
	at org.apache.lucene.store.FSDirectory.listAll(FSDirectory.java:231)
	at org.apache.lucene.store.FSDirectory.listAll(FSDirectory.java:242)
	at org.apache.lucene.store.MockDirectoryWrapper.listAll(MockDirectoryWrapper.java:592)
	at org.apache.lucene.index.IndexFileDeleter.<init>(IndexFileDeleter.java:145)
	at org.apache.lucene.index.IndexWriter.<init>(IndexWriter.java:890)
	at org.apache.lucene.index.RandomIndexWriter$MockIndexWriter.<init>(RandomIndexWriter.java:64)
	at org.apache.lucene.index.RandomIndexWriter.<init>(RandomIndexWriter.java:97)
	at org.apache.lucene.index.codecs.pulsing.Test10KPulsings.test10kNotPulsed(Test10KPulsings.java:111)
	at org.apache.lucene.util.LuceneTestCase$3$1.evaluate(LuceneTestCase.java:523)
	at org.apache.lucene.util.LuceneTestCaseRunner.runChild(LuceneTestCaseRunner.java:149)
	at org.apache.lucene.util.LuceneTestCaseRunner.runChild(LuceneTestCaseRunner.java:51)


REGRESSION:  org.apache.lucene.index.codecs.pulsing.Test10KPulsings.test10kPulsed

Error Message:
directory '/usr/home/hudson/hudson-slave/workspace/Lucene-trunk/checkout/lucene/build/test/3/10kpulsed4202742065tmp' exists and is a directory, but cannot be listed: list() returned null

Stack Trace:
java.io.IOException: directory '/usr/home/hudson/hudson-slave/workspace/Lucene-trunk/checkout/lucene/build/test/3/10kpulsed4202742065tmp' exists and is a directory, but cannot be listed: list() returned null
	at org.apache.lucene.store.FSDirectory.listAll(FSDirectory.java:231)
	at org.apache.lucene.store.FSDirectory.listAll(FSDirectory.java:242)
	at org.apache.lucene.store.MockDirectoryWrapper.listAll(MockDirectoryWrapper.java:592)
	at org.apache.lucene.index.IndexFileDeleter.<init>(IndexFileDeleter.java:145)
	at org.apache.lucene.index.IndexWriter.<init>(IndexWriter.java:890)
	at org.apache.lucene.index.RandomIndexWriter$MockIndexWriter.<init>(RandomIndexWriter.java:64)
	at org.apache.lucene.index.RandomIndexWriter.<init>(RandomIndexWriter.java:97)
	at org.apache.lucene.index.codecs.pulsing.Test10KPulsings.test10kPulsed(Test10KPulsings.java:60)
	at org.apache.lucene.util.LuceneTestCase$3$1.evaluate(LuceneTestCase.java:523)
	at org.apache.lucene.util.LuceneTestCaseRunner.runChild(LuceneTestCaseRunner.java:149)
	at org.apache.lucene.util.LuceneTestCaseRunner.runChild(LuceneTestCaseRunner.java:51)


REGRESSION:  org.apache.lucene.index.values.TestTypePromotion.testMergeIncompatibleTypes

Error Message:
/usr/home/hudson/hudson-slave/workspace/Lucene-trunk/checkout/lucene/build/test/6/index5621856277tmp/_2q.fdx (Too many open files in system)

Stack Trace:
java.io.FileNotFoundException: /usr/home/hudson/hudson-slave/workspace/Lucene-trunk/checkout/lucene/build/test/6/index5621856277tmp/_2q.fdx (Too many open files in system)
	at java.io.RandomAccessFile.open(Native Method)
	at java.io.RandomAccessFile.<init>(RandomAccessFile.java:233)
	at org.apache.lucene.store.FSDirectory$FSIndexOutput.<init>(FSDirectory.java:457)
	at org.apache.lucene.store.FSDirectory.createOutput(FSDirectory.java:296)
	at org.apache.lucene.store.MockDirectoryWrapper.createOutput(MockDirectoryWrapper.java:388)
	at org.apache.lucene.index.codecs.DefaultStoredFieldsWriter.<init>(DefaultStoredFieldsWriter.java:88)
	at org.apache.lucene.index.codecs.DefaultStoredFieldsFormat.fieldsWriter(DefaultStoredFieldsFormat.java:40)
	at org.apache.lucene.index.StoredFieldsConsumer.initFieldsWriter(StoredFieldsConsumer.java:83)
	at org.apache.lucene.index.StoredFieldsConsumer.finishDocument(StoredFieldsConsumer.java:113)
	at org.apache.lucene.index.DocFieldProcessor.finishDocument(DocFieldProcessor.java:294)
	at org.apache.lucene.index.DocumentsWriterPerThread.updateDocument(DocumentsWriterPerThread.java:259)
	at org.apache.lucene.index.DocumentsWriter.updateDocument(DocumentsWriter.java:382)
	at org.apache.lucene.index.IndexWriter.updateDocument(IndexWriter.java:1494)
	at org.apache.lucene.index.IndexWriter.addDocument(IndexWriter.java:1254)
	at org.apache.lucene.index.IndexWriter.addDocument(IndexWriter.java:1235)
	at org.apache.lucene.index.values.TestTypePromotion.index(TestTypePromotion.java:233)
	at org.apache.lucene.index.values.TestTypePromotion.testMergeIncompatibleTypes(TestTypePromotion.java:265)
	at org.apache.lucene.util.LuceneTestCase$3$1.evaluate(LuceneTestCase.java:523)
	at org.apache.lucene.util.LuceneTestCaseRunner.runChild(LuceneTestCaseRunner.java:149)
	at org.apache.lucene.util.LuceneTestCaseRunner.runChild(LuceneTestCaseRunner.java:51)


FAILED:  junit.framework.TestSuite.org.apache.lucene.search.TestBooleanMinShouldMatch

Error Message:
/usr/home/hudson/hudson-slave/workspace/Lucene-trunk/checkout/lucene/build/test/1/index5656656602tmp/_0.tvd (Too many open files in system)

Stack Trace:
java.io.FileNotFoundException: /usr/home/hudson/hudson-slave/workspace/Lucene-trunk/checkout/lucene/build/test/1/index5656656602tmp/_0.tvd (Too many open files in system)
	at java.io.RandomAccessFile.open(Native Method)
	at java.io.RandomAccessFile.<init>(RandomAccessFile.java:233)
	at org.apache.lucene.store.FSDirectory$FSIndexOutput.<init>(FSDirectory.java:457)
	at org.apache.lucene.store.FSDirectory.createOutput(FSDirectory.java:296)
	at org.apache.lucene.store.MockDirectoryWrapper.createOutput(MockDirectoryWrapper.java:388)
	at org.apache.lucene.index.TermVectorsTermsWriter.initTermVectorsWriter(TermVectorsTermsWriter.java:101)
	at org.apache.lucene.index.TermVectorsTermsWriter.finishDocument(TermVectorsTermsWriter.java:127)
	at org.apache.lucene.index.TermsHash.finishDocument(TermsHash.java:138)
	at org.apache.lucene.index.DocInverter.finishDocument(DocInverter.java:95)
	at org.apache.lucene.index.DocFieldProcessor.finishDocument(DocFieldProcessor.java:296)
	at org.apache.lucene.index.DocumentsWriterPerThread.updateDocument(DocumentsWriterPerThread.java:259)
	at org.apache.lucene.index.DocumentsWriter.updateDocument(DocumentsWriter.java:382)
	at org.apache.lucene.index.IndexWriter.updateDocument(IndexWriter.java:1494)
	at org.apache.lucene.index.IndexWriter.addDocument(IndexWriter.java:1254)
	at org.apache.lucene.index.IndexWriter.addDocument(IndexWriter.java:1235)
	at org.apache.lucene.index.RandomIndexWriter.addDocument(RandomIndexWriter.java:162)
	at org.apache.lucene.search.TestBooleanMinShouldMatch.beforeClass(TestBooleanMinShouldMatch.java:65)


FAILED:  junit.framework.TestSuite.org.apache.lucene.search.TestBooleanMinShouldMatch

Error Message:
null

Stack Trace:
java.lang.NullPointerException
	at org.apache.lucene.search.TestBooleanMinShouldMatch.afterClass(TestBooleanMinShouldMatch.java:76)


FAILED:  junit.framework.TestSuite.org.apache.lucene.search.TestBooleanMinShouldMatch

Error Message:
org/apache/lucene/util/ThreeLongs

Stack Trace:
java.lang.NoClassDefFoundError: org/apache/lucene/util/ThreeLongs
	at org.apache.lucene.util.LuceneTestCase.reportPartialFailureInfo(LuceneTestCase.java:1279)
	at org.apache.lucene.util.LuceneTestCase.afterClassLuceneTestCaseJ4(LuceneTestCase.java:387)


FAILED:  junit.framework.TestSuite.org.apache.lucene.search.TestFieldCache

Error Message:
null

Stack Trace:
junit.framework.AssertionFailedError
	at org.apache.lucene.util.LuceneTestCase.initRandom(LuceneTestCase.java:230)
	at org.apache.lucene.util.LuceneTestCase.beforeClassLuceneTestCaseJ4(LuceneTestCase.java:241)


FAILED:  junit.framework.TestSuite.org.apache.lucene.search.TestFieldCache

Error Message:
org/apache/lucene/util/ThreeLongs

Stack Trace:
java.lang.NoClassDefFoundError: org/apache/lucene/util/ThreeLongs
	at org.apache.lucene.util.LuceneTestCase.reportPartialFailureInfo(LuceneTestCase.java:1279)
	at org.apache.lucene.util.LuceneTestCase.afterClassLuceneTestCaseJ4(LuceneTestCase.java:387)


REGRESSION:  org.apache.lucene.search.TestMultiPhraseQuery.testZeroPosIncrSloppyPqAnd

Error Message:
/usr/home/hudson/hudson-slave/workspace/Lucene-trunk/checkout/lucene/build/test/3/index4202742066tmp/_0.fdx (Too many open files in system)

Stack Trace:
java.io.FileNotFoundException: /usr/home/hudson/hudson-slave/workspace/Lucene-trunk/checkout/lucene/build/test/3/index4202742066tmp/_0.fdx (Too many open files in system)
	at java.io.RandomAccessFile.open(Native Method)
	at java.io.RandomAccessFile.<init>(RandomAccessFile.java:233)
	at org.apache.lucene.store.FSDirectory$FSIndexOutput.<init>(FSDirectory.java:457)
	at org.apache.lucene.store.FSDirectory.createOutput(FSDirectory.java:296)
	at org.apache.lucene.store.MockDirectoryWrapper.createOutput(MockDirectoryWrapper.java:388)
	at org.apache.lucene.index.codecs.DefaultStoredFieldsWriter.<init>(DefaultStoredFieldsWriter.java:88)
	at org.apache.lucene.index.codecs.DefaultStoredFieldsFormat.fieldsWriter(DefaultStoredFieldsFormat.java:40)
	at org.apache.lucene.index.StoredFieldsConsumer.initFieldsWriter(StoredFieldsConsumer.java:83)
	at org.apache.lucene.index.StoredFieldsConsumer.finishDocument(StoredFieldsConsumer.java:113)
	at org.apache.lucene.index.DocFieldProcessor.finishDocument(DocFieldProcessor.java:294)
	at org.apache.lucene.index.DocumentsWriterPerThread.updateDocument(DocumentsWriterPerThread.java:259)
	at org.apache.lucene.index.DocumentsWriter.updateDocument(DocumentsWriter.java:382)
	at org.apache.lucene.index.IndexWriter.updateDocument(IndexWriter.java:1494)
	at org.apache.lucene.index.IndexWriter.addDocument(IndexWriter.java:1254)
	at org.apache.lucene.index.IndexWriter.addDocument(IndexWriter.java:1235)
	at org.apache.lucene.search.TestMultiPhraseQuery.doTestZeroPosIncrSloppy(TestMultiPhraseQuery.java:496)
	at org.apache.lucene.search.TestMultiPhraseQuery.testZeroPosIncrSloppyPqAnd(TestMultiPhraseQuery.java:529)
	at org.apache.lucene.util.LuceneTestCase$3$1.evaluate(LuceneTestCase.java:523)
	at org.apache.lucene.util.LuceneTestCaseRunner.runChild(LuceneTestCaseRunner.java:149)
	at org.apache.lucene.util.LuceneTestCaseRunner.runChild(LuceneTestCaseRunner.java:51)


REGRESSION:  org.apache.lucene.search.TestMultiPhraseQuery.testPhrasePrefix

Error Message:
directory '/usr/home/hudson/hudson-slave/workspace/Lucene-trunk/checkout/lucene/build/test/3/index4202742067tmp' exists and is a directory, but cannot be listed: list() returned null

Stack Trace:
java.io.IOException: directory '/usr/home/hudson/hudson-slave/workspace/Lucene-trunk/checkout/lucene/build/test/3/index4202742067tmp' exists and is a directory, but cannot be listed: list() returned null
	at org.apache.lucene.store.FSDirectory.listAll(FSDirectory.java:231)
	at org.apache.lucene.store.FSDirectory.listAll(FSDirectory.java:242)
	at org.apache.lucene.store.MockDirectoryWrapper.listAll(MockDirectoryWrapper.java:592)
	at org.apache.lucene.index.IndexFileDeleter.<init>(IndexFileDeleter.java:145)
	at org.apache.lucene.index.IndexWriter.<init>(IndexWriter.java:890)
	at org.apache.lucene.index.RandomIndexWriter$MockIndexWriter.<init>(RandomIndexWriter.java:64)
	at org.apache.lucene.index.RandomIndexWriter.<init>(RandomIndexWriter.java:97)
	at org.apache.lucene.index.RandomIndexWriter.<init>(RandomIndexWriter.java:81)
	at org.apache.lucene.search.TestMultiPhraseQuery.testPhrasePrefix(TestMultiPhraseQuery.java:60)
	at org.apache.lucene.util.LuceneTestCase$3$1.evaluate(LuceneTestCase.java:523)
	at org.apache.lucene.util.LuceneTestCaseRunner.runChild(LuceneTestCaseRunner.java:149)
	at org.apache.lucene.util.LuceneTestCaseRunner.runChild(LuceneTestCaseRunner.java:51)


REGRESSION:  org.apache.lucene.search.TestMultiTermConstantScore.testRangeQueryRand

Error Message:
org/apache/lucene/search/TermRangeTermsEnum

Stack Trace:
java.lang.NoClassDefFoundError: org/apache/lucene/search/TermRangeTermsEnum
	at org.apache.lucene.search.TestMultiTermConstantScore.csrq(TestMultiTermConstantScore.java:90)
	at org.apache.lucene.search.TestMultiTermConstantScore.testRangeQueryRand(TestMultiTermConstantScore.java:437)
	at org.apache.lucene.util.LuceneTestCase$3$1.evaluate(LuceneTestCase.java:523)
	at org.apache.lucene.util.LuceneTestCaseRunner.runChild(LuceneTestCaseRunner.java:149)
	at org.apache.lucene.util.LuceneTestCaseRunner.runChild(LuceneTestCaseRunner.java:51)
Caused by: java.lang.ClassNotFoundException: org.apache.lucene.search.TermRangeTermsEnum
	at java.net.URLClassLoader$1.run(URLClassLoader.java:214)
	at java.security.AccessController.doPrivileged(Native Method)
	at java.net.URLClassLoader.findClass(URLClassLoader.java:205)
	at java.lang.ClassLoader.loadClass(ClassLoader.java:321)
	at sun.misc.Launcher$AppClassLoader.loadClass(Launcher.java:294)
	at java.lang.ClassLoader.loadClass(ClassLoader.java:266)
Caused by: java.io.FileNotFoundException: /usr/home/hudson/hudson-slave/workspace/Lucene-trunk/checkout/lucene/build/classes/java/org/apache/lucene/search/TermRangeTermsEnum.class (Too many open files in system)
	at java.io.FileInputStream.open(Native Method)
	at java.io.FileInputStream.<init>(FileInputStream.java:137)
	at sun.misc.URLClassPath$FileLoader$1.getInputStream(URLClassPath.java:1005)
	at sun.misc.Resource.cachedInputStream(Resource.java:77)
	at sun.misc.Resource.getByteBuffer(Resource.java:160)
	at java.net.URLClassLoader.defineClass(URLClassLoader.java:266)
	at java.net.URLClassLoader.access$000(URLClassLoader.java:73)
	at java.net.URLClassLoader$1.run(URLClassLoader.java:212)


REGRESSION:  org.apache.lucene.search.TestMultiTermConstantScore.testBoost

Error Message:
org/apache/lucene/search/TestMultiTermConstantScore$1

Stack Trace:
java.lang.NoClassDefFoundError: org/apache/lucene/search/TestMultiTermConstantScore$1
	at org.apache.lucene.search.TestMultiTermConstantScore.testBoost(TestMultiTermConstantScore.java:177)
	at org.apache.lucene.util.LuceneTestCase$3$1.evaluate(LuceneTestCase.java:523)
	at org.apache.lucene.util.LuceneTestCaseRunner.runChild(LuceneTestCaseRunner.java:149)
	at org.apache.lucene.util.LuceneTestCaseRunner.runChild(LuceneTestCaseRunner.java:51)
Caused by: java.lang.ClassNotFoundException: org.apache.lucene.search.TestMultiTermConstantScore$1
	at java.net.URLClassLoader$1.run(URLClassLoader.java:214)
	at java.security.AccessController.doPrivileged(Native Method)
	at java.net.URLClassLoader.findClass(URLClassLoader.java:205)
	at java.lang.ClassLoader.loadClass(ClassLoader.java:321)
	at sun.misc.Launcher$AppClassLoader.loadClass(Launcher.java:294)
	at java.lang.ClassLoader.loadClass(ClassLoader.java:266)
Caused by: java.io.FileNotFoundException: /usr/home/hudson/hudson-slave/workspace/Lucene-trunk/checkout/lucene/build/classes/test/org/apache/lucene/search/TestMultiTermConstantScore$1.class (Too many open files in system)
	at java.io.FileInputStream.open(Native Method)
	at java.io.FileInputStream.<init>(FileInputStream.java:137)
	at sun.misc.URLClassPath$FileLoader$1.getInputStream(URLClassPath.java:1005)
	at sun.misc.Resource.cachedInputStream(Resource.java:77)
	at sun.misc.Resource.getByteBuffer(Resource.java:160)
	at java.net.URLClassLoader.defineClass(URLClassLoader.java:266)
	at java.net.URLClassLoader.access$000(URLClassLoader.java:73)
	at java.net.URLClassLoader$1.run(URLClassLoader.java:212)


REGRESSION:  org.apache.lucene.search.TestMultiTermConstantScore.testEqualScores

Error Message:
org/apache/lucene/search/TermRangeTermsEnum

Stack Trace:
java.lang.NoClassDefFoundError: org/apache/lucene/search/TermRangeTermsEnum
	at org.apache.lucene.search.TestMultiTermConstantScore.csrq(TestMultiTermConstantScore.java:90)
	at org.apache.lucene.search.TestMultiTermConstantScore.testEqualScores(TestMultiTermConstantScore.java:147)
	at org.apache.lucene.util.LuceneTestCase$3$1.evaluate(LuceneTestCase.java:523)
	at org.apache.lucene.util.LuceneTestCaseRunner.runChild(LuceneTestCaseRunner.java:149)
	at org.apache.lucene.util.LuceneTestCaseRunner.runChild(LuceneTestCaseRunner.java:51)
Caused by: java.lang.ClassNotFoundException: org.apache.lucene.search.TermRangeTermsEnum
	at java.net.URLClassLoader$1.run(URLClassLoader.java:214)
	at java.security.AccessController.doPrivileged(Native Method)
	at java.net.URLClassLoader.findClass(URLClassLoader.java:205)
	at java.lang.ClassLoader.loadClass(ClassLoader.java:321)
	at sun.misc.Launcher$AppClassLoader.loadClass(Launcher.java:294)
	at java.lang.ClassLoader.loadClass(ClassLoader.java:266)
Caused by: java.io.FileNotFoundException: /usr/home/hudson/hudson-slave/workspace/Lucene-trunk/checkout/lucene/build/classes/java/org/apache/lucene/search/TermRangeTermsEnum.class (Too many open files in system)
	at java.io.FileInputStream.open(Native Method)
	at java.io.FileInputStream.<init>(FileInputStream.java:137)
	at sun.misc.URLClassPath$FileLoader$1.getInputStream(URLClassPath.java:1005)
	at sun.misc.Resource.cachedInputStream(Resource.java:77)
	at sun.misc.Resource.getByteBuffer(Resource.java:160)
	at java.net.URLClassLoader.defineClass(URLClassLoader.java:266)
	at java.net.URLClassLoader.access$000(URLClassLoader.java:73)
	at java.net.URLClassLoader$1.run(URLClassLoader.java:212)


REGRESSION:  org.apache.lucene.search.TestMultiTermConstantScore.testBasics

Error Message:
org/apache/lucene/search/TermRangeTermsEnum

Stack Trace:
java.lang.NoClassDefFoundError: org/apache/lucene/search/TermRangeTermsEnum
	at org.apache.lucene.search.TestMultiTermConstantScore.csrq(TestMultiTermConstantScore.java:90)
	at org.apache.lucene.search.TestMultiTermConstantScore.testBasics(TestMultiTermConstantScore.java:123)
	at org.apache.lucene.util.LuceneTestCase$3$1.evaluate(LuceneTestCase.java:523)
	at org.apache.lucene.util.LuceneTestCaseRunner.runChild(LuceneTestCaseRunner.java:149)
	at org.apache.lucene.util.LuceneTestCaseRunner.runChild(LuceneTestCaseRunner.java:51)
Caused by: java.lang.ClassNotFoundException: org.apache.lucene.search.TermRangeTermsEnum
	at java.net.URLClassLoader$1.run(URLClassLoader.java:214)
	at java.security.AccessController.doPrivileged(Native Method)
	at java.net.URLClassLoader.findClass(URLClassLoader.java:205)
	at java.lang.ClassLoader.loadClass(ClassLoader.java:321)
	at sun.misc.Launcher$AppClassLoader.loadClass(Launcher.java:294)
	at java.lang.ClassLoader.loadClass(ClassLoader.java:266)
Caused by: java.io.FileNotFoundException: /usr/home/hudson/hudson-slave/workspace/Lucene-trunk/checkout/lucene/build/classes/java/org/apache/lucene/search/TermRangeTermsEnum.class (Too many open files in system)
	at java.io.FileInputStream.open(Native Method)
	at java.io.FileInputStream.<init>(FileInputStream.java:137)
	at sun.misc.URLClassPath$FileLoader$1.getInputStream(URLClassPath.java:1005)
	at sun.misc.Resource.cachedInputStream(Resource.java:77)
	at sun.misc.Resource.getByteBuffer(Resource.java:160)
	at java.net.URLClassLoader.defineClass(URLClassLoader.java:266)
	at java.net.URLClassLoader.access$000(URLClassLoader.java:73)
	at java.net.URLClassLoader$1.run(URLClassLoader.java:212)


REGRESSION:  org.apache.lucene.search.TestMultiTermConstantScore.testRangeQueryId

Error Message:
org/apache/lucene/search/TermRangeTermsEnum

Stack Trace:
java.lang.NoClassDefFoundError: org/apache/lucene/search/TermRangeTermsEnum
	at org.apache.lucene.search.TestMultiTermConstantScore.csrq(TestMultiTermConstantScore.java:90)
	at org.apache.lucene.search.TestMultiTermConstantScore.testRangeQueryId(TestMultiTermConstantScore.java:310)
	at org.apache.lucene.util.LuceneTestCase$3$1.evaluate(LuceneTestCase.java:523)
	at org.apache.lucene.util.LuceneTestCaseRunner.runChild(LuceneTestCaseRunner.java:149)
	at org.apache.lucene.util.LuceneTestCaseRunner.runChild(LuceneTestCaseRunner.java:51)
Caused by: java.lang.ClassNotFoundException: org.apache.lucene.search.TermRangeTermsEnum
	at java.net.URLClassLoader$1.run(URLClassLoader.java:214)
	at java.security.AccessController.doPrivileged(Native Method)
	at java.net.URLClassLoader.findClass(URLClassLoader.java:205)
	at java.lang.ClassLoader.loadClass(ClassLoader.java:321)
	at sun.misc.Launcher$AppClassLoader.loadClass(Launcher.java:294)
	at java.lang.ClassLoader.loadClass(ClassLoader.java:266)
Caused by: java.io.FileNotFoundException: /usr/home/hudson/hudson-slave/workspace/Lucene-trunk/checkout/lucene/build/classes/java/org/apache/lucene/search/TermRangeTermsEnum.class (Too many open files in system)
	at java.io.FileInputStream.open(Native Method)
	at java.io.FileInputStream.<init>(FileInputStream.java:137)
	at sun.misc.URLClassPath$FileLoader$1.getInputStream(URLClassPath.java:1005)
	at sun.misc.Resource.cachedInputStream(Resource.java:77)
	at sun.misc.Resource.getByteBuffer(Resource.java:160)
	at java.net.URLClassLoader.defineClass(URLClassLoader.java:266)
	at java.net.URLClassLoader.access$000(URLClassLoader.java:73)
	at java.net.URLClassLoader$1.run(URLClassLoader.java:212)


REGRESSION:  org.apache.lucene.search.TestMultiTermConstantScore.testBooleanOrderUnAffected

Error Message:
org/apache/lucene/search/TermRangeTermsEnum

Stack Trace:
java.lang.NoClassDefFoundError: org/apache/lucene/search/TermRangeTermsEnum
	at org.apache.lucene.search.TestMultiTermConstantScore.testBooleanOrderUnAffected(TestMultiTermConstantScore.java:262)
	at org.apache.lucene.util.LuceneTestCase$3$1.evaluate(LuceneTestCase.java:523)
	at org.apache.lucene.util.LuceneTestCaseRunner.runChild(LuceneTestCaseRunner.java:149)
	at org.apache.lucene.util.LuceneTestCaseRunner.runChild(LuceneTestCaseRunner.java:51)
Caused by: java.lang.ClassNotFoundException: org.apache.lucene.search.TermRangeTermsEnum
	at java.net.URLClassLoader$1.run(URLClassLoader.java:214)
	at java.security.AccessController.doPrivileged(Native Method)
	at java.net.URLClassLoader.findClass(URLClassLoader.java:205)
	at java.lang.ClassLoader.loadClass(ClassLoader.java:321)
	at sun.misc.Launcher$AppClassLoader.loadClass(Launcher.java:294)
	at java.lang.ClassLoader.loadClass(ClassLoader.java:266)
Caused by: java.io.FileNotFoundException: /usr/home/hudson/hudson-slave/workspace/Lucene-trunk/checkout/lucene/build/classes/java/org/apache/lucene/search/TermRangeTermsEnum.class (Too many open files in system)
	at java.io.FileInputStream.open(Native Method)
	at java.io.FileInputStream.<init>(FileInputStream.java:137)
	at sun.misc.URLClassPath$FileLoader$1.getInputStream(URLClassPath.java:1005)
	at sun.misc.Resource.cachedInputStream(Resource.java:77)
	at sun.misc.Resource.getByteBuffer(Resource.java:160)
	at java.net.URLClassLoader.defineClass(URLClassLoader.java:266)
	at java.net.URLClassLoader.access$000(URLClassLoader.java:73)
	at java.net.URLClassLoader$1.run(URLClassLoader.java:212)


FAILED:  <init>.org.apache.lucene.search.TestMultiTermQueryRewrites

Error Message:
org.apache.lucene.search.TestMultiTermQueryRewrites

Stack Trace:
java.lang.ClassNotFoundException: org.apache.lucene.search.TestMultiTermQueryRewrites
	at java.net.URLClassLoader$1.run(URLClassLoader.java:214)
	at java.security.AccessController.doPrivileged(Native Method)
	at java.net.URLClassLoader.findClass(URLClassLoader.java:205)
	at java.lang.ClassLoader.loadClass(ClassLoader.java:321)
	at sun.misc.Launcher$AppClassLoader.loadClass(Launcher.java:294)
	at java.lang.ClassLoader.loadClass(ClassLoader.java:266)
	at java.lang.Class.forName0(Native Method)
	at java.lang.Class.forName(Class.java:186)
Caused by: java.io.FileNotFoundException: /usr/home/hudson/hudson-slave/workspace/Lucene-trunk/checkout/lucene/build/classes/test/org/apache/lucene/search/TestMultiTermQueryRewrites.class (Too many open files in system)
	at java.io.FileInputStream.open(Native Method)
	at java.io.FileInputStream.<init>(FileInputStream.java:137)
	at sun.misc.URLClassPath$FileLoader$1.getInputStream(URLClassPath.java:1005)
	at sun.misc.Resource.cachedInputStream(Resource.java:77)
	at sun.misc.Resource.getByteBuffer(Resource.java:160)
	at java.net.URLClassLoader.defineClass(URLClassLoader.java:266)
	at java.net.URLClassLoader.access$000(URLClassLoader.java:73)
	at java.net.URLClassLoader$1.run(URLClassLoader.java:212)


FAILED:  <init>.org.apache.lucene.search.TestNot

Error Message:
org.apache.lucene.search.TestNot

Stack Trace:
java.lang.ClassNotFoundException: org.apache.lucene.search.TestNot
	at java.net.URLClassLoader$1.run(URLClassLoader.java:214)
	at java.security.AccessController.doPrivileged(Native Method)
	at java.net.URLClassLoader.findClass(URLClassLoader.java:205)
	at java.lang.ClassLoader.loadClass(ClassLoader.java:321)
	at sun.misc.Launcher$AppClassLoader.loadClass(Launcher.java:294)
	at java.lang.ClassLoader.loadClass(ClassLoader.java:266)
	at java.lang.Class.forName0(Native Method)
	at java.lang.Class.forName(Class.java:186)
Caused by: java.io.FileNotFoundException: /usr/home/hudson/hudson-slave/workspace/Lucene-trunk/checkout/lucene/build/classes/test/org/apache/lucene/search/TestNot.class (Too many open files in system)
	at java.io.FileInputStream.open(Native Method)
	at java.io.FileInputStream.<init>(FileInputStream.java:137)
	at sun.misc.URLClassPath$FileLoader$1.getInputStream(URLClassPath.java:1005)
	at sun.misc.Resource.cachedInputStream(Resource.java:77)
	at sun.misc.Resource.getByteBuffer(Resource.java:160)
	at java.net.URLClassLoader.defineClass(URLClassLoader.java:266)
	at java.net.URLClassLoader.access$000(URLClassLoader.java:73)
	at java.net.URLClassLoader$1.run(URLClassLoader.java:212)


FAILED:  junit.framework.TestSuite.org.apache.lucene.search.TestNumericRangeQuery64

Error Message:
org/apache/lucene/analysis/NumericTokenStream$NumericAttributeFactory

Stack Trace:
java.lang.NoClassDefFoundError: org/apache/lucene/analysis/NumericTokenStream$NumericAttributeFactory
	at org.apache.lucene.document.NumericField.tokenStream(NumericField.java:247)
	at org.apache.lucene.index.DocInverterPerField.processFields(DocInverterPerField.java:82)
	at org.apache.lucene.index.DocFieldProcessor.processDocument(DocFieldProcessor.java:276)
	at org.apache.lucene.index.DocumentsWriterPerThread.updateDocument(DocumentsWriterPerThread.java:240)
	at org.apache.lucene.index.DocumentsWriter.updateDocument(DocumentsWriter.java:382)
	at org.apache.lucene.index.IndexWriter.updateDocument(IndexWriter.java:1494)
	at org.apache.lucene.index.IndexWriter.addDocument(IndexWriter.java:1254)
	at org.apache.lucene.index.IndexWriter.addDocument(IndexWriter.java:1235)
	at org.apache.lucene.index.RandomIndexWriter.addDocument(RandomIndexWriter.java:162)
	at org.apache.lucene.search.TestNumericRangeQuery64.beforeClass(TestNumericRangeQuery64.java:93)
Caused by: java.lang.ClassNotFoundException: org.apache.lucene.analysis.NumericTokenStream$NumericAttributeFactory
	at java.net.URLClassLoader$1.run(URLClassLoader.java:214)
	at java.security.AccessController.doPrivileged(Native Method)
	at java.net.URLClassLoader.findClass(URLClassLoader.java:205)
	at java.lang.ClassLoader.loadClass(ClassLoader.java:321)
	at sun.misc.Launcher$AppClassLoader.loadClass(Launcher.java:294)
	at java.lang.ClassLoader.loadClass(ClassLoader.java:266)
Caused by: java.io.FileNotFoundException: /usr/home/hudson/hudson-slave/workspace/Lucene-trunk/checkout/lucene/build/classes/java/org/apache/lucene/analysis/NumericTokenStream$NumericAttributeFactory.class (Too many open files in system)
	at java.io.FileInputStream.open(Native Method)
	at java.io.FileInputStream.<init>(FileInputStream.java:137)
	at sun.misc.URLClassPath$FileLoader$1.getInputStream(URLClassPath.java:1005)
	at sun.misc.Resource.cachedInputStream(Resource.java:77)
	at sun.misc.Resource.getByteBuffer(Resource.java:160)
	at java.net.URLClassLoader.defineClass(URLClassLoader.java:266)
	at java.net.URLClassLoader.access$000(URLClassLoader.java:73)
	at java.net.URLClassLoader$1.run(URLClassLoader.java:212)


FAILED:  junit.framework.TestSuite.org.apache.lucene.search.TestNumericRangeQuery64

Error Message:
null

Stack Trace:
java.lang.NullPointerException
	at org.apache.lucene.search.TestNumericRangeQuery64.afterClass(TestNumericRangeQuery64.java:102)


FAILED:  junit.framework.TestSuite.org.apache.lucene.search.TestNumericRangeQuery64

Error Message:
java.lang.AssertionError: directory of test was not closed, opened from: org.apache.lucene.search.TestNumericRangeQuery64.beforeClass(TestNumericRangeQuery64.java:56)

Stack Trace:
java.lang.RuntimeException: java.lang.AssertionError: directory of test was not closed, opened from: org.apache.lucene.search.TestNumericRangeQuery64.beforeClass(TestNumericRangeQuery64.java:56)
	at org.apache.lucene.util.LuceneTestCase.afterClassLuceneTestCaseJ4(LuceneTestCase.java:400)
	at org.apache.lucene.util.LuceneTestCase.checkResourcesAfterClass(LuceneTestCase.java:440)
	at org.apache.lucene.util.LuceneTestCase.afterClassLuceneTestCaseJ4(LuceneTestCase.java:368)


FAILED:  <init>.org.apache.lucene.search.TestPhraseQuery

Error Message:
org.apache.lucene.search.TestPhraseQuery

Stack Trace:
java.lang.ClassNotFoundException: org.apache.lucene.search.TestPhraseQuery
	at java.net.URLClassLoader$1.run(URLClassLoader.java:214)
	at java.security.AccessController.doPrivileged(Native Method)
	at java.net.URLClassLoader.findClass(URLClassLoader.java:205)
	at java.lang.ClassLoader.loadClass(ClassLoader.java:321)
	at sun.misc.Launcher$AppClassLoader.loadClass(Launcher.java:294)
	at java.lang.ClassLoader.loadClass(ClassLoader.java:266)
	at java.lang.Class.forName0(Native Method)
	at java.lang.Class.forName(Class.java:186)
Caused by: java.io.FileNotFoundException: /usr/home/hudson/hudson-slave/workspace/Lucene-trunk/checkout/lucene/build/classes/test/org/apache/lucene/search/TestPhraseQuery.class (Too many open files in system)
	at java.io.FileInputStream.open(Native Method)
	at java.io.FileInputStream.<init>(FileInputStream.java:137)
	at sun.misc.URLClassPath$FileLoader$1.getInputStream(URLClassPath.java:1005)
	at sun.misc.Resource.cachedInputStream(Resource.java:77)
	at sun.misc.Resource.getByteBuffer(Resource.java:160)
	at java.net.URLClassLoader.defineClass(URLClassLoader.java:266)
	at java.net.URLClassLoader.access$000(URLClassLoader.java:73)
	at java.net.URLClassLoader$1.run(URLClassLoader.java:212)


FAILED:  <init>.org.apache.lucene.search.TestPrefixFilter

Error Message:
org.apache.lucene.search.TestPrefixFilter

Stack Trace:
java.lang.ClassNotFoundException: org.apache.lucene.search.TestPrefixFilter
	at java.net.URLClassLoader$1.run(URLClassLoader.java:214)
	at java.security.AccessController.doPrivileged(Native Method)
	at java.net.URLClassLoader.findClass(URLClassLoader.java:205)
	at java.lang.ClassLoader.loadClass(ClassLoader.java:321)
	at sun.misc.Launcher$AppClassLoader.loadClass(Launcher.java:294)
	at java.lang.ClassLoader.loadClass(ClassLoader.java:266)
	at java.lang.Class.forName0(Native Method)
	at java.lang.Class.forName(Class.java:186)
Caused by: java.io.FileNotFoundException: /usr/home/hudson/hudson-slave/workspace/Lucene-trunk/checkout/lucene/build/classes/test/org/apache/lucene/search/TestPrefixFilter.class (Too many open files in system)
	at java.io.FileInputStream.open(Native Method)
	at java.io.FileInputStream.<init>(FileInputStream.java:137)
	at sun.misc.URLClassPath$FileLoader$1.getInputStream(URLClassPath.java:1005)
	at sun.misc.Resource.cachedInputStream(Resource.java:77)
	at sun.misc.Resource.getByteBuffer(Resource.java:160)
	at java.net.URLClassLoader.defineClass(URLClassLoader.java:266)
	at java.net.URLClassLoader.access$000(URLClassLoader.java:73)
	at java.net.URLClassLoader$1.run(URLClassLoader.java:212)


FAILED:  junit.framework.TestSuite.org.apache.lucene.search.TestPrefixInBooleanQuery

Error Message:
null

Stack Trace:
junit.framework.AssertionFailedError
	at org.apache.lucene.util.LuceneTestCase.initRandom(LuceneTestCase.java:230)
	at org.apache.lucene.util.LuceneTestCase.beforeClassLuceneTestCaseJ4(LuceneTestCase.java:241)


FAILED:  junit.framework.TestSuite.org.apache.lucene.search.TestPrefixInBooleanQuery

Error Message:
null

Stack Trace:
java.lang.NullPointerException
	at org.apache.lucene.search.TestPrefixInBooleanQuery.afterClass(TestPrefixInBooleanQuery.java:79)


FAILED:  junit.framework.TestSuite.org.apache.lucene.search.TestPrefixInBooleanQuery

Error Message:
org/apache/lucene/util/ThreeLongs

Stack Trace:
java.lang.NoClassDefFoundError: org/apache/lucene/util/ThreeLongs
	at org.apache.lucene.util.LuceneTestCase.reportPartialFailureInfo(LuceneTestCase.java:1279)
	at org.apache.lucene.util.LuceneTestCase.afterClassLuceneTestCaseJ4(LuceneTestCase.java:387)


FAILED:  <init>.org.apache.lucene.search.TestPrefixRandom

Error Message:
org.apache.lucene.search.TestPrefixRandom

Stack Trace:
java.lang.ClassNotFoundException: org.apache.lucene.search.TestPrefixRandom
	at java.net.URLClassLoader$1.run(URLClassLoader.java:214)
	at java.security.AccessController.doPrivileged(Native Method)
	at java.net.URLClassLoader.findClass(URLClassLoader.java:205)
	at java.lang.ClassLoader.loadClass(ClassLoader.java:321)
	at sun.misc.Launcher$AppClassLoader.loadClass(Launcher.java:294)
	at java.lang.ClassLoader.loadClass(ClassLoader.java:266)
	at java.lang.Class.forName0(Native Method)
	at java.lang.Class.forName(Class.java:186)
Caused by: java.io.FileNotFoundException: /usr/home/hudson/hudson-slave/workspace/Lucene-trunk/checkout/lucene/build/classes/test/org/apache/lucene/search/TestPrefixRandom.class (Too many open files in system)
	at java.io.FileInputStream.open(Native Method)
	at java.io.FileInputStream.<init>(FileInputStream.java:137)
	at sun.misc.URLClassPath$FileLoader$1.getInputStream(URLClassPath.java:1005)
	at sun.misc.Resource.cachedInputStream(Resource.java:77)
	at sun.misc.Resource.getByteBuffer(Resource.java:160)
	at java.net.URLClassLoader.defineClass(URLClassLoader.java:266)
	at java.net.URLClassLoader.access$000(URLClassLoader.java:73)
	at java.net.URLClassLoader$1.run(URLClassLoader.java:212)


FAILED:  junit.framework.TestSuite.org.apache.lucene.search.TestQueryTermVector

Error Message:
null

Stack Trace:
junit.framework.AssertionFailedError
	at org.apache.lucene.util.LuceneTestCase.initRandom(LuceneTestCase.java:230)
	at org.apache.lucene.util.LuceneTestCase.beforeClassLuceneTestCaseJ4(LuceneTestCase.java:241)


FAILED:  junit.framework.TestSuite.org.apache.lucene.search.TestQueryTermVector

Error Message:
org/apache/lucene/util/ThreeLongs

Stack Trace:
java.lang.NoClassDefFoundError: org/apache/lucene/util/ThreeLongs
	at org.apache.lucene.util.LuceneTestCase.reportPartialFailureInfo(LuceneTestCase.java:1279)
	at org.apache.lucene.util.LuceneTestCase.afterClassLuceneTestCaseJ4(LuceneTestCase.java:387)


FAILED:  junit.framework.TestSuite.org.apache.lucene.search.TestScorerPerf

Error Message:
null

Stack Trace:
junit.framework.AssertionFailedError
	at org.apache.lucene.util.LuceneTestCase.initRandom(LuceneTestCase.java:230)
	at org.apache.lucene.util.LuceneTestCase.beforeClassLuceneTestCaseJ4(LuceneTestCase.java:241)


FAILED:  junit.framework.TestSuite.org.apache.lucene.search.TestScorerPerf

Error Message:
org/apache/lucene/util/ThreeLongs

Stack Trace:
java.lang.NoClassDefFoundError: org/apache/lucene/util/ThreeLongs
	at org.apache.lucene.util.LuceneTestCase.reportPartialFailureInfo(LuceneTestCase.java:1279)
	at org.apache.lucene.util.LuceneTestCase.afterClassLuceneTestCaseJ4(LuceneTestCase.java:387)


FAILED:  <init>.org.apache.lucene.search.TestSearchWithThreads

Error Message:
org.apache.lucene.search.TestSearchWithThreads

Stack Trace:
java.lang.ClassNotFoundException: org.apache.lucene.search.TestSearchWithThreads
	at java.net.URLClassLoader$1.run(URLClassLoader.java:214)
	at java.security.AccessController.doPrivileged(Native Method)
	at java.net.URLClassLoader.findClass(URLClassLoader.java:205)
	at java.lang.ClassLoader.loadClass(ClassLoader.java:321)
	at sun.misc.Launcher$AppClassLoader.loadClass(Launcher.java:294)
	at java.lang.ClassLoader.loadClass(ClassLoader.java:266)
	at java.lang.Class.forName0(Native Method)
	at java.lang.Class.forName(Class.java:186)
Caused by: java.io.FileNotFoundException: /usr/home/hudson/hudson-slave/workspace/Lucene-trunk/checkout/lucene/build/classes/test/org/apache/lucene/search/TestSearchWithThreads.class (Too many open files in system)
	at java.io.FileInputStream.open(Native Method)
	at java.io.FileInputStream.<init>(FileInputStream.java:137)
	at sun.misc.URLClassPath$FileLoader$1.getInputStream(URLClassPath.java:1005)
	at sun.misc.Resource.cachedInputStream(Resource.java:77)
	at sun.misc.Resource.getByteBuffer(Resource.java:160)
	at java.net.URLClassLoader.defineClass(URLClassLoader.java:266)
	at java.net.URLClassLoader.access$000(URLClassLoader.java:73)
	at java.net.URLClassLoader$1.run(URLClassLoader.java:212)


FAILED:  <init>.org.apache.lucene.search.TestSimilarity

Error Message:
org.apache.lucene.search.TestSimilarity

Stack Trace:
java.lang.ClassNotFoundException: org.apache.lucene.search.TestSimilarity
	at java.net.URLClassLoader$1.run(URLClassLoader.java:214)
	at java.security.AccessController.doPrivileged(Native Method)
	at java.net.URLClassLoader.findClass(URLClassLoader.java:205)
	at java.lang.ClassLoader.loadClass(ClassLoader.java:321)
	at sun.misc.Launcher$AppClassLoader.loadClass(Launcher.java:294)
	at java.lang.ClassLoader.loadClass(ClassLoader.java:266)
	at java.lang.Class.forName0(Native Method)
	at java.lang.Class.forName(Class.java:186)
Caused by: java.io.FileNotFoundException: /usr/home/hudson/hudson-slave/workspace/Lucene-trunk/checkout/lucene/build/classes/test/org/apache/lucene/search/TestSimilarity.class (Too many open files in system)
	at java.io.FileInputStream.open(Native Method)
	at java.io.FileInputStream.<init>(FileInputStream.java:137)
	at sun.misc.URLClassPath$FileLoader$1.getInputStream(URLClassPath.java:1005)
	at sun.misc.Resource.cachedInputStream(Resource.java:77)
	at sun.misc.Resource.getByteBuffer(Resource.java:160)
	at java.net.URLClassLoader.defineClass(URLClassLoader.java:266)
	at java.net.URLClassLoader.access$000(URLClassLoader.java:73)
	at java.net.URLClassLoader$1.run(URLClassLoader.java:212)


FAILED:  junit.framework.TestSuite.org.apache.lucene.search.TestSimpleExplanations

Error Message:
null

Stack Trace:
junit.framework.AssertionFailedError
	at org.apache.lucene.util.LuceneTestCase.initRandom(LuceneTestCase.java:230)
	at org.apache.lucene.util.LuceneTestCase.beforeClassLuceneTestCaseJ4(LuceneTestCase.java:241)


FAILED:  junit.framework.TestSuite.org.apache.lucene.search.TestSimpleExplanations

Error Message:
null

Stack Trace:
java.lang.NullPointerException
	at org.apache.lucene.search.TestExplanations.afterClassTestExplanations(TestExplanations.java:64)


FAILED:  junit.framework.TestSuite.org.apache.lucene.search.TestSimpleExplanations

Error Message:
org/apache/lucene/util/ThreeLongs

Stack Trace:
java.lang.NoClassDefFoundError: org/apache/lucene/util/ThreeLongs
	at org.apache.lucene.util.LuceneTestCase.reportPartialFailureInfo(LuceneTestCase.java:1279)
	at org.apache.lucene.util.LuceneTestCase.afterClassLuceneTestCaseJ4(LuceneTestCase.java:387)


FAILED:  junit.framework.TestSuite.org.apache.lucene.search.TestSloppyPhraseQuery

Error Message:
null

Stack Trace:
junit.framework.AssertionFailedError
	at org.apache.lucene.util.LuceneTestCase.initRandom(LuceneTestCase.java:230)
	at org.apache.lucene.util.LuceneTestCase.beforeClassLuceneTestCaseJ4(LuceneTestCase.java:241)


FAILED:  junit.framework.TestSuite.org.apache.lucene.search.TestSloppyPhraseQuery

Error Message:
org/apache/lucene/util/ThreeLongs

Stack Trace:
java.lang.NoClassDefFoundError: org/apache/lucene/util/ThreeLongs
	at org.apache.lucene.util.LuceneTestCase.reportPartialFailureInfo(LuceneTestCase.java:1279)
	at org.apache.lucene.util.LuceneTestCase.afterClassLuceneTestCaseJ4(LuceneTestCase.java:387)


REGRESSION:  org.apache.lucene.search.TestSort.testParallelMultiSort

Error Message:
expected:<[DJAIHGFEBC]> but was:<[ACEGIDJHFB]>

Stack Trace:
	at org.apache.lucene.search.TestSort.assertMatches(TestSort.java:1245)
	at org.apache.lucene.search.TestSort.assertMatches(TestSort.java:1216)
	at org.apache.lucene.search.TestSort.runMultiSorts(TestSort.java:1193)
	at org.apache.lucene.search.TestSort.testParallelMultiSort(TestSort.java:855)
	at org.apache.lucene.util.LuceneTestCase$3$1.evaluate(LuceneTestCase.java:523)
	at org.apache.lucene.util.LuceneTestCaseRunner.runChild(LuceneTestCaseRunner.java:149)
	at org.apache.lucene.util.LuceneTestCaseRunner.runChild(LuceneTestCaseRunner.java:51)


FAILED:  <init>.org.apache.lucene.search.TestSubScorerFreqs

Error Message:
org.apache.lucene.search.TestSubScorerFreqs

Stack Trace:
java.lang.ClassNotFoundException: org.apache.lucene.search.TestSubScorerFreqs
	at java.net.URLClassLoader$1.run(URLClassLoader.java:214)
	at java.security.AccessController.doPrivileged(Native Method)
	at java.net.URLClassLoader.findClass(URLClassLoader.java:205)
	at java.lang.ClassLoader.loadClass(ClassLoader.java:321)
	at sun.misc.Launcher$AppClassLoader.loadClass(Launcher.java:294)
	at java.lang.ClassLoader.loadClass(ClassLoader.java:266)
	at java.lang.Class.forName0(Native Method)
	at java.lang.Class.forName(Class.java:186)
Caused by: java.io.FileNotFoundException: /usr/home/hudson/hudson-slave/workspace/Lucene-trunk/checkout/lucene/build/classes/test/org/apache/lucene/search/TestSubScorerFreqs.class (Too many open files in system)
	at java.io.FileInputStream.open(Native Method)
	at java.io.FileInputStream.<init>(FileInputStream.java:137)
	at sun.misc.URLClassPath$FileLoader$1.getInputStream(URLClassPath.java:1005)
	at sun.misc.Resource.cachedInputStream(Resource.java:77)
	at sun.misc.Resource.getByteBuffer(Resource.java:160)
	at java.net.URLClassLoader.defineClass(URLClassLoader.java:266)
	at java.net.URLClassLoader.access$000(URLClassLoader.java:73)
	at java.net.URLClassLoader$1.run(URLClassLoader.java:212)


FAILED:  junit.framework.TestSuite.org.apache.lucene.search.TestTermRangeFilter

Error Message:
null

Stack Trace:
junit.framework.AssertionFailedError
	at org.apache.lucene.util.LuceneTestCase.initRandom(LuceneTestCase.java:230)
	at org.apache.lucene.util.LuceneTestCase.beforeClassLuceneTestCaseJ4(LuceneTestCase.java:241)


FAILED:  junit.framework.TestSuite.org.apache.lucene.search.TestTermRangeFilter

Error Message:
null

Stack Trace:
java.lang.NullPointerException
	at org.apache.lucene.search.BaseTestRangeFilter.afterClassBaseTestRangeFilter(BaseTestRangeFilter.java:106)


FAILED:  junit.framework.TestSuite.org.apache.lucene.search.TestTermRangeFilter

Error Message:
org/apache/lucene/util/ThreeLongs

Stack Trace:
java.lang.NoClassDefFoundError: org/apache/lucene/util/ThreeLongs
	at org.apache.lucene.util.LuceneTestCase.reportPartialFailureInfo(LuceneTestCase.java:1279)
	at org.apache.lucene.util.LuceneTestCase.afterClassLuceneTestCaseJ4(LuceneTestCase.java:387)


FAILED:  <init>.org.apache.lucene.search.TestTermRangeQuery

Error Message:
org.apache.lucene.search.TestTermRangeQuery

Stack Trace:
java.lang.ClassNotFoundException: org.apache.lucene.search.TestTermRangeQuery
	at java.net.URLClassLoader$1.run(URLClassLoader.java:214)
	at java.security.AccessController.doPrivileged(Native Method)
	at java.net.URLClassLoader.findClass(URLClassLoader.java:205)
	at java.lang.ClassLoader.loadClass(ClassLoader.java:321)
	at sun.misc.Launcher$AppClassLoader.loadClass(Launcher.java:294)
	at java.lang.ClassLoader.loadClass(ClassLoader.java:266)
	at java.lang.Class.forName0(Native Method)
	at java.lang.Class.forName(Class.java:186)
Caused by: java.io.FileNotFoundException: /usr/home/hudson/hudson-slave/workspace/Lucene-trunk/checkout/lucene/build/classes/test/org/apache/lucene/search/TestTermRangeQuery.class (Too many open files in system)
	at java.io.FileInputStream.open(Native Method)
	at java.io.FileInputStream.<init>(FileInputStream.java:137)
	at sun.misc.URLClassPath$FileLoader$1.getInputStream(URLClassPath.java:1005)
	at sun.misc.Resource.cachedInputStream(Resource.java:77)
	at sun.misc.Resource.getByteBuffer(Resource.java:160)
	at java.net.URLClassLoader.defineClass(URLClassLoader.java:266)
	at java.net.URLClassLoader.access$000(URLClassLoader.java:73)
	at java.net.URLClassLoader$1.run(URLClassLoader.java:212)


FAILED:  junit.framework.TestSuite.org.apache.lucene.search.TestTermScorer

Error Message:
null

Stack Trace:
junit.framework.AssertionFailedError
	at org.apache.lucene.util.LuceneTestCase.initRandom(LuceneTestCase.java:230)
	at org.apache.lucene.util.LuceneTestCase.beforeClassLuceneTestCaseJ4(LuceneTestCase.java:241)


FAILED:  junit.framework.TestSuite.org.apache.lucene.search.TestTermScorer

Error Message:
org/apache/lucene/util/ThreeLongs

Stack Trace:
java.lang.NoClassDefFoundError: org/apache/lucene/util/ThreeLongs
	at org.apache.lucene.util.LuceneTestCase.reportPartialFailureInfo(LuceneTestCase.java:1279)
	at org.apache.lucene.util.LuceneTestCase.afterClassLuceneTestCaseJ4(LuceneTestCase.java:387)


FAILED:  <init>.org.apache.lucene.search.TestTopDocsCollector

Error Message:
org.apache.lucene.search.TestTopDocsCollector

Stack Trace:
java.lang.ClassNotFoundException: org.apache.lucene.search.TestTopDocsCollector
	at java.net.URLClassLoader$1.run(URLClassLoader.java:214)
	at java.security.AccessController.doPrivileged(Native Method)
	at java.net.URLClassLoader.findClass(URLClassLoader.java:205)
	at java.lang.ClassLoader.loadClass(ClassLoader.java:321)
	at sun.misc.Launcher$AppClassLoader.loadClass(Launcher.java:294)
	at java.lang.ClassLoader.loadClass(ClassLoader.java:266)
	at java.lang.Class.forName0(Native Method)
	at java.lang.Class.forName(Class.java:186)
Caused by: java.io.FileNotFoundException: /usr/home/hudson/hudson-slave/workspace/Lucene-trunk/checkout/lucene/build/classes/test/org/apache/lucene/search/TestTopDocsCollector.class (Too many open files in system)
	at java.io.FileInputStream.open(Native Method)
	at java.io.FileInputStream.<init>(FileInputStream.java:137)
	at sun.misc.URLClassPath$FileLoader$1.getInputStream(URLClassPath.java:1005)
	at sun.misc.Resource.cachedInputStream(Resource.java:77)
	at sun.misc.Resource.getByteBuffer(Resource.java:160)
	at java.net.URLClassLoader.defineClass(URLClassLoader.java:266)
	at java.net.URLClassLoader.access$000(URLClassLoader.java:73)
	at java.net.URLClassLoader$1.run(URLClassLoader.java:212)


FAILED:  <init>.org.apache.lucene.search.TestTopScoreDocCollector

Error Message:
org.apache.lucene.search.TestTopScoreDocCollector

Stack Trace:
java.lang.ClassNotFoundException: org.apache.lucene.search.TestTopScoreDocCollector
	at java.net.URLClassLoader$1.run(URLClassLoader.java:214)
	at java.security.AccessController.doPrivileged(Native Method)
	at java.net.URLClassLoader.findClass(URLClassLoader.java:205)
	at java.lang.ClassLoader.loadClass(ClassLoader.java:321)
	at sun.misc.Launcher$AppClassLoader.loadClass(Launcher.java:294)
	at java.lang.ClassLoader.loadClass(ClassLoader.java:266)
	at java.lang.Class.forName0(Native Method)
	at java.lang.Class.forName(Class.java:186)
Caused by: java.io.FileNotFoundException: /usr/home/hudson/hudson-slave/workspace/Lucene-trunk/checkout/lucene/build/classes/test/org/apache/lucene/search/TestTopScoreDocCollector.class (Too many open files in system)
	at java.io.FileInputStream.open(Native Method)
	at java.io.FileInputStream.<init>(FileInputStream.java:137)
	at sun.misc.URLClassPath$FileLoader$1.getInputStream(URLClassPath.java:1005)
	at sun.misc.Resource.cachedInputStream(Resource.java:77)
	at sun.misc.Resource.getByteBuffer(Resource.java:160)
	at java.net.URLClassLoader.defineClass(URLClassLoader.java:266)
	at java.net.URLClassLoader.access$000(URLClassLoader.java:73)
	at java.net.URLClassLoader$1.run(URLClassLoader.java:212)


FAILED:  <init>.org.apache.lucene.search.TestWildcardRandom

Error Message:
org.apache.lucene.search.TestWildcardRandom

Stack Trace:
java.lang.ClassNotFoundException: org.apache.lucene.search.TestWildcardRandom
	at java.net.URLClassLoader$1.run(URLClassLoader.java:214)
	at java.security.AccessController.doPrivileged(Native Method)
	at java.net.URLClassLoader.findClass(URLClassLoader.java:205)
	at java.lang.ClassLoader.loadClass(ClassLoader.java:321)
	at sun.misc.Launcher$AppClassLoader.loadClass(Launcher.java:294)
	at java.lang.ClassLoader.loadClass(ClassLoader.java:266)
	at java.lang.Class.forName0(Native Method)
	at java.lang.Class.forName(Class.java:186)
Caused by: java.io.FileNotFoundException: /usr/home/hudson/hudson-slave/workspace/Lucene-trunk/checkout/lucene/build/classes/test/org/apache/lucene/search/TestWildcardRandom.class (Too many open files in system)
	at java.io.FileInputStream.open(Native Method)
	at java.io.FileInputStream.<init>(FileInputStream.java:137)
	at sun.misc.URLClassPath$FileLoader$1.getInputStream(URLClassPath.java:1005)
	at sun.misc.Resource.cachedInputStream(Resource.java:77)
	at sun.misc.Resource.getByteBuffer(Resource.java:160)
	at java.net.URLClassLoader.defineClass(URLClassLoader.java:266)
	at java.net.URLClassLoader.access$000(URLClassLoader.java:73)
	at java.net.URLClassLoader$1.run(URLClassLoader.java:212)


FAILED:  <init>.org.apache.lucene.search.payloads.TestPayloadNearQuery

Error Message:
org.apache.lucene.search.payloads.TestPayloadNearQuery

Stack Trace:
java.lang.ClassNotFoundException: org.apache.lucene.search.payloads.TestPayloadNearQuery
	at java.net.URLClassLoader$1.run(URLClassLoader.java:214)
	at java.security.AccessController.doPrivileged(Native Method)
	at java.net.URLClassLoader.findClass(URLClassLoader.java:205)
	at java.lang.ClassLoader.loadClass(ClassLoader.java:321)
	at sun.misc.Launcher$AppClassLoader.loadClass(Launcher.java:294)
	at java.lang.ClassLoader.loadClass(ClassLoader.java:266)
	at java.lang.Class.forName0(Native Method)
	at java.lang.Class.forName(Class.java:186)
Caused by: java.io.FileNotFoundException: /usr/home/hudson/hudson-slave/workspace/Lucene-trunk/checkout/lucene/build/classes/test/org/apache/lucene/search/payloads/TestPayloadNearQuery.class (Too many open files in system)
	at java.io.FileInputStream.open(Native Method)
	at java.io.FileInputStream.<init>(FileInputStream.java:137)
	at sun.misc.URLClassPath$FileLoader$1.getInputStream(URLClassPath.java:1005)
	at sun.misc.Resource.cachedInputStream(Resource.java:77)
	at sun.misc.Resource.getByteBuffer(Resource.java:160)
	at java.net.URLClassLoader.defineClass(URLClassLoader.java:266)
	at java.net.URLClassLoader.access$000(URLClassLoader.java:73)
	at java.net.URLClassLoader$1.run(URLClassLoader.java:212)


FAILED:  junit.framework.TestSuite.org.apache.lucene.search.spans.TestFieldMaskingSpanQuery

Error Message:
null

Stack Trace:
junit.framework.AssertionFailedError
	at org.apache.lucene.util.LuceneTestCase.initRandom(LuceneTestCase.java:230)
	at org.apache.lucene.util.LuceneTestCase.beforeClassLuceneTestCaseJ4(LuceneTestCase.java:241)


FAILED:  junit.framework.TestSuite.org.apache.lucene.search.spans.TestFieldMaskingSpanQuery

Error Message:
null

Stack Trace:
java.lang.NullPointerException
	at org.apache.lucene.search.spans.TestFieldMaskingSpanQuery.afterClass(TestFieldMaskingSpanQuery.java:122)


FAILED:  junit.framework.TestSuite.org.apache.lucene.search.spans.TestFieldMaskingSpanQuery

Error Message:
org/apache/lucene/util/ThreeLongs

Stack Trace:
java.lang.NoClassDefFoundError: org/apache/lucene/util/ThreeLongs
	at org.apache.lucene.util.LuceneTestCase.reportPartialFailureInfo(LuceneTestCase.java:1279)
	at org.apache.lucene.util.LuceneTestCase.afterClassLuceneTestCaseJ4(LuceneTestCase.java:387)


FAILED:  <init>.org.apache.lucene.search.spans.TestSpanExplanations

Error Message:
org.apache.lucene.search.spans.TestSpanExplanations

Stack Trace:
java.lang.ClassNotFoundException: org.apache.lucene.search.spans.TestSpanExplanations
	at java.net.URLClassLoader$1.run(URLClassLoader.java:214)
	at java.security.AccessController.doPrivileged(Native Method)
	at java.net.URLClassLoader.findClass(URLClassLoader.java:205)
	at java.lang.ClassLoader.loadClass(ClassLoader.java:321)
	at sun.misc.Launcher$AppClassLoader.loadClass(Launcher.java:294)
	at java.lang.ClassLoader.loadClass(ClassLoader.java:266)
	at java.lang.Class.forName0(Native Method)
	at java.lang.Class.forName(Class.java:186)
Caused by: java.io.FileNotFoundException: /usr/home/hudson/hudson-slave/workspace/Lucene-trunk/checkout/lucene/build/classes/test/org/apache/lucene/search/spans/TestSpanExplanations.class (Too many open files in system)
	at java.io.FileInputStream.open(Native Method)
	at java.io.FileInputStream.<init>(FileInputStream.java:137)
	at sun.misc.URLClassPath$FileLoader$1.getInputStream(URLClassPath.java:1005)
	at sun.misc.Resource.cachedInputStream(Resource.java:77)
	at sun.misc.Resource.getByteBuffer(Resource.java:160)
	at java.net.URLClassLoader.defineClass(URLClassLoader.java:266)
	at java.net.URLClassLoader.access$000(URLClassLoader.java:73)
	at java.net.URLClassLoader$1.run(URLClassLoader.java:212)


FAILED:  junit.framework.TestSuite.org.apache.lucene.search.spans.TestSpanFirstQuery

Error Message:
null

Stack Trace:
junit.framework.AssertionFailedError
	at org.apache.lucene.util.LuceneTestCase.initRandom(LuceneTestCase.java:230)
	at org.apache.lucene.util.LuceneTestCase.beforeClassLuceneTestCaseJ4(LuceneTestCase.java:241)


FAILED:  junit.framework.TestSuite.org.apache.lucene.search.spans.TestSpanFirstQuery

Error Message:
org/apache/lucene/util/ThreeLongs

Stack Trace:
java.lang.NoClassDefFoundError: org/apache/lucene/util/ThreeLongs
	at org.apache.lucene.util.LuceneTestCase.reportPartialFailureInfo(LuceneTestCase.java:1279)
	at org.apache.lucene.util.LuceneTestCase.afterClassLuceneTestCaseJ4(LuceneTestCase.java:387)


FAILED:  <init>.org.apache.lucene.search.spans.TestSpansAdvanced

Error Message:
org.apache.lucene.search.spans.TestSpansAdvanced

Stack Trace:
java.lang.ClassNotFoundException: org.apache.lucene.search.spans.TestSpansAdvanced
	at java.net.URLClassLoader$1.run(URLClassLoader.java:214)
	at java.security.AccessController.doPrivileged(Native Method)
	at java.net.URLClassLoader.findClass(URLClassLoader.java:205)
	at java.lang.ClassLoader.loadClass(ClassLoader.java:321)
	at sun.misc.Launcher$AppClassLoader.loadClass(Launcher.java:294)
	at java.lang.ClassLoader.loadClass(ClassLoader.java:266)
	at java.lang.Class.forName0(Native Method)
	at java.lang.Class.forName(Class.java:186)
Caused by: java.io.FileNotFoundException: /usr/home/hudson/hudson-slave/workspace/Lucene-trunk/checkout/lucene/build/classes/test/org/apache/lucene/search/spans/TestSpansAdvanced.class (Too many open files in system)
	at java.io.FileInputStream.open(Native Method)
	at java.io.FileInputStream.<init>(FileInputStream.java:137)
	at sun.misc.URLClassPath$FileLoader$1.getInputStream(URLClassPath.java:1005)
	at sun.misc.Resource.cachedInputStream(Resource.java:77)
	at sun.misc.Resource.getByteBuffer(Resource.java:160)
	at java.net.URLClassLoader.defineClass(URLClassLoader.java:266)
	at java.net.URLClassLoader.access$000(URLClassLoader.java:73)
	at java.net.URLClassLoader$1.run(URLClassLoader.java:212)


FAILED:  <init>.org.apache.lucene.search.spans.TestSpansAdvanced2

Error Message:
org.apache.lucene.search.spans.TestSpansAdvanced2

Stack Trace:
java.lang.ClassNotFoundException: org.apache.lucene.search.spans.TestSpansAdvanced2
	at java.net.URLClassLoader$1.run(URLClassLoader.java:214)
	at java.security.AccessController.doPrivileged(Native Method)
	at java.net.URLClassLoader.findClass(URLClassLoader.java:205)
	at java.lang.ClassLoader.loadClass(ClassLoader.java:321)
	at sun.misc.Launcher$AppClassLoader.loadClass(Launcher.java:294)
	at java.lang.ClassLoader.loadClass(ClassLoader.java:266)
	at java.lang.Class.forName0(Native Method)
	at java.lang.Class.forName(Class.java:186)
Caused by: java.io.FileNotFoundException: /usr/home/hudson/hudson-slave/workspace/Lucene-trunk/checkout/lucene/build/classes/test/org/apache/lucene/search/spans/TestSpansAdvanced2.class (Too many open files in system)
	at java.io.FileInputStream.open(Native Method)
	at java.io.FileInputStream.<init>(FileInputStream.java:137)
	at sun.misc.URLClassPath$FileLoader$1.getInputStream(URLClassPath.java:1005)
	at sun.misc.Resource.cachedInputStream(Resource.java:77)
	at sun.misc.Resource.getByteBuffer(Resource.java:160)
	at java.net.URLClassLoader.defineClass(URLClassLoader.java:266)
	at java.net.URLClassLoader.access$000(URLClassLoader.java:73)
	at java.net.URLClassLoader$1.run(URLClassLoader.java:212)


FAILED:  <init>.org.apache.lucene.store.TestCopyBytes

Error Message:
org.apache.lucene.store.TestCopyBytes

Stack Trace:
java.lang.ClassNotFoundException: org.apache.lucene.store.TestCopyBytes
	at java.net.URLClassLoader$1.run(URLClassLoader.java:214)
	at java.security.AccessController.doPrivileged(Native Method)
	at java.net.URLClassLoader.findClass(URLClassLoader.java:205)
	at java.lang.ClassLoader.loadClass(ClassLoader.java:321)
	at sun.misc.Launcher$AppClassLoader.loadClass(Launcher.java:294)
	at java.lang.ClassLoader.loadClass(ClassLoader.java:266)
	at java.lang.Class.forName0(Native Method)
	at java.lang.Class.forName(Class.java:186)
Caused by: java.io.FileNotFoundException: /usr/home/hudson/hudson-slave/workspace/Lucene-trunk/checkout/lucene/build/classes/test/org/apache/lucene/store/TestCopyBytes.class (Too many open files in system)
	at java.io.FileInputStream.open(Native Method)
	at java.io.FileInputStream.<init>(FileInputStream.java:137)
	at sun.misc.URLClassPath$FileLoader$1.getInputStream(URLClassPath.java:1005)
	at sun.misc.Resource.cachedInputStream(Resource.java:77)
	at sun.misc.Resource.getByteBuffer(Resource.java:160)
	at java.net.URLClassLoader.defineClass(URLClassLoader.java:266)
	at java.net.URLClassLoader.access$000(URLClassLoader.java:73)
	at java.net.URLClassLoader$1.run(URLClassLoader.java:212)


FAILED:  <init>.org.apache.lucene.store.TestLockFactory

Error Message:
org.apache.lucene.store.TestLockFactory

Stack Trace:
java.lang.ClassNotFoundException: org.apache.lucene.store.TestLockFactory
	at java.net.URLClassLoader$1.run(URLClassLoader.java:214)
	at java.security.AccessController.doPrivileged(Native Method)
	at java.net.URLClassLoader.findClass(URLClassLoader.java:205)
	at java.lang.ClassLoader.loadClass(ClassLoader.java:321)
	at sun.misc.Launcher$AppClassLoader.loadClass(Launcher.java:294)
	at java.lang.ClassLoader.loadClass(ClassLoader.java:266)
	at java.lang.Class.forName0(Native Method)
	at java.lang.Class.forName(Class.java:186)
Caused by: java.io.FileNotFoundException: /usr/home/hudson/hudson-slave/workspace/Lucene-trunk/checkout/lucene/build/classes/test/org/apache/lucene/store/TestLockFactory.class (Too many open files in system)
	at java.io.FileInputStream.open(Native Method)
	at java.io.FileInputStream.<init>(FileInputStream.java:137)
	at sun.misc.URLClassPath$FileLoader$1.getInputStream(URLClassPath.java:1005)
	at sun.misc.Resource.cachedInputStream(Resource.java:77)
	at sun.misc.Resource.getByteBuffer(Resource.java:160)
	at java.net.URLClassLoader.defineClass(URLClassLoader.java:266)
	at java.net.URLClassLoader.access$000(URLClassLoader.java:73)
	at java.net.URLClassLoader$1.run(URLClassLoader.java:212)


FAILED:  junit.framework.TestSuite.org.apache.lucene.store.TestMultiMMap

Error Message:
null

Stack Trace:
junit.framework.AssertionFailedError
	at org.apache.lucene.util.LuceneTestCase.initRandom(LuceneTestCase.java:230)
	at org.apache.lucene.util.LuceneTestCase.beforeClassLuceneTestCaseJ4(LuceneTestCase.java:241)


FAILED:  junit.framework.TestSuite.org.apache.lucene.store.TestMultiMMap

Error Message:
org/apache/lucene/util/ThreeLongs

Stack Trace:
java.lang.NoClassDefFoundError: org/apache/lucene/util/ThreeLongs
	at org.apache.lucene.util.LuceneTestCase.reportPartialFailureInfo(LuceneTestCase.java:1279)
	at org.apache.lucene.util.LuceneTestCase.afterClassLuceneTestCaseJ4(LuceneTestCase.java:387)


FAILED:  <init>.org.apache.lucene.store.TestRAMDirectory

Error Message:
org.apache.lucene.store.TestRAMDirectory

Stack Trace:
java.lang.ClassNotFoundException: org.apache.lucene.store.TestRAMDirectory
	at java.net.URLClassLoader$1.run(URLClassLoader.java:214)
	at java.security.AccessController.doPrivileged(Native Method)
	at java.net.URLClassLoader.findClass(URLClassLoader.java:205)
	at java.lang.ClassLoader.loadClass(ClassLoader.java:321)
	at sun.misc.Launcher$AppClassLoader.loadClass(Launcher.java:294)
	at java.lang.ClassLoader.loadClass(ClassLoader.java:266)
	at java.lang.Class.forName0(Native Method)
	at java.lang.Class.forName(Class.java:186)
Caused by: java.io.FileNotFoundException: /usr/home/hudson/hudson-slave/workspace/Lucene-trunk/checkout/lucene/build/classes/test/org/apache/lucene/store/TestRAMDirectory.class (Too many open files in system)
	at java.io.FileInputStream.open(Native Method)
	at java.io.FileInputStream.<init>(FileInputStream.java:137)
	at sun.misc.URLClassPath$FileLoader$1.getInputStream(URLClassPath.java:1005)
	at sun.misc.Resource.cachedInputStream(Resource.java:77)
	at sun.misc.Resource.getByteBuffer(Resource.java:160)
	at java.net.URLClassLoader.defineClass(URLClassLoader.java:266)
	at java.net.URLClassLoader.access$000(URLClassLoader.java:73)
	at java.net.URLClassLoader$1.run(URLClassLoader.java:212)


FAILED:  <init>.org.apache.lucene.util.TestAttributeSource

Error Message:
org.apache.lucene.util.TestAttributeSource

Stack Trace:
java.lang.ClassNotFoundException: org.apache.lucene.util.TestAttributeSource
	at java.net.URLClassLoader$1.run(URLClassLoader.java:214)
	at java.security.AccessController.doPrivileged(Native Method)
	at java.net.URLClassLoader.findClass(URLClassLoader.java:205)
	at java.lang.ClassLoader.loadClass(ClassLoader.java:321)
	at sun.misc.Launcher$AppClassLoader.loadClass(Launcher.java:294)
	at java.lang.ClassLoader.loadClass(ClassLoader.java:266)
	at java.lang.Class.forName0(Native Method)
	at java.lang.Class.forName(Class.java:186)
Caused by: java.io.FileNotFoundException: /usr/home/hudson/hudson-slave/workspace/Lucene-trunk/checkout/lucene/build/classes/test/org/apache/lucene/util/TestAttributeSource.class (Too many open files in system)
	at java.io.FileInputStream.open(Native Method)
	at java.io.FileInputStream.<init>(FileInputStream.java:137)
	at sun.misc.URLClassPath$FileLoader$1.getInputStream(URLClassPath.java:1005)
	at sun.misc.Resource.cachedInputStream(Resource.java:77)
	at sun.misc.Resource.getByteBuffer(Resource.java:160)
	at java.net.URLClassLoader.defineClass(URLClassLoader.java:266)
	at java.net.URLClassLoader.access$000(URLClassLoader.java:73)
	at java.net.URLClassLoader$1.run(URLClassLoader.java:212)


FAILED:  junit.framework.TestSuite.org.apache.lucene.util.TestBitVector

Error Message:
null

Stack Trace:
junit.framework.AssertionFailedError
	at org.apache.lucene.util.LuceneTestCase.initRandom(LuceneTestCase.java:230)
	at org.apache.lucene.util.LuceneTestCase.beforeClassLuceneTestCaseJ4(LuceneTestCase.java:241)


FAILED:  junit.framework.TestSuite.org.apache.lucene.util.TestBitVector

Error Message:
org/apache/lucene/util/ThreeLongs

Stack Trace:
java.lang.NoClassDefFoundError: org/apache/lucene/util/ThreeLongs
	at org.apache.lucene.util.LuceneTestCase.reportPartialFailureInfo(LuceneTestCase.java:1279)
	at org.apache.lucene.util.LuceneTestCase.afterClassLuceneTestCaseJ4(LuceneTestCase.java:387)


FAILED:  <init>.org.apache.lucene.util.TestByteBlockPool

Error Message:
org.apache.lucene.util.TestByteBlockPool

Stack Trace:
java.lang.ClassNotFoundException: org.apache.lucene.util.TestByteBlockPool
	at java.net.URLClassLoader$1.run(URLClassLoader.java:214)
	at java.security.AccessController.doPrivileged(Native Method)
	at java.net.URLClassLoader.findClass(URLClassLoader.java:205)
	at java.lang.ClassLoader.loadClass(ClassLoader.java:321)
	at sun.misc.Launcher$AppClassLoader.loadClass(Launcher.java:294)
	at java.lang.ClassLoader.loadClass(ClassLoader.java:266)
	at java.lang.Class.forName0(Native Method)
	at java.lang.Class.forName(Class.java:186)
Caused by: java.io.FileNotFoundException: /usr/home/hudson/hudson-slave/workspace/Lucene-trunk/checkout/lucene/build/classes/test/org/apache/lucene/util/TestByteBlockPool.class (Too many open files in system)
	at java.io.FileInputStream.open(Native Method)
	at java.io.FileInputStream.<init>(FileInputStream.java:137)
	at sun.misc.URLClassPath$FileLoader$1.getInputStream(URLClassPath.java:1005)
	at sun.misc.Resource.cachedInputStream(Resource.java:77)
	at sun.misc.Resource.getByteBuffer(Resource.java:160)
	at java.net.URLClassLoader.defineClass(URLClassLoader.java:266)
	at java.net.URLClassLoader.access$000(URLClassLoader.java:73)
	at java.net.URLClassLoader$1.run(URLClassLoader.java:212)


FAILED:  <init>.org.apache.lucene.util.TestBytesRefHash

Error Message:
org.apache.lucene.util.TestBytesRefHash

Stack Trace:
java.lang.ClassNotFoundException: org.apache.lucene.util.TestBytesRefHash
	at java.net.URLClassLoader$1.run(URLClassLoader.java:214)
	at java.security.AccessController.doPrivileged(Native Method)
	at java.net.URLClassLoader.findClass(URLClassLoader.java:205)
	at java.lang.ClassLoader.loadClass(ClassLoader.java:321)
	at sun.misc.Launcher$AppClassLoader.loadClass(Launcher.java:294)
	at java.lang.ClassLoader.loadClass(ClassLoader.java:266)
	at java.lang.Class.forName0(Native Method)
	at java.lang.Class.forName(Class.java:186)
Caused by: java.io.FileNotFoundException: /usr/home/hudson/hudson-slave/workspace/Lucene-trunk/checkout/lucene/build/classes/test/org/apache/lucene/util/TestBytesRefHash.class (Too many open files in system)
	at java.io.FileInputStream.open(Native Method)
	at java.io.FileInputStream.<init>(FileInputStream.java:137)
	at sun.misc.URLClassPath$FileLoader$1.getInputStream(URLClassPath.java:1005)
	at sun.misc.Resource.cachedInputStream(Resource.java:77)
	at sun.misc.Resource.getByteBuffer(Resource.java:160)
	at java.net.URLClassLoader.defineClass(URLClassLoader.java:266)
	at java.net.URLClassLoader.access$000(URLClassLoader.java:73)
	at java.net.URLClassLoader$1.run(URLClassLoader.java:212)


FAILED:  junit.framework.TestSuite.org.apache.lucene.util.TestCollectionUtil

Error Message:
null

Stack Trace:
junit.framework.AssertionFailedError
	at org.apache.lucene.util.LuceneTestCase.initRandom(LuceneTestCase.java:230)
	at org.apache.lucene.util.LuceneTestCase.beforeClassLuceneTestCaseJ4(LuceneTestCase.java:241)


FAILED:  junit.framework.TestSuite.org.apache.lucene.util.TestCollectionUtil

Error Message:
org/apache/lucene/util/ThreeLongs

Stack Trace:
java.lang.NoClassDefFoundError: org/apache/lucene/util/ThreeLongs
	at org.apache.lucene.util.LuceneTestCase.reportPartialFailureInfo(LuceneTestCase.java:1279)
	at org.apache.lucene.util.LuceneTestCase.afterClassLuceneTestCaseJ4(LuceneTestCase.java:387)


FAILED:  junit.framework.TestSuite.org.apache.lucene.util.TestDoubleBarrelLRUCache

Error Message:
null

Stack Trace:
junit.framework.AssertionFailedError
	at org.apache.lucene.util.LuceneTestCase.initRandom(LuceneTestCase.java:230)
	at org.apache.lucene.util.LuceneTestCase.beforeClassLuceneTestCaseJ4(LuceneTestCase.java:241)


FAILED:  junit.framework.TestSuite.org.apache.lucene.util.TestDoubleBarrelLRUCache

Error Message:
org/apache/lucene/util/ThreeLongs

Stack Trace:
java.lang.NoClassDefFoundError: org/apache/lucene/util/ThreeLongs
	at org.apache.lucene.util.LuceneTestCase.reportPartialFailureInfo(LuceneTestCase.java:1279)
	at org.apache.lucene.util.LuceneTestCase.afterClassLuceneTestCaseJ4(LuceneTestCase.java:387)


FAILED:  <init>.org.apache.lucene.util.TestFixedBitSet

Error Message:
org.apache.lucene.util.TestFixedBitSet

Stack Trace:
java.lang.ClassNotFoundException: org.apache.lucene.util.TestFixedBitSet
	at java.net.URLClassLoader$1.run(URLClassLoader.java:214)
	at java.security.AccessController.doPrivileged(Native Method)
	at java.net.URLClassLoader.findClass(URLClassLoader.java:205)
	at java.lang.ClassLoader.loadClass(ClassLoader.java:321)
	at sun.misc.Launcher$AppClassLoader.loadClass(Launcher.java:294)
	at java.lang.ClassLoader.loadClass(ClassLoader.java:266)
	at java.lang.Class.forName0(Native Method)
	at java.lang.Class.forName(Class.java:186)
Caused by: java.io.FileNotFoundException: /usr/home/hudson/hudson-slave/workspace/Lucene-trunk/checkout/lucene/build/classes/test/org/apache/lucene/util/TestFixedBitSet.class (Too many open files in system)
	at java.io.FileInputStream.open(Native Method)
	at java.io.FileInputStream.<init>(FileInputStream.java:137)
	at sun.misc.URLClassPath$FileLoader$1.getInputStream(URLClassPath.java:1005)
	at sun.misc.Resource.cachedInputStream(Resource.java:77)
	at sun.misc.Resource.getByteBuffer(Resource.java:160)
	at java.net.URLClassLoader.defineClass(URLClassLoader.java:266)
	at java.net.URLClassLoader.access$000(URLClassLoader.java:73)
	at java.net.URLClassLoader$1.run(URLClassLoader.java:212)


FAILED:  <init>.org.apache.lucene.util.TestOpenBitSet

Error Message:
org.apache.lucene.util.TestOpenBitSet

Stack Trace:
java.lang.ClassNotFoundException: org.apache.lucene.util.TestOpenBitSet
	at java.net.URLClassLoader$1.run(URLClassLoader.java:214)
	at java.security.AccessController.doPrivileged(Native Method)
	at java.net.URLClassLoader.findClass(URLClassLoader.java:205)
	at java.lang.ClassLoader.loadClass(ClassLoader.java:321)
	at sun.misc.Launcher$AppClassLoader.loadClass(Launcher.java:294)
	at java.lang.ClassLoader.loadClass(ClassLoader.java:266)
	at java.lang.Class.forName0(Native Method)
	at java.lang.Class.forName(Class.java:186)
Caused by: java.io.FileNotFoundException: /usr/home/hudson/hudson-slave/workspace/Lucene-trunk/checkout/lucene/build/classes/test/org/apache/lucene/util/TestOpenBitSet.class (Too many open files in system)
	at java.io.FileInputStream.open(Native Method)
	at java.io.FileInputStream.<init>(FileInputStream.java:137)
	at sun.misc.URLClassPath$FileLoader$1.getInputStream(URLClassPath.java:1005)
	at sun.misc.Resource.cachedInputStream(Resource.java:77)
	at sun.misc.Resource.getByteBuffer(Resource.java:160)
	at java.net.URLClassLoader.defineClass(URLClassLoader.java:266)
	at java.net.URLClassLoader.access$000(URLClassLoader.java:73)
	at java.net.URLClassLoader$1.run(URLClassLoader.java:212)


FAILED:  <init>.org.apache.lucene.util.TestPagedBytes

Error Message:
org.apache.lucene.util.TestPagedBytes

Stack Trace:
java.lang.ClassNotFoundException: org.apache.lucene.util.TestPagedBytes
	at java.net.URLClassLoader$1.run(URLClassLoader.java:214)
	at java.security.AccessController.doPrivileged(Native Method)
	at java.net.URLClassLoader.findClass(URLClassLoader.java:205)
	at java.lang.ClassLoader.loadClass(ClassLoader.java:321)
	at sun.misc.Launcher$AppClassLoader.loadClass(Launcher.java:294)
	at java.lang.ClassLoader.loadClass(ClassLoader.java:266)
	at java.lang.Class.forName0(Native Method)
	at java.lang.Class.forName(Class.java:186)
Caused by: java.io.FileNotFoundException: /usr/home/hudson/hudson-slave/workspace/Lucene-trunk/checkout/lucene/build/classes/test/org/apache/lucene/util/TestPagedBytes.class (Too many open files in system)
	at java.io.FileInputStream.open(Native Method)
	at java.io.FileInputStream.<init>(FileInputStream.java:137)
	at sun.misc.URLClassPath$FileLoader$1.getInputStream(URLClassPath.java:1005)
	at sun.misc.Resource.cachedInputStream(Resource.java:77)
	at sun.misc.Resource.getByteBuffer(Resource.java:160)
	at java.net.URLClassLoader.defineClass(URLClassLoader.java:266)
	at java.net.URLClassLoader.access$000(URLClassLoader.java:73)
	at java.net.URLClassLoader$1.run(URLClassLoader.java:212)


FAILED:  <init>.org.apache.lucene.util.TestTwoPhaseCommitTool

Error Message:
org.apache.lucene.util.TestTwoPhaseCommitTool

Stack Trace:
java.lang.ClassNotFoundException: org.apache.lucene.util.TestTwoPhaseCommitTool
	at java.net.URLClassLoader$1.run(URLClassLoader.java:214)
	at java.security.AccessController.doPrivileged(Native Method)
	at java.net.URLClassLoader.findClass(URLClassLoader.java:205)
	at java.lang.ClassLoader.loadClass(ClassLoader.java:321)
	at sun.misc.Launcher$AppClassLoader.loadClass(Launcher.java:294)
	at java.lang.ClassLoader.loadClass(ClassLoader.java:266)
	at java.lang.Class.forName0(Native Method)
	at java.lang.Class.forName(Class.java:186)
Caused by: java.io.FileNotFoundException: /usr/home/hudson/hudson-slave/workspace/Lucene-trunk/checkout/lucene/build/classes/test/org/apache/lucene/util/TestTwoPhaseCommitTool.class (Too many open files in system)
	at java.io.FileInputStream.open(Native Method)
	at java.io.FileInputStream.<init>(FileInputStream.java:137)
	at sun.misc.URLClassPath$FileLoader$1.getInputStream(URLClassPath.java:1005)
	at sun.misc.Resource.cachedInputStream(Resource.java:77)
	at sun.misc.Resource.getByteBuffer(Resource.java:160)
	at java.net.URLClassLoader.defineClass(URLClassLoader.java:266)
	at java.net.URLClassLoader.access$000(URLClassLoader.java:73)
	at java.net.URLClassLoader$1.run(URLClassLoader.java:212)


FAILED:  junit.framework.TestSuite.org.apache.lucene.util.TestUnicodeUtil

Error Message:
null

Stack Trace:
junit.framework.AssertionFailedError
	at org.apache.lucene.util.LuceneTestCase.initRandom(LuceneTestCase.java:230)
	at org.apache.lucene.util.LuceneTestCase.beforeClassLuceneTestCaseJ4(LuceneTestCase.java:241)


FAILED:  junit.framework.TestSuite.org.apache.lucene.util.TestUnicodeUtil

Error Message:
org/apache/lucene/util/ThreeLongs

Stack Trace:
java.lang.NoClassDefFoundError: org/apache/lucene/util/ThreeLongs
	at org.apache.lucene.util.LuceneTestCase.reportPartialFailureInfo(LuceneTestCase.java:1279)
	at org.apache.lucene.util.LuceneTestCase.afterClassLuceneTestCaseJ4(LuceneTestCase.java:387)


FAILED:  <init>.org.apache.lucene.util.automaton.TestDeterminism

Error Message:
org.apache.lucene.util.automaton.TestDeterminism

Stack Trace:
java.lang.ClassNotFoundException: org.apache.lucene.util.automaton.TestDeterminism
	at java.net.URLClassLoader$1.run(URLClassLoader.java:214)
	at java.security.AccessController.doPrivileged(Native Method)
	at java.net.URLClassLoader.findClass(URLClassLoader.java:205)
	at java.lang.ClassLoader.loadClass(ClassLoader.java:321)
	at sun.misc.Launcher$AppClassLoader.loadClass(Launcher.java:294)
	at java.lang.ClassLoader.loadClass(ClassLoader.java:266)
	at java.lang.Class.forName0(Native Method)
	at java.lang.Class.forName(Class.java:186)
Caused by: java.io.FileNotFoundException: /usr/home/hudson/hudson-slave/workspace/Lucene-trunk/checkout/lucene/build/classes/test/org/apache/lucene/util/automaton/TestDeterminism.class (Too many open files in system)
	at java.io.FileInputStream.open(Native Method)
	at java.io.FileInputStream.<init>(FileInputStream.java:137)
	at sun.misc.URLClassPath$FileLoader$1.getInputStream(URLClassPath.java:1005)
	at sun.misc.Resource.cachedInputStream(Resource.java:77)
	at sun.misc.Resource.getByteBuffer(Resource.java:160)
	at java.net.URLClassLoader.defineClass(URLClassLoader.java:266)
	at java.net.URLClassLoader.access$000(URLClassLoader.java:73)
	at java.net.URLClassLoader$1.run(URLClassLoader.java:212)


FAILED:  junit.framework.TestSuite.org.apache.lucene.util.automaton.TestLevenshteinAutomata

Error Message:
null

Stack Trace:
junit.framework.AssertionFailedError
	at org.apache.lucene.util.LuceneTestCase.initRandom(LuceneTestCase.java:230)
	at org.apache.lucene.util.LuceneTestCase.beforeClassLuceneTestCaseJ4(LuceneTestCase.java:241)


FAILED:  junit.framework.TestSuite.org.apache.lucene.util.automaton.TestLevenshteinAutomata

Error Message:
org/apache/lucene/util/ThreeLongs

Stack Trace:
java.lang.NoClassDefFoundError: org/apache/lucene/util/ThreeLongs
	at org.apache.lucene.util.LuceneTestCase.reportPartialFailureInfo(LuceneTestCase.java:1279)
	at org.apache.lucene.util.LuceneTestCase.afterClassLuceneTestCaseJ4(LuceneTestCase.java:387)


FAILED:  <init>.org.apache.lucene.util.automaton.TestUTF32ToUTF8

Error Message:
org.apache.lucene.util.automaton.TestUTF32ToUTF8

Stack Trace:
java.lang.ClassNotFoundException: org.apache.lucene.util.automaton.TestUTF32ToUTF8
	at java.net.URLClassLoader$1.run(URLClassLoader.java:214)
	at java.security.AccessController.doPrivileged(Native Method)
	at java.net.URLClassLoader.findClass(URLClassLoader.java:205)
	at java.lang.ClassLoader.loadClass(ClassLoader.java:321)
	at sun.misc.Launcher$AppClassLoader.loadClass(Launcher.java:294)
	at java.lang.ClassLoader.loadClass(ClassLoader.java:266)
	at java.lang.Class.forName0(Native Method)
	at java.lang.Class.forName(Class.java:186)
Caused by: java.io.FileNotFoundException: /usr/home/hudson/hudson-slave/workspace/Lucene-trunk/checkout/lucene/build/classes/test/org/apache/lucene/util/automaton/TestUTF32ToUTF8.class (Too many open files in system)
	at java.io.FileInputStream.open(Native Method)
	at java.io.FileInputStream.<init>(FileInputStream.java:137)
	at sun.misc.URLClassPath$FileLoader$1.getInputStream(URLClassPath.java:1005)
	at sun.misc.Resource.cachedInputStream(Resource.java:77)
	at sun.misc.Resource.getByteBuffer(Resource.java:160)
	at java.net.URLClassLoader.defineClass(URLClassLoader.java:266)
	at java.net.URLClassLoader.access$000(URLClassLoader.java:73)
	at java.net.URLClassLoader$1.run(URLClassLoader.java:212)


FAILED:  <init>.org.apache.lucene.util.packed.TestPackedInts

Error Message:
org.apache.lucene.util.packed.TestPackedInts

Stack Trace:
java.lang.ClassNotFoundException: org.apache.lucene.util.packed.TestPackedInts
	at java.net.URLClassLoader$1.run(URLClassLoader.java:214)
	at java.security.AccessController.doPrivileged(Native Method)
	at java.net.URLClassLoader.findClass(URLClassLoader.java:205)
	at java.lang.ClassLoader.loadClass(ClassLoader.java:321)
	at sun.misc.Launcher$AppClassLoader.loadClass(Launcher.java:294)
	at java.lang.ClassLoader.loadClass(ClassLoader.java:266)
	at java.lang.Class.forName0(Native Method)
	at java.lang.Class.forName(Class.java:186)
Caused by: java.io.FileNotFoundException: /usr/home/hudson/hudson-slave/workspace/Lucene-trunk/checkout/lucene/build/classes/test/org/apache/lucene/util/packed/TestPackedInts.class (Too many open files in system)
	at java.io.FileInputStream.open(Native Method)
	at java.io.FileInputStream.<init>(FileInputStream.java:137)
	at sun.misc.URLClassPath$FileLoader$1.getInputStream(URLClassPath.java:1005)
	at sun.misc.Resource.cachedInputStream(Resource.java:77)
	at sun.misc.Resource.getByteBuffer(Resource.java:160)
	at java.net.URLClassLoader.defineClass(URLClassLoader.java:266)
	at java.net.URLClassLoader.access$000(URLClassLoader.java:73)
	at java.net.URLClassLoader$1.run(URLClassLoader.java:212)




Build Log (for compile errors):
[...truncated 15500 lines...]



---------------------------------------------------------------------
To unsubscribe, e-mail: dev-unsubscribe@lucene.apache.org
For additional commands, e-mail: dev-help@lucene.apache.org


Mime
View raw message