lucene-dev mailing list archives

Site index · List index
Message view « Date » · « Thread »
Top « Date » · « Thread »
From Apache Jenkins Server <jenk...@builds.apache.org>
Subject [JENKINS] Lucene-Solr-tests-only-3.x-java7 - Build # 985 - Failure
Date Thu, 17 Nov 2011 21:00:57 GMT
Build: https://builds.apache.org/job/Lucene-Solr-tests-only-3.x-java7/985/

1 tests failed.
REGRESSION:  org.apache.solr.handler.component.DistributedSpellCheckComponentTest.testDistribSearch

Error Message:
java.lang.AssertionError: Some threads threw uncaught exceptions!

Stack Trace:
java.lang.RuntimeException: java.lang.AssertionError: Some threads threw uncaught exceptions!
	at org.apache.lucene.util.LuceneTestCase.tearDown(LuceneTestCase.java:571)
	at org.apache.solr.SolrTestCaseJ4.tearDown(SolrTestCaseJ4.java:96)
	at org.apache.solr.BaseDistributedSearchTestCase.tearDown(BaseDistributedSearchTestCase.java:160)
	at org.apache.solr.handler.component.DistributedSpellCheckComponentTest.tearDown(DistributedSpellCheckComponentTest.java:50)
	at org.apache.lucene.util.LuceneTestCaseRunner.runChild(LuceneTestCaseRunner.java:147)
	at org.apache.lucene.util.LuceneTestCaseRunner.runChild(LuceneTestCaseRunner.java:50)
	at org.apache.lucene.util.LuceneTestCase.checkUncaughtExceptionsAfter(LuceneTestCase.java:599)
	at org.apache.lucene.util.LuceneTestCase.tearDown(LuceneTestCase.java:543)




Build Log (for compile errors):
[...truncated 14357 lines...]



---------------------------------------------------------------------
To unsubscribe, e-mail: dev-unsubscribe@lucene.apache.org
For additional commands, e-mail: dev-help@lucene.apache.org


Mime
View raw message