lucene-dev mailing list archives

Site index · List index
Message view « Date » · « Thread »
Top « Date » · « Thread »
From Apache Jenkins Server <jenk...@builds.apache.org>
Subject [JENKINS] Lucene-Solr-tests-only-3.x-java7 - Build # 1069 - Failure
Date Fri, 25 Nov 2011 19:16:56 GMT
Build: https://builds.apache.org/job/Lucene-Solr-tests-only-3.x-java7/1069/

3 tests failed.
FAILED:  junit.framework.TestSuite.org.apache.solr.handler.admin.ShowFileRequestHandlerTest

Error Message:
Jetty/Solr unresponsive

Stack Trace:
java.lang.RuntimeException: Jetty/Solr unresponsive
	at org.apache.solr.client.solrj.embedded.JettySolrRunner.waitForSolr(JettySolrRunner.java:151)
	at org.apache.solr.client.solrj.embedded.JettySolrRunner.start(JettySolrRunner.java:113)
	at org.apache.solr.client.solrj.embedded.JettySolrRunner.start(JettySolrRunner.java:105)
	at org.apache.solr.SolrJettyTestBase.createJetty(SolrJettyTestBase.java:57)
	at org.apache.solr.handler.admin.ShowFileRequestHandlerTest.beforeTest(ShowFileRequestHandlerTest.java:43)
Caused by: java.io.IOException: Server returned HTTP response code: 500 for URL: http://localhost:15027/solr/select?q={!raw+f=junit_test_query}ping
	at sun.net.www.protocol.http.HttpURLConnection.getInputStream(HttpURLConnection.java:1612)
	at java.net.URL.openStream(URL.java:1035)
	at org.apache.solr.client.solrj.embedded.JettySolrRunner.waitForSolr(JettySolrRunner.java:139)


REGRESSION:  org.apache.solr.handler.component.DistributedTermsComponentTest.testDistribSearch

Error Message:
Jetty/Solr unresponsive

Stack Trace:
java.lang.RuntimeException: Jetty/Solr unresponsive
	at org.apache.solr.client.solrj.embedded.JettySolrRunner.waitForSolr(JettySolrRunner.java:151)
	at org.apache.solr.client.solrj.embedded.JettySolrRunner.start(JettySolrRunner.java:113)
	at org.apache.solr.client.solrj.embedded.JettySolrRunner.start(JettySolrRunner.java:105)
	at org.apache.solr.BaseDistributedSearchTestCase.createJetty(BaseDistributedSearchTestCase.java:193)
	at org.apache.solr.BaseDistributedSearchTestCase.createServers(BaseDistributedSearchTestCase.java:164)
	at org.apache.solr.BaseDistributedSearchTestCase.testDistribSearch(BaseDistributedSearchTestCase.java:554)
	at org.apache.lucene.util.LuceneTestCase$2$1.evaluate(LuceneTestCase.java:432)
	at org.apache.lucene.util.LuceneTestCaseRunner.runChild(LuceneTestCaseRunner.java:147)
	at org.apache.lucene.util.LuceneTestCaseRunner.runChild(LuceneTestCaseRunner.java:50)
Caused by: java.io.IOException: Server returned HTTP response code: 500 for URL: http://localhost:60529/solr/select?q={!raw+f=junit_test_query}ping
	at sun.net.www.protocol.http.HttpURLConnection.getInputStream(HttpURLConnection.java:1612)
	at java.net.URL.openStream(URL.java:1035)
	at org.apache.solr.client.solrj.embedded.JettySolrRunner.waitForSolr(JettySolrRunner.java:139)


FAILED:  junit.framework.TestSuite.org.apache.solr.handler.component.DistributedTermsComponentTest

Error Message:
ERROR: SolrIndexSearcher opens=1 closes=0

Stack Trace:
junit.framework.AssertionFailedError: ERROR: SolrIndexSearcher opens=1 closes=0
	at org.apache.solr.SolrTestCaseJ4.endTrackingSearchers(SolrTestCaseJ4.java:137)
	at org.apache.solr.SolrTestCaseJ4.afterClassSolrTestCase(SolrTestCaseJ4.java:74)




Build Log (for compile errors):
[...truncated 15070 lines...]



---------------------------------------------------------------------
To unsubscribe, e-mail: dev-unsubscribe@lucene.apache.org
For additional commands, e-mail: dev-help@lucene.apache.org


Mime
View raw message