lucene-dev mailing list archives

Site index · List index
Message view « Date » · « Thread »
Top « Date » · « Thread »
From Apache Jenkins Server <jenk...@builds.apache.org>
Subject [JENKINS] Lucene-Solr-tests-only-trunk - Build # 11236 - Failure
Date Wed, 09 Nov 2011 12:35:35 GMT
Build: https://builds.apache.org/job/Lucene-Solr-tests-only-trunk/11236/

14 tests failed.
REGRESSION:  org.apache.solr.cloud.CloudStateUpdateTest.testCoreRegistration

Error Message:
null

Stack Trace:
org.apache.solr.common.cloud.ZooKeeperException: 
	at org.apache.solr.core.CoreContainer.load(CoreContainer.java:430)
	at org.apache.solr.core.CoreContainer$Initializer.initialize(CoreContainer.java:244)
	at org.apache.solr.cloud.CloudStateUpdateTest.setUp(CloudStateUpdateTest.java:121)
	at org.apache.lucene.util.LuceneTestCaseRunner.runChild(LuceneTestCaseRunner.java:149)
	at org.apache.lucene.util.LuceneTestCaseRunner.runChild(LuceneTestCaseRunner.java:51)
Caused by: org.apache.zookeeper.KeeperException$ConnectionLossException: KeeperErrorCode =
ConnectionLoss for /collections
	at org.apache.zookeeper.KeeperException.create(KeeperException.java:90)
	at org.apache.zookeeper.KeeperException.create(KeeperException.java:42)
	at org.apache.zookeeper.ZooKeeper.getChildren(ZooKeeper.java:1243)
	at org.apache.solr.common.cloud.SolrZkClient.getChildren(SolrZkClient.java:198)
	at org.apache.solr.common.cloud.ZkStateReader.makeShardZkNodeWatches(ZkStateReader.java:182)
	at org.apache.solr.core.CoreContainer.load(CoreContainer.java:419)


FAILED:  junit.framework.TestSuite.org.apache.solr.cloud.CloudStateUpdateTest

Error Message:
ERROR: SolrIndexSearcher opens=4 closes=3

Stack Trace:
junit.framework.AssertionFailedError: ERROR: SolrIndexSearcher opens=4 closes=3
	at org.apache.solr.SolrTestCaseJ4.endTrackingSearchers(SolrTestCaseJ4.java:126)
	at org.apache.solr.SolrTestCaseJ4.afterClassSolrTestCase(SolrTestCaseJ4.java:74)


REGRESSION:  org.apache.solr.core.TestArbitraryIndexDir.testLoadNewIndexDir

Error Message:
org.apache.solr.common.cloud.ZooKeeperException: 

Stack Trace:
java.lang.RuntimeException: org.apache.solr.common.cloud.ZooKeeperException: 
	at org.apache.solr.util.TestHarness.<init>(TestHarness.java:152)
	at org.apache.solr.util.TestHarness.<init>(TestHarness.java:135)
	at org.apache.solr.util.TestHarness.<init>(TestHarness.java:125)
	at org.apache.solr.core.TestArbitraryIndexDir.setUp(TestArbitraryIndexDir.java:57)
	at org.apache.lucene.util.LuceneTestCaseRunner.runChild(LuceneTestCaseRunner.java:149)
	at org.apache.lucene.util.LuceneTestCaseRunner.runChild(LuceneTestCaseRunner.java:51)
Caused by: org.apache.solr.common.cloud.ZooKeeperException: 
	at org.apache.solr.core.CoreContainer.initZooKeeper(CoreContainer.java:185)
	at org.apache.solr.util.TestHarness$Initializer$1.<init>(TestHarness.java:209)
	at org.apache.solr.util.TestHarness$Initializer.initialize(TestHarness.java:204)
	at org.apache.solr.util.TestHarness.<init>(TestHarness.java:140)
Caused by: java.util.concurrent.TimeoutException: Could not connect to ZooKeeper 127.0.0.1:37682/solr
within 5000 ms
	at org.apache.solr.common.cloud.ConnectionManager.waitForConnected(ConnectionManager.java:124)
	at org.apache.solr.common.cloud.SolrZkClient.<init>(SolrZkClient.java:121)
	at org.apache.solr.common.cloud.SolrZkClient.<init>(SolrZkClient.java:69)
	at org.apache.solr.cloud.ZkController.<init>(ZkController.java:104)
	at org.apache.solr.core.CoreContainer.initZooKeeper(CoreContainer.java:166)


FAILED:  junit.framework.TestSuite.org.apache.solr.handler.FieldAnalysisRequestHandlerTest

Error Message:
org.apache.solr.common.cloud.ZooKeeperException: 

Stack Trace:
java.lang.RuntimeException: org.apache.solr.common.cloud.ZooKeeperException: 
	at org.apache.solr.util.TestHarness.<init>(TestHarness.java:152)
	at org.apache.solr.util.TestHarness.<init>(TestHarness.java:135)
	at org.apache.solr.util.TestHarness.<init>(TestHarness.java:125)
	at org.apache.solr.SolrTestCaseJ4.initCore(SolrTestCaseJ4.java:245)
	at org.apache.solr.SolrTestCaseJ4.initCore(SolrTestCaseJ4.java:103)
	at org.apache.solr.SolrTestCaseJ4.initCore(SolrTestCaseJ4.java:92)
	at org.apache.solr.handler.FieldAnalysisRequestHandlerTest.beforeClass(FieldAnalysisRequestHandlerTest.java:55)
Caused by: org.apache.solr.common.cloud.ZooKeeperException: 
	at org.apache.solr.core.CoreContainer.initZooKeeper(CoreContainer.java:185)
	at org.apache.solr.util.TestHarness$Initializer$1.<init>(TestHarness.java:209)
	at org.apache.solr.util.TestHarness$Initializer.initialize(TestHarness.java:204)
	at org.apache.solr.util.TestHarness.<init>(TestHarness.java:140)
Caused by: java.util.concurrent.TimeoutException: Could not connect to ZooKeeper 127.0.0.1:37682/solr
within 5000 ms
	at org.apache.solr.common.cloud.ConnectionManager.waitForConnected(ConnectionManager.java:124)
	at org.apache.solr.common.cloud.SolrZkClient.<init>(SolrZkClient.java:121)
	at org.apache.solr.common.cloud.SolrZkClient.<init>(SolrZkClient.java:69)
	at org.apache.solr.cloud.ZkController.<init>(ZkController.java:104)
	at org.apache.solr.core.CoreContainer.initZooKeeper(CoreContainer.java:166)


REGRESSION:  org.apache.solr.handler.StandardRequestHandlerTest.testSorting

Error Message:
org.apache.solr.common.cloud.ZooKeeperException: 

Stack Trace:
java.lang.RuntimeException: org.apache.solr.common.cloud.ZooKeeperException: 
	at org.apache.solr.util.TestHarness.<init>(TestHarness.java:152)
	at org.apache.solr.util.TestHarness.<init>(TestHarness.java:135)
	at org.apache.solr.util.TestHarness.<init>(TestHarness.java:125)
	at org.apache.solr.util.AbstractSolrTestCase.setUp(AbstractSolrTestCase.java:143)
	at org.apache.solr.handler.StandardRequestHandlerTest.setUp(StandardRequestHandlerTest.java:40)
	at org.apache.lucene.util.LuceneTestCaseRunner.runChild(LuceneTestCaseRunner.java:149)
	at org.apache.lucene.util.LuceneTestCaseRunner.runChild(LuceneTestCaseRunner.java:51)
Caused by: org.apache.solr.common.cloud.ZooKeeperException: 
	at org.apache.solr.core.CoreContainer.initZooKeeper(CoreContainer.java:185)
	at org.apache.solr.util.TestHarness$Initializer$1.<init>(TestHarness.java:209)
	at org.apache.solr.util.TestHarness$Initializer.initialize(TestHarness.java:204)
	at org.apache.solr.util.TestHarness.<init>(TestHarness.java:140)
Caused by: java.util.concurrent.TimeoutException: Could not connect to ZooKeeper 127.0.0.1:37682/solr
within 5000 ms
	at org.apache.solr.common.cloud.ConnectionManager.waitForConnected(ConnectionManager.java:124)
	at org.apache.solr.common.cloud.SolrZkClient.<init>(SolrZkClient.java:121)
	at org.apache.solr.common.cloud.SolrZkClient.<init>(SolrZkClient.java:69)
	at org.apache.solr.cloud.ZkController.<init>(ZkController.java:104)
	at org.apache.solr.core.CoreContainer.initZooKeeper(CoreContainer.java:166)


REGRESSION:  org.apache.solr.handler.component.DistributedTermsComponentTest.testDistribSearch

Error Message:
Severe errors in solr configuration.  Check your log files for more detailed information on
what may be wrong.  ------------------------------------------------------------- org.apache.solr.common.cloud.ZooKeeperException:
  at org.apache.solr.core.CoreContainer.initZooKeeper(CoreContainer.java:185)  at org.apache.solr.core.CoreContainer.load(CoreContainer.java:335)
 at org.apache.solr.core.CoreContainer.load(CoreContainer.java:292)  at org.apache.solr.core.CoreContainer$Initializer.initialize(CoreContainer.java:241)
 at org.apache.solr.servlet.SolrDispatchFilter.init(SolrDispatchFilter.java:93)  at org.mortbay.jetty.servlet.FilterHolder.doStart(FilterHolder.java:97)
 at org.mortbay.component.AbstractLifeCycle.start(AbstractLifeCycle.java:50)  at org.mortbay.jetty.servlet.ServletHandler.initialize(ServletHandler.java:713)
 at org.mortbay.jetty.servlet.ServletHandler.updateMappings(ServletHandler.java:1104)  at
org.mortbay.jetty.servlet.ServletHandler.setFilterMappings(ServletHandler.java:1140)  at org.mortbay.jetty.servlet.ServletHandler.addFilterWithMapping(ServletHandler.java:940)
 at org.mortbay.jetty.servlet.ServletHandler.addFilterWithMapping(ServletHandler.java:895)
 at org.mortbay.jetty.servlet.Context.addFilter(Context.java:207)  at org.apache.solr.client.solrj.embedded.JettySolrRunner$1.lifeCycleStarted(JettySolrRunner.java:98)
 at org.mortbay.component.AbstractLifeCycle.setStarted(AbstractLifeCycle.java:140)  at org.mortbay.component.AbstractLifeCycle.start(AbstractLifeCycle.java:52)
 at org.apache.solr.client.solrj.embedded.JettySolrRunner.start(JettySolrRunner.java:123)
 at org.apache.solr.client.solrj.embedded.JettySolrRunner.start(JettySolrRunner.java:118)
 at org.apache.solr.BaseDistributedSearchTestCase.createJetty(BaseDistributedSearchTestCase.java:245)
 at org.apache.solr.BaseDistributedSearchTestCase.createJetty(BaseDistributedSearchTestCase.java:232)
 at org.apache.solr.BaseDistributedSearchTestCase.createServers(BaseDistributedSearchTestCase.java:178)
 at org.apache.solr.BaseDistributedSearch  Severe errors in solr configuration.  Check your
log files for more detailed information on what may be wrong.  -------------------------------------------------------------
org.apache.solr.common.cloud.ZooKeeperException:   at org.apache.solr.core.CoreContainer.initZooKeeper(CoreContainer.java:185)
 at org.apache.solr.core.CoreContainer.load(CoreContainer.java:335)  at org.apache.solr.core.CoreContainer.load(CoreContainer.java:292)
 at org.apache.solr.core.CoreContainer$Initializer.initialize(CoreContainer.java:241)  at
org.apache.solr.servlet.SolrDispatchFilter.init(SolrDispatchFilter.java:93)  at org.mortbay.jetty.servlet.FilterHolder.doStart(FilterHolder.java:97)
 at org.mortbay.component.AbstractLifeCycle.start(AbstractLifeCycle.java:50)  at org.mortbay.jetty.servlet.ServletHandler.initialize(ServletHandler.java:713)
 at org.mortbay.jetty.servlet.ServletHandler.updateMappings(ServletHandler.java:1104)  at
org.mortbay.jetty.servlet.ServletHandler.setFilterMappings(ServletHandler.java:1140)  at org.mortbay.jetty.servlet.ServletHandler.addFilterWithMapping(ServletHandler.java:940)
 at org.mortbay.jetty.servlet.ServletHandler.addFilterWithMapping(ServletHandler.java:895)
 at org.mortbay.jetty.servlet.Context.addFilter(Context.java:207)  at org.apache.solr.client.solrj.embedded.JettySolrRunner$1.lifeCycleStarted(JettySolrRunner.java:98)
 at org.mortbay.component.AbstractLifeCycle.setStarted(AbstractLifeCycle.java:140)  at org.mortbay.component.AbstractLifeCycle.start(AbstractLifeCycle.java:52)
 at org.apache.solr.client.solrj.embedded.JettySolrRunner.start(JettySolrRunner.java:123)
 at org.apache.solr.client.solrj.embedded.JettySolrRunner.start(JettySolrRunner.java:118)
 at org.apache.solr.BaseDistributedSearchTestCase.createJetty(BaseDistributedSearchTestCase.java:245)
 at org.apache.solr.BaseDistributedSearchTestCase.createJetty(BaseDistributedSearchTestCase.java:232)
 at org.apache.solr.BaseDistributedSearchTestCase.createServers(BaseDistributedSearchTestCase.java:178)
 at org.apache.solr.BaseDistributedSearch  request: http://localhost:31233/solr/update?wt=javabin&version=2

Stack Trace:


request: http://localhost:31233/solr/update?wt=javabin&version=2
	at org.apache.solr.client.solrj.impl.CommonsHttpSolrServer.request(CommonsHttpSolrServer.java:436)
	at org.apache.solr.client.solrj.impl.CommonsHttpSolrServer.request(CommonsHttpSolrServer.java:246)
	at org.apache.solr.client.solrj.request.AbstractUpdateRequest.process(AbstractUpdateRequest.java:104)
	at org.apache.solr.client.solrj.SolrServer.deleteByQuery(SolrServer.java:249)
	at org.apache.solr.BaseDistributedSearchTestCase.del(BaseDistributedSearchTestCase.java:305)
	at org.apache.solr.handler.component.DistributedTermsComponentTest.doTest(DistributedTermsComponentTest.java:32)
	at org.apache.solr.BaseDistributedSearchTestCase.testDistribSearch(BaseDistributedSearchTestCase.java:599)
	at org.apache.lucene.util.LuceneTestCase$3$1.evaluate(LuceneTestCase.java:508)
	at org.apache.lucene.util.LuceneTestCaseRunner.runChild(LuceneTestCaseRunner.java:149)
	at org.apache.lucene.util.LuceneTestCaseRunner.runChild(LuceneTestCaseRunner.java:51)


REGRESSION:  org.apache.solr.highlight.HighlighterConfigTest.testConfig

Error Message:
org.apache.solr.common.cloud.ZooKeeperException: 

Stack Trace:
java.lang.RuntimeException: org.apache.solr.common.cloud.ZooKeeperException: 
	at org.apache.solr.util.TestHarness.<init>(TestHarness.java:152)
	at org.apache.solr.util.TestHarness.<init>(TestHarness.java:135)
	at org.apache.solr.util.TestHarness.<init>(TestHarness.java:125)
	at org.apache.solr.util.AbstractSolrTestCase.setUp(AbstractSolrTestCase.java:143)
	at org.apache.solr.highlight.HighlighterConfigTest.setUp(HighlighterConfigTest.java:34)
	at org.apache.lucene.util.LuceneTestCaseRunner.runChild(LuceneTestCaseRunner.java:149)
	at org.apache.lucene.util.LuceneTestCaseRunner.runChild(LuceneTestCaseRunner.java:51)
Caused by: org.apache.solr.common.cloud.ZooKeeperException: 
	at org.apache.solr.core.CoreContainer.initZooKeeper(CoreContainer.java:185)
	at org.apache.solr.util.TestHarness$Initializer$1.<init>(TestHarness.java:209)
	at org.apache.solr.util.TestHarness$Initializer.initialize(TestHarness.java:204)
	at org.apache.solr.util.TestHarness.<init>(TestHarness.java:140)
Caused by: java.util.concurrent.TimeoutException: Could not connect to ZooKeeper 127.0.0.1:37682/solr
within 5000 ms
	at org.apache.solr.common.cloud.ConnectionManager.waitForConnected(ConnectionManager.java:124)
	at org.apache.solr.common.cloud.SolrZkClient.<init>(SolrZkClient.java:121)
	at org.apache.solr.common.cloud.SolrZkClient.<init>(SolrZkClient.java:69)
	at org.apache.solr.cloud.ZkController.<init>(ZkController.java:104)
	at org.apache.solr.core.CoreContainer.initZooKeeper(CoreContainer.java:166)


REGRESSION:  org.apache.solr.request.TestWriterPerf.testPerf

Error Message:
org.apache.solr.common.cloud.ZooKeeperException: 

Stack Trace:
java.lang.RuntimeException: org.apache.solr.common.cloud.ZooKeeperException: 
	at org.apache.solr.util.TestHarness.<init>(TestHarness.java:152)
	at org.apache.solr.util.TestHarness.<init>(TestHarness.java:135)
	at org.apache.solr.util.TestHarness.<init>(TestHarness.java:125)
	at org.apache.solr.util.AbstractSolrTestCase.setUp(AbstractSolrTestCase.java:143)
	at org.apache.solr.request.TestWriterPerf.setUp(TestWriterPerf.java:50)
	at org.apache.lucene.util.LuceneTestCaseRunner.runChild(LuceneTestCaseRunner.java:149)
	at org.apache.lucene.util.LuceneTestCaseRunner.runChild(LuceneTestCaseRunner.java:51)
Caused by: org.apache.solr.common.cloud.ZooKeeperException: 
	at org.apache.solr.core.CoreContainer.initZooKeeper(CoreContainer.java:185)
	at org.apache.solr.util.TestHarness$Initializer$1.<init>(TestHarness.java:209)
	at org.apache.solr.util.TestHarness$Initializer.initialize(TestHarness.java:204)
	at org.apache.solr.util.TestHarness.<init>(TestHarness.java:140)
Caused by: java.util.concurrent.TimeoutException: Could not connect to ZooKeeper 127.0.0.1:37682/solr
within 5000 ms
	at org.apache.solr.common.cloud.ConnectionManager.waitForConnected(ConnectionManager.java:124)
	at org.apache.solr.common.cloud.SolrZkClient.<init>(SolrZkClient.java:121)
	at org.apache.solr.common.cloud.SolrZkClient.<init>(SolrZkClient.java:69)
	at org.apache.solr.cloud.ZkController.<init>(ZkController.java:104)
	at org.apache.solr.core.CoreContainer.initZooKeeper(CoreContainer.java:166)


FAILED:  junit.framework.TestSuite.org.apache.solr.schema.IndexSchemaTest

Error Message:
org.apache.solr.common.cloud.ZooKeeperException: 

Stack Trace:
java.lang.RuntimeException: org.apache.solr.common.cloud.ZooKeeperException: 
	at org.apache.solr.util.TestHarness.<init>(TestHarness.java:152)
	at org.apache.solr.util.TestHarness.<init>(TestHarness.java:135)
	at org.apache.solr.util.TestHarness.<init>(TestHarness.java:125)
	at org.apache.solr.SolrTestCaseJ4.initCore(SolrTestCaseJ4.java:245)
	at org.apache.solr.SolrTestCaseJ4.initCore(SolrTestCaseJ4.java:103)
	at org.apache.solr.SolrTestCaseJ4.initCore(SolrTestCaseJ4.java:92)
	at org.apache.solr.schema.IndexSchemaTest.beforeClass(IndexSchemaTest.java:38)
Caused by: org.apache.solr.common.cloud.ZooKeeperException: 
	at org.apache.solr.core.CoreContainer.initZooKeeper(CoreContainer.java:185)
	at org.apache.solr.util.TestHarness$Initializer$1.<init>(TestHarness.java:209)
	at org.apache.solr.util.TestHarness$Initializer.initialize(TestHarness.java:204)
	at org.apache.solr.util.TestHarness.<init>(TestHarness.java:140)
Caused by: java.util.concurrent.TimeoutException: Could not connect to ZooKeeper 127.0.0.1:37682/solr
within 5000 ms
	at org.apache.solr.common.cloud.ConnectionManager.waitForConnected(ConnectionManager.java:124)
	at org.apache.solr.common.cloud.SolrZkClient.<init>(SolrZkClient.java:121)
	at org.apache.solr.common.cloud.SolrZkClient.<init>(SolrZkClient.java:69)
	at org.apache.solr.cloud.ZkController.<init>(ZkController.java:104)
	at org.apache.solr.core.CoreContainer.initZooKeeper(CoreContainer.java:166)


FAILED:  junit.framework.TestSuite.org.apache.solr.search.TestFiltering

Error Message:
org.apache.solr.common.cloud.ZooKeeperException: 

Stack Trace:
java.lang.RuntimeException: org.apache.solr.common.cloud.ZooKeeperException: 
	at org.apache.solr.util.TestHarness.<init>(TestHarness.java:152)
	at org.apache.solr.util.TestHarness.<init>(TestHarness.java:135)
	at org.apache.solr.util.TestHarness.<init>(TestHarness.java:125)
	at org.apache.solr.SolrTestCaseJ4.initCore(SolrTestCaseJ4.java:245)
	at org.apache.solr.SolrTestCaseJ4.initCore(SolrTestCaseJ4.java:103)
	at org.apache.solr.SolrTestCaseJ4.initCore(SolrTestCaseJ4.java:92)
	at org.apache.solr.search.TestFiltering.beforeTests(TestFiltering.java:34)
Caused by: org.apache.solr.common.cloud.ZooKeeperException: 
	at org.apache.solr.core.CoreContainer.initZooKeeper(CoreContainer.java:185)
	at org.apache.solr.util.TestHarness$Initializer$1.<init>(TestHarness.java:209)
	at org.apache.solr.util.TestHarness$Initializer.initialize(TestHarness.java:204)
	at org.apache.solr.util.TestHarness.<init>(TestHarness.java:140)
Caused by: java.util.concurrent.TimeoutException: Could not connect to ZooKeeper 127.0.0.1:37682/solr
within 5000 ms
	at org.apache.solr.common.cloud.ConnectionManager.waitForConnected(ConnectionManager.java:124)
	at org.apache.solr.common.cloud.SolrZkClient.<init>(SolrZkClient.java:121)
	at org.apache.solr.common.cloud.SolrZkClient.<init>(SolrZkClient.java:69)
	at org.apache.solr.cloud.ZkController.<init>(ZkController.java:104)
	at org.apache.solr.core.CoreContainer.initZooKeeper(CoreContainer.java:166)


FAILED:  junit.framework.TestSuite.org.apache.solr.search.TestSolrQueryParser

Error Message:
org.apache.solr.common.cloud.ZooKeeperException: 

Stack Trace:
java.lang.RuntimeException: org.apache.solr.common.cloud.ZooKeeperException: 
	at org.apache.solr.util.TestHarness.<init>(TestHarness.java:152)
	at org.apache.solr.util.TestHarness.<init>(TestHarness.java:135)
	at org.apache.solr.util.TestHarness.<init>(TestHarness.java:125)
	at org.apache.solr.SolrTestCaseJ4.initCore(SolrTestCaseJ4.java:245)
	at org.apache.solr.SolrTestCaseJ4.initCore(SolrTestCaseJ4.java:103)
	at org.apache.solr.SolrTestCaseJ4.initCore(SolrTestCaseJ4.java:92)
	at org.apache.solr.search.TestSolrQueryParser.beforeClass(TestSolrQueryParser.java:28)
Caused by: org.apache.solr.common.cloud.ZooKeeperException: 
	at org.apache.solr.core.CoreContainer.initZooKeeper(CoreContainer.java:185)
	at org.apache.solr.util.TestHarness$Initializer$1.<init>(TestHarness.java:209)
	at org.apache.solr.util.TestHarness$Initializer.initialize(TestHarness.java:204)
	at org.apache.solr.util.TestHarness.<init>(TestHarness.java:140)
Caused by: java.util.concurrent.TimeoutException: Could not connect to ZooKeeper 127.0.0.1:37682/solr
within 5000 ms
	at org.apache.solr.common.cloud.ConnectionManager.waitForConnected(ConnectionManager.java:124)
	at org.apache.solr.common.cloud.SolrZkClient.<init>(SolrZkClient.java:121)
	at org.apache.solr.common.cloud.SolrZkClient.<init>(SolrZkClient.java:69)
	at org.apache.solr.cloud.ZkController.<init>(ZkController.java:104)
	at org.apache.solr.core.CoreContainer.initZooKeeper(CoreContainer.java:166)


FAILED:  junit.framework.TestSuite.org.apache.solr.search.similarities.TestLMDirichletSimilarityFactory

Error Message:
org.apache.solr.common.cloud.ZooKeeperException: 

Stack Trace:
java.lang.RuntimeException: org.apache.solr.common.cloud.ZooKeeperException: 
	at org.apache.solr.util.TestHarness.<init>(TestHarness.java:152)
	at org.apache.solr.util.TestHarness.<init>(TestHarness.java:135)
	at org.apache.solr.util.TestHarness.<init>(TestHarness.java:125)
	at org.apache.solr.SolrTestCaseJ4.initCore(SolrTestCaseJ4.java:245)
	at org.apache.solr.SolrTestCaseJ4.initCore(SolrTestCaseJ4.java:103)
	at org.apache.solr.SolrTestCaseJ4.initCore(SolrTestCaseJ4.java:92)
	at org.apache.solr.search.similarities.TestLMDirichletSimilarityFactory.beforeClass(TestLMDirichletSimilarityFactory.java:30)
Caused by: org.apache.solr.common.cloud.ZooKeeperException: 
	at org.apache.solr.core.CoreContainer.initZooKeeper(CoreContainer.java:185)
	at org.apache.solr.util.TestHarness$Initializer$1.<init>(TestHarness.java:209)
	at org.apache.solr.util.TestHarness$Initializer.initialize(TestHarness.java:204)
	at org.apache.solr.util.TestHarness.<init>(TestHarness.java:140)
Caused by: java.util.concurrent.TimeoutException: Could not connect to ZooKeeper 127.0.0.1:37682/solr
within 5000 ms
	at org.apache.solr.common.cloud.ConnectionManager.waitForConnected(ConnectionManager.java:124)
	at org.apache.solr.common.cloud.SolrZkClient.<init>(SolrZkClient.java:121)
	at org.apache.solr.common.cloud.SolrZkClient.<init>(SolrZkClient.java:69)
	at org.apache.solr.cloud.ZkController.<init>(ZkController.java:104)
	at org.apache.solr.core.CoreContainer.initZooKeeper(CoreContainer.java:166)


FAILED:  junit.framework.TestSuite.org.apache.solr.spelling.suggest.SuggesterTSTTest

Error Message:
org.apache.solr.common.cloud.ZooKeeperException: 

Stack Trace:
java.lang.RuntimeException: org.apache.solr.common.cloud.ZooKeeperException: 
	at org.apache.solr.util.TestHarness.<init>(TestHarness.java:152)
	at org.apache.solr.util.TestHarness.<init>(TestHarness.java:135)
	at org.apache.solr.util.TestHarness.<init>(TestHarness.java:125)
	at org.apache.solr.SolrTestCaseJ4.initCore(SolrTestCaseJ4.java:245)
	at org.apache.solr.SolrTestCaseJ4.initCore(SolrTestCaseJ4.java:103)
	at org.apache.solr.SolrTestCaseJ4.initCore(SolrTestCaseJ4.java:92)
	at org.apache.solr.spelling.suggest.SuggesterTest.beforeClass(SuggesterTest.java:36)
Caused by: org.apache.solr.common.cloud.ZooKeeperException: 
	at org.apache.solr.core.CoreContainer.initZooKeeper(CoreContainer.java:185)
	at org.apache.solr.util.TestHarness$Initializer$1.<init>(TestHarness.java:209)
	at org.apache.solr.util.TestHarness$Initializer.initialize(TestHarness.java:204)
	at org.apache.solr.util.TestHarness.<init>(TestHarness.java:140)
Caused by: java.util.concurrent.TimeoutException: Could not connect to ZooKeeper 127.0.0.1:37682/solr
within 5000 ms
	at org.apache.solr.common.cloud.ConnectionManager.waitForConnected(ConnectionManager.java:124)
	at org.apache.solr.common.cloud.SolrZkClient.<init>(SolrZkClient.java:121)
	at org.apache.solr.common.cloud.SolrZkClient.<init>(SolrZkClient.java:69)
	at org.apache.solr.cloud.ZkController.<init>(ZkController.java:104)
	at org.apache.solr.core.CoreContainer.initZooKeeper(CoreContainer.java:166)


REGRESSION:  org.apache.solr.update.processor.UpdateRequestProcessorFactoryTest.testConfiguration

Error Message:
org.apache.solr.common.cloud.ZooKeeperException: 

Stack Trace:
java.lang.RuntimeException: org.apache.solr.common.cloud.ZooKeeperException: 
	at org.apache.solr.util.TestHarness.<init>(TestHarness.java:152)
	at org.apache.solr.util.TestHarness.<init>(TestHarness.java:135)
	at org.apache.solr.util.TestHarness.<init>(TestHarness.java:125)
	at org.apache.solr.util.AbstractSolrTestCase.setUp(AbstractSolrTestCase.java:143)
	at org.apache.lucene.util.LuceneTestCaseRunner.runChild(LuceneTestCaseRunner.java:149)
	at org.apache.lucene.util.LuceneTestCaseRunner.runChild(LuceneTestCaseRunner.java:51)
Caused by: org.apache.solr.common.cloud.ZooKeeperException: 
	at org.apache.solr.core.CoreContainer.initZooKeeper(CoreContainer.java:185)
	at org.apache.solr.util.TestHarness$Initializer$1.<init>(TestHarness.java:209)
	at org.apache.solr.util.TestHarness$Initializer.initialize(TestHarness.java:204)
	at org.apache.solr.util.TestHarness.<init>(TestHarness.java:140)
Caused by: java.util.concurrent.TimeoutException: Could not connect to ZooKeeper 127.0.0.1:37682/solr
within 5000 ms
	at org.apache.solr.common.cloud.ConnectionManager.waitForConnected(ConnectionManager.java:124)
	at org.apache.solr.common.cloud.SolrZkClient.<init>(SolrZkClient.java:121)
	at org.apache.solr.common.cloud.SolrZkClient.<init>(SolrZkClient.java:69)
	at org.apache.solr.cloud.ZkController.<init>(ZkController.java:104)
	at org.apache.solr.core.CoreContainer.initZooKeeper(CoreContainer.java:166)




Build Log (for compile errors):
[...truncated 9475 lines...]



---------------------------------------------------------------------
To unsubscribe, e-mail: dev-unsubscribe@lucene.apache.org
For additional commands, e-mail: dev-help@lucene.apache.org


Mime
View raw message