lucene-dev mailing list archives

Site index · List index
Message view « Date » · « Thread »
Top « Date » · « Thread »
From Apache Jenkins Server <jenk...@builds.apache.org>
Subject [JENKINS] Lucene-Solr-tests-only-trunk-java7 - Build # 909 - Failure
Date Fri, 11 Nov 2011 18:07:10 GMT
Build: https://builds.apache.org/job/Lucene-Solr-tests-only-trunk-java7/909/

1 tests failed.
REGRESSION:  org.apache.solr.search.TestRealTimeGet.testStressGetRealtime

Error Message:
java.lang.AssertionError: Some threads threw uncaught exceptions!

Stack Trace:
java.lang.RuntimeException: java.lang.AssertionError: Some threads threw uncaught exceptions!
	at org.apache.lucene.util.LuceneTestCase.tearDown(LuceneTestCase.java:662)
	at org.apache.solr.SolrTestCaseJ4.tearDown(SolrTestCaseJ4.java:86)
	at org.apache.lucene.util.LuceneTestCaseRunner.runChild(LuceneTestCaseRunner.java:149)
	at org.apache.lucene.util.LuceneTestCaseRunner.runChild(LuceneTestCaseRunner.java:51)
	at org.apache.lucene.util.LuceneTestCase.checkUncaughtExceptionsAfter(LuceneTestCase.java:690)
	at org.apache.lucene.util.LuceneTestCase.tearDown(LuceneTestCase.java:634)




Build Log (for compile errors):
[...truncated 11590 lines...]



---------------------------------------------------------------------
To unsubscribe, e-mail: dev-unsubscribe@lucene.apache.org
For additional commands, e-mail: dev-help@lucene.apache.org


Mime
View raw message