lucene-dev mailing list archives

Site index · List index
Message view « Date » · « Thread »
Top « Date » · « Thread »
From Apache Jenkins Server <jenk...@builds.apache.org>
Subject [JENKINS] Lucene-trunk - Build # 1721 - Still Failing
Date Sat, 05 Nov 2011 04:04:25 GMT
Build: https://builds.apache.org/job/Lucene-trunk/1721/

1 tests failed.
FAILED:  org.apache.lucene.index.TestNRTManager.testNRTManager

Error Message:
java.lang.AssertionError: Some threads threw uncaught exceptions!

Stack Trace:
java.lang.RuntimeException: java.lang.AssertionError: Some threads threw uncaught exceptions!
	at org.apache.lucene.util.LuceneTestCase.tearDown(LuceneTestCase.java:637)
	at org.apache.lucene.util.LuceneTestCaseRunner.runChild(LuceneTestCaseRunner.java:149)
	at org.apache.lucene.util.LuceneTestCaseRunner.runChild(LuceneTestCaseRunner.java:51)
	at org.apache.lucene.util.LuceneTestCase.checkUncaughtExceptionsAfter(LuceneTestCase.java:665)
	at org.apache.lucene.util.LuceneTestCase.tearDown(LuceneTestCase.java:609)




Build Log (for compile errors):
[...truncated 14351 lines...]



---------------------------------------------------------------------
To unsubscribe, e-mail: dev-unsubscribe@lucene.apache.org
For additional commands, e-mail: dev-help@lucene.apache.org


Mime
View raw message