lucene-dev mailing list archives

Site index · List index
Message view « Date » · « Thread »
Top « Date » · « Thread »
From "Mark Miller (Commented) (JIRA)" <j...@apache.org>
Subject [jira] [Commented] (SOLR-2158) TestDistributedSearch.testDistribSearch fails often
Date Thu, 03 Nov 2011 20:23:32 GMT

    [ https://issues.apache.org/jira/browse/SOLR-2158?page=com.atlassian.jira.plugin.system.issuetabpanels:comment-tabpanel&focusedCommentId=13143506#comment-13143506
] 

Mark Miller commented on SOLR-2158:
-----------------------------------

I've seen this more than once:
{noformat}
  [junit] Testsuite: org.apache.solr.TestDistributedSearch
    [junit] Testcase: testDistribSearch(org.apache.solr.TestDistributedSearch):	FAILED
    [junit] .response.numFound:58!=67
    [junit] junit.framework.AssertionFailedError: .response.numFound:58!=67
    [junit] 	at org.apache.solr.BaseDistributedSearchTestCase.compareResponses(BaseDistributedSearchTestCase.java:584)
    [junit] 	at org.apache.solr.BaseDistributedSearchTestCase.query(BaseDistributedSearchTestCase.java:337)
    [junit] 	at org.apache.solr.TestDistributedSearch.doTest(TestDistributedSearch.java:109)
    [junit] 	at org.apache.solr.BaseDistributedSearchTestCase.testDistribSearch(BaseDistributedSearchTestCase.java:599)
    [junit] 	at org.apache.lucene.util.LuceneTestCase$2$1.evaluate(LuceneTestCase.java:615)
    [junit] 	at org.apache.lucene.util.LuceneTestCaseRunner.runChild(LuceneTestCaseRunner.java:149)
    [junit] 	at org.apache.lucene.util.LuceneTestCaseRunner.runChild(LuceneTestCaseRunner.java:51)
    [junit] Testcase: testDistribSearch(org.apache.solr.TestDistributedSearch):	Caused an
ERROR
    [junit] java.lang.AssertionError: Some threads threw uncaught exceptions!
    [junit] java.lang.RuntimeException: java.lang.AssertionError: Some threads threw uncaught
exceptions!
    [junit] 	at org.apache.lucene.util.LuceneTestCase.tearDown(LuceneTestCase.java:744)
    [junit] 	at org.apache.solr.SolrTestCaseJ4.tearDown(SolrTestCaseJ4.java:86)
    [junit] 	at org.apache.solr.BaseDistributedSearchTestCase.tearDown(BaseDistributedSearchTestCase.java:173)
    [junit] 	at org.apache.lucene.util.LuceneTestCaseRunner.runChild(LuceneTestCaseRunner.java:149)
    [junit] 	at org.apache.lucene.util.LuceneTestCaseRunner.runChild(LuceneTestCaseRunner.java:51)
    [junit] Caused by: java.lang.AssertionError: Some threads threw uncaught exceptions!
    [junit] 	at org.apache.lucene.util.LuceneTestCase.checkUncaughtExceptionsAfter(LuceneTestCase.java:772)
    [junit] 	at org.apache.lucene.util.LuceneTestCase.tearDown(LuceneTestCase.java:716)
    [junit] Tests run: 1, Failures: 1, Errors: 1, Time elapsed: 157.228 sec
    [junit] ------------- Standard Error -----------------
    [junit] NOTE: reproduce with: ant test -Dtestcase=TestDistributedSearch -Dtestmethod=testDistribSearch
-Dtests.seed=-51a71405e31cb62:-11d5dbadc4630d55:-701e7bb491d0926f
    [junit] The following exceptions were thrown by threads:
    [junit] *** Thread: Thread-418 ***
    [junit] junit.framework.AssertionFailedError: .response.numFound:59!=67
    [junit] 	at junit.framework.Assert.fail(Assert.java:47)
    [junit] 	at org.apache.solr.BaseDistributedSearchTestCase.compareResponses(BaseDistributedSearchTestCase.java:584)
    [junit] 	at org.apache.solr.BaseDistributedSearchTestCase$5.run(BaseDistributedSearchTestCase.java:352)
    [junit] NOTE: reproduce with: ant test -Dtestcase=TestDistributedSearch -Dtestmethod=testDistribSearch
-Dtests.seed=-51a71405e31cb62:-11d5dbadc4630d55:-701e7bb491d0926f
{noformat}
                
> TestDistributedSearch.testDistribSearch fails often
> ---------------------------------------------------
>
>                 Key: SOLR-2158
>                 URL: https://issues.apache.org/jira/browse/SOLR-2158
>             Project: Solr
>          Issue Type: Bug
>          Components: Build
>    Affects Versions: 3.1, 4.0
>         Environment: Hudson
>            Reporter: Robert Muir
>             Fix For: 3.1, 4.0
>
>         Attachments: TEST-org.apache.solr.TestDistributedSearch.txt
>
>
> TestDistributedSearch.testDistribSearch fails often in hudson, with some threads throwing
uncaught exceptions.

--
This message is automatically generated by JIRA.
If you think it was sent incorrectly, please contact your JIRA administrators: https://issues.apache.org/jira/secure/ContactAdministrators!default.jspa
For more information on JIRA, see: http://www.atlassian.com/software/jira

        

---------------------------------------------------------------------
To unsubscribe, e-mail: dev-unsubscribe@lucene.apache.org
For additional commands, e-mail: dev-help@lucene.apache.org


Mime
View raw message