lucene-dev mailing list archives

Site index · List index
Message view « Date » · « Thread »
Top « Date » · « Thread »
From Apache Jenkins Server <jenk...@builds.apache.org>
Subject [JENKINS] Lucene-Solr-tests-only-trunk-java7 - Build # 971 - Failure
Date Thu, 17 Nov 2011 08:59:42 GMT
Build: https://builds.apache.org/job/Lucene-Solr-tests-only-trunk-java7/971/

1 tests failed.
REGRESSION:  org.apache.solr.client.solrj.embedded.LargeVolumeJettyTest.testMultiThreaded

Error Message:
java.lang.AssertionError: Some threads threw uncaught exceptions!

Stack Trace:
java.lang.RuntimeException: java.lang.AssertionError: Some threads threw uncaught exceptions!
	at org.apache.lucene.util.LuceneTestCase.tearDown(LuceneTestCase.java:652)
	at org.apache.solr.SolrTestCaseJ4.tearDown(SolrTestCaseJ4.java:86)
	at org.apache.lucene.util.LuceneTestCaseRunner.runChild(LuceneTestCaseRunner.java:149)
	at org.apache.lucene.util.LuceneTestCaseRunner.runChild(LuceneTestCaseRunner.java:51)
	at org.apache.lucene.util.LuceneTestCase.checkUncaughtExceptionsAfter(LuceneTestCase.java:680)
	at org.apache.lucene.util.LuceneTestCase.tearDown(LuceneTestCase.java:624)




Build Log (for compile errors):
[...truncated 11854 lines...]



---------------------------------------------------------------------
To unsubscribe, e-mail: dev-unsubscribe@lucene.apache.org
For additional commands, e-mail: dev-help@lucene.apache.org


Mime
View raw message