lucene-dev mailing list archives

Site index · List index
Message view « Date » · « Thread »
Top « Date » · « Thread »
From "selckin (Created) (JIRA)" <j...@apache.org>
Subject [jira] [Created] (SOLR-2868) DistributedTermsComponentTest.testDistribSearch test failure
Date Tue, 01 Nov 2011 13:12:32 GMT
DistributedTermsComponentTest.testDistribSearch test failure
------------------------------------------------------------

                 Key: SOLR-2868
                 URL: https://issues.apache.org/jira/browse/SOLR-2868
             Project: Solr
          Issue Type: Bug
            Reporter: selckin


with trunk r1195315, can't seem to reproduce tho
{code}
    [junit] Testsuite: org.apache.solr.handler.component.DistributedTermsComponentTest
    [junit] Testcase: testDistribSearch(org.apache.solr.handler.component.DistributedTermsComponentTest):
      FAILED
    [junit] .terms.b_t.shark!=seal (unordered or missing)
    [junit] junit.framework.AssertionFailedError: .terms.b_t.shark!=seal (unordered or missing)
    [junit]     at org.apache.solr.BaseDistributedSearchTestCase.compareResponses(BaseDistributedSearchTestCase.java:584)
    [junit]     at org.apache.solr.BaseDistributedSearchTestCase.query(BaseDistributedSearchTestCase.java:337)
    [junit]     at org.apache.solr.handler.component.DistributedTermsComponentTest.doTest(DistributedTermsComponentTest.java:50)
    [junit]     at org.apache.solr.BaseDistributedSearchTestCase.testDistribSearch(BaseDistributedSearchTestCase.java:599)
    [junit]     at org.apache.lucene.util.LuceneTestCase$2$1.evaluate(LuceneTestCase.java:615)
    [junit]     at org.apache.lucene.util.LuceneTestCaseRunner.runChild(LuceneTestCaseRunner.java:149)
    [junit]     at org.apache.lucene.util.LuceneTestCaseRunner.runChild(LuceneTestCaseRunner.java:51)
    [junit] 
    [junit] 
    [junit] Testcase: testDistribSearch(org.apache.solr.handler.component.DistributedTermsComponentTest):
      Caused an ERROR
    [junit] java.lang.AssertionError: Some threads threw uncaught exceptions!
    [junit] java.lang.RuntimeException: java.lang.AssertionError: Some threads threw uncaught
exceptions!
    [junit]     at org.apache.lucene.util.LuceneTestCase.tearDown(LuceneTestCase.java:744)
    [junit]     at org.apache.solr.SolrTestCaseJ4.tearDown(SolrTestCaseJ4.java:89)
    [junit]     at org.apache.solr.BaseDistributedSearchTestCase.tearDown(BaseDistributedSearchTestCase.java:174)
    [junit]     at org.apache.lucene.util.LuceneTestCaseRunner.runChild(LuceneTestCaseRunner.java:149)
    [junit]     at org.apache.lucene.util.LuceneTestCaseRunner.runChild(LuceneTestCaseRunner.java:51)
    [junit] Caused by: java.lang.AssertionError: Some threads threw uncaught exceptions!
    [junit]     at org.apache.lucene.util.LuceneTestCase.checkUncaughtExceptionsAfter(LuceneTestCase.java:772)
    [junit]     at org.apache.lucene.util.LuceneTestCase.tearDown(LuceneTestCase.java:716)
    [junit] 
    [junit] 
    [junit] Tests run: 1, Failures: 1, Errors: 1, Time elapsed: 24.024 sec
    [junit] 
    [junit] ------------- Standard Error -----------------
    [junit] NOTE: reproduce with: ant test -Dtestcase=DistributedTermsComponentTest -Dtestmethod=testDistribSearch
-Dtests.seed=-2fae3bdefcfc15e0:209f37d06090a0dc:-283258d1420ef22c
    [junit] The following exceptions were thrown by threads:
    [junit] *** Thread: Thread-684 ***
    [junit] junit.framework.AssertionFailedError: .terms.b_t.spider:6!=5
    [junit]     at junit.framework.Assert.fail(Assert.java:47)
    [junit]     at org.apache.solr.BaseDistributedSearchTestCase.compareResponses(BaseDistributedSearchTestCase.java:584)
    [junit]     at org.apache.solr.BaseDistributedSearchTestCase$5.run(BaseDistributedSearchTestCase.java:352)
    [junit] *** Thread: Thread-685 ***
    [junit] junit.framework.AssertionFailedError: .terms.b_t.spider:6!=5
    [junit]     at junit.framework.Assert.fail(Assert.java:47)
    [junit]     at org.apache.solr.BaseDistributedSearchTestCase.compareResponses(BaseDistributedSearchTestCase.java:584)
    [junit]     at org.apache.solr.BaseDistributedSearchTestCase$5.run(BaseDistributedSearchTestCase.java:352)
    [junit] NOTE: reproduce with: ant test -Dtestcase=DistributedTermsComponentTest -Dtestmethod=testDistribSearch
-Dtests.seed=-2fae3bdefcfc15e0:209f37d06090a0dc:-283258d1420ef22c
    [junit] WARNING: test class left thread running: Thread[pool-192-thread-1,5,main]
    [junit] WARNING: test class left thread running: Thread[pool-213-thread-1,5,main]
    [junit] WARNING: test class left thread running: Thread[pool-213-thread-2,5,main]
    [junit] WARNING: test class left thread running: Thread[pool-213-thread-3,5,main]
    [junit] WARNING: test class left thread running: Thread[pool-213-thread-4,5,main]
    [junit] WARNING: test class left thread running: Thread[pool-213-thread-5,5,main]
    [junit] WARNING: test class left thread running: Thread[pool-213-thread-6,5,main]
    [junit] WARNING: test class left thread running: Thread[pool-225-thread-1,5,main]
    [junit] WARNING: test class left thread running: Thread[pool-225-thread-2,5,main]
    [junit] WARNING: test class left thread running: Thread[pool-225-thread-3,5,main]
    [junit] WARNING: test class left thread running: Thread[pool-225-thread-4,5,main]
    [junit] WARNING: test class left thread running: Thread[pool-225-thread-5,5,main]
    [junit] WARNING: test class left thread running: Thread[pool-225-thread-6,5,main]
    [junit] RESOURCE LEAK: test class left 13 thread(s) running
    [junit] NOTE: test params are: codec=RandomCodecProvider: {timestamp=MockVariableIntBlock(baseBlockSize=26),
range_facet_l=Memory, id=Standard(minBlockSize=100 maxBlockSize=206), range_facet_sl=MockRandom,
text=MockRandom, range_facet_si=Pulsing(freqCutoff=11 minBlockSize=67 maxBlockSize=205), multiDefault=Pulsing(freqCutoff=11
minBlockSize=67 maxBlockSize=205), b_t=MockFixedIntBlock(blockSize=1655), intDefault=MockVariableIntBlock(baseBlockSize=26)},
sim=RandomSimilarityProvider(queryNorm=true,coord=false): {}, locale=lv_LV, timezone=America/Mazatlan
    [junit] NOTE: all tests run in this JVM:
    [junit] [TestDistributedSearch, TestJoin, LengthFilterTest, TestBrazilianStemFilterFactory,
TestCJKTokenizerFactory, TestChineseTokenizerFactory, TestFinnishLightStemFilterFactory, TestGermanStemFilterFactory,
TestHindiFilters, TestLatvianStemFilterFactory, TestStemmerOverrideFilterFactory, TestCodecProviderSupport,
TestJmxIntegration, TestJmxMonitoredMap, XsltUpdateRequestHandlerTest, SystemInfoHandlerTest,
DistributedTermsComponentTest]
    [junit] NOTE: Linux 3.0.6-gentoo amd64/Sun Microsystems Inc. 1.6.0_27 (64-bit)/cpus=8,threads=15,free=80766496,total=135856128
{code}

--
This message is automatically generated by JIRA.
If you think it was sent incorrectly, please contact your JIRA administrators: https://issues.apache.org/jira/secure/ContactAdministrators!default.jspa
For more information on JIRA, see: http://www.atlassian.com/software/jira

        

---------------------------------------------------------------------
To unsubscribe, e-mail: dev-unsubscribe@lucene.apache.org
For additional commands, e-mail: dev-help@lucene.apache.org


Mime
View raw message