lucene-dev mailing list archives

Site index · List index
Message view « Date » · « Thread »
Top « Date » · « Thread »
From Michael McCandless <luc...@mikemccandless.com>
Subject Re: [JENKINS] Lucene-trunk - Build # 1699 - Still Failing
Date Fri, 14 Oct 2011 12:39:00 GMT
This test is just missing the cool new @UseNoMemoryExpensiveCodec -- I
committed.

Mike McCandless

http://blog.mikemccandless.com

On Thu, Oct 13, 2011 at 11:44 PM, Apache Jenkins Server
<jenkins@builds.apache.org> wrote:
> Build: https://builds.apache.org/job/Lucene-trunk/1699/
>
> 1 tests failed.
> REGRESSION:  org.apache.lucene.index.TestNRTThreads.testNRTThreads
>
> Error Message:
> java.lang.AssertionError: Some threads threw uncaught exceptions!
>
> Stack Trace:
> java.lang.RuntimeException: java.lang.AssertionError: Some threads threw uncaught exceptions!
>        at org.apache.lucene.util.LuceneTestCase.tearDown(LuceneTestCase.java:739)
>        at org.apache.lucene.util.LuceneTestCaseRunner.runChild(LuceneTestCaseRunner.java:149)
>        at org.apache.lucene.util.LuceneTestCaseRunner.runChild(LuceneTestCaseRunner.java:51)
>        at org.apache.lucene.util.LuceneTestCase.checkUncaughtExceptionsAfter(LuceneTestCase.java:767)
>        at org.apache.lucene.util.LuceneTestCase.tearDown(LuceneTestCase.java:711)
>
>
>
>
> Build Log (for compile errors):
> [...truncated 13441 lines...]
>
>
>
> ---------------------------------------------------------------------
> To unsubscribe, e-mail: dev-unsubscribe@lucene.apache.org
> For additional commands, e-mail: dev-help@lucene.apache.org
>
>

---------------------------------------------------------------------
To unsubscribe, e-mail: dev-unsubscribe@lucene.apache.org
For additional commands, e-mail: dev-help@lucene.apache.org


Mime
View raw message