lucene-dev mailing list archives

Site index · List index
Message view « Date » · « Thread »
Top « Date » · « Thread »
From Apache Jenkins Server <jenk...@builds.apache.org>
Subject [JENKINS] Lucene-Solr-tests-only-3.x-java7 - Build # 741 - Failure
Date Wed, 26 Oct 2011 07:30:02 GMT
Build: https://builds.apache.org/job/Lucene-Solr-tests-only-3.x-java7/741/

1 tests failed.
REGRESSION:  org.apache.solr.handler.component.DistributedTermsComponentTest.testDistribSearch

Error Message:
java.lang.AssertionError: Some threads threw uncaught exceptions!

Stack Trace:
java.lang.RuntimeException: java.lang.AssertionError: Some threads threw uncaught exceptions!
	at org.apache.lucene.util.LuceneTestCase.tearDown(LuceneTestCase.java:577)
	at org.apache.solr.SolrTestCaseJ4.tearDown(SolrTestCaseJ4.java:96)
	at org.apache.solr.BaseDistributedSearchTestCase.tearDown(BaseDistributedSearchTestCase.java:160)
	at org.apache.lucene.util.LuceneTestCaseRunner.runChild(LuceneTestCaseRunner.java:147)
	at org.apache.lucene.util.LuceneTestCaseRunner.runChild(LuceneTestCaseRunner.java:50)
	at org.apache.lucene.util.LuceneTestCase.checkUncaughtExceptionsAfter(LuceneTestCase.java:605)
	at org.apache.lucene.util.LuceneTestCase.tearDown(LuceneTestCase.java:549)




Build Log (for compile errors):
[...truncated 14071 lines...]



---------------------------------------------------------------------
To unsubscribe, e-mail: dev-unsubscribe@lucene.apache.org
For additional commands, e-mail: dev-help@lucene.apache.org


Mime
View raw message