lucene-dev mailing list archives

Site index · List index
Message view « Date » · « Thread »
Top « Date » · « Thread »
From Apache Jenkins Server <jenk...@builds.apache.org>
Subject [JENKINS] Lucene-Solr-tests-only-trunk-java7 - Build # 665 - Failure
Date Wed, 19 Oct 2011 10:18:28 GMT
Build: https://builds.apache.org/job/Lucene-Solr-tests-only-trunk-java7/665/

1 tests failed.
REGRESSION:  org.apache.solr.search.TestRealTimeGet.testStressGetRealtime

Error Message:
java.lang.AssertionError: Some threads threw uncaught exceptions!

Stack Trace:
java.lang.RuntimeException: java.lang.AssertionError: Some threads threw uncaught exceptions!
	at org.apache.lucene.util.LuceneTestCase.tearDown(LuceneTestCase.java:739)
	at org.apache.solr.SolrTestCaseJ4.tearDown(SolrTestCaseJ4.java:89)
	at org.apache.lucene.util.LuceneTestCaseRunner.runChild(LuceneTestCaseRunner.java:149)
	at org.apache.lucene.util.LuceneTestCaseRunner.runChild(LuceneTestCaseRunner.java:51)
	at org.apache.lucene.util.LuceneTestCase.checkUncaughtExceptionsAfter(LuceneTestCase.java:767)
	at org.apache.lucene.util.LuceneTestCase.tearDown(LuceneTestCase.java:711)




Build Log (for compile errors):
[...truncated 11114 lines...]



---------------------------------------------------------------------
To unsubscribe, e-mail: dev-unsubscribe@lucene.apache.org
For additional commands, e-mail: dev-help@lucene.apache.org


Mime
View raw message