lucene-dev mailing list archives

Site index · List index
Message view « Date » · « Thread »
Top « Date » · « Thread »
From Apache Jenkins Server <jenk...@builds.apache.org>
Subject [JENKINS] Lucene-Solr-tests-only-trunk - Build # 11096 - Failure
Date Mon, 31 Oct 2011 19:46:56 GMT
Build: https://builds.apache.org/job/Lucene-Solr-tests-only-trunk/11096/

1 tests failed.
REGRESSION:  org.apache.solr.search.TestRealTimeGet.testStressGetRealtime

Error Message:
java.lang.AssertionError: Some threads threw uncaught exceptions!

Stack Trace:
java.lang.RuntimeException: java.lang.AssertionError: Some threads threw uncaught exceptions!
	at org.apache.lucene.util.LuceneTestCase.tearDown(LuceneTestCase.java:744)
	at org.apache.solr.SolrTestCaseJ4.tearDown(SolrTestCaseJ4.java:89)
	at org.apache.lucene.util.LuceneTestCaseRunner.runChild(LuceneTestCaseRunner.java:149)
	at org.apache.lucene.util.LuceneTestCaseRunner.runChild(LuceneTestCaseRunner.java:51)
	at org.apache.lucene.util.LuceneTestCase.checkUncaughtExceptionsAfter(LuceneTestCase.java:772)
	at org.apache.lucene.util.LuceneTestCase.tearDown(LuceneTestCase.java:716)




Build Log (for compile errors):
[...truncated 8134 lines...]



---------------------------------------------------------------------
To unsubscribe, e-mail: dev-unsubscribe@lucene.apache.org
For additional commands, e-mail: dev-help@lucene.apache.org


Mime
View raw message